{"text_format":"1","workbook":"xlsx","n_sheets":4,"sheets":["BGA_Pins","Layout","Original","Help"],"not_rendered":{"charts":0,"images":2,"macros":1,"external_links":0,"defined_names":6,"comments":1,"pivot_tables":0},"unopened":[],"bounds":{"document_bytes":16777216,"sheet_cells":100000,"rows_first":2000,"rows_last":500,"rows_between":2000,"halvings":0,"cell_chars":16384,"cell_head_chars":4096},"cells_cut":0,"cells_raw":0,"read":"whole","date_system":"1900"}

{"sheet":"BGA_Pins","index":0,"n_rows":148,"n_cols":42,"rows_kept":148,"cut":false,"hidden":false,"merged":[]}
["Rev G",null,null,null,null,null,null,null,null,null,null,null,null,null,null,null,null,null,null,null,null,null,null,null,null,null,null,null,null,null,null,null,null,null,null,null,null,null,"Table5"]
[null,null,"Table1"]
[null,null,"Pin","Name","InOut","Level","Func","Reps","Bnk","Seq",null,null,"Name","Pin01","Pin02","Pin03","Pin04","Pin05","Pin06","Pin07","Pin08","Pin09","Pin10","Pin11","Pin12","Pin13","Pin14","Pin15","Pin16","Pin17","Pin18","Pin19","Pin20","Pin21","Pin22","Pin23","Pin24","Pin25","Pin","InOut","Level","Func"]
[null,null,"A1","ADC1","I","Analog","Analog-to-digitalconverterinput1.",{"$f":"COUNTIF(INDEX([Name],1):Table1[[#This Row],[Name]],[Name])","v":1},{"$f":"IF(ISTEXT([Pin]),[Seq],INDEX([Bnk],[Seq]-1))","v":1},1,null,null,"ADC0",{"$f":"IFERROR(INDEX(Table1[Pin],1/(1/SUMPRODUCT((Table1[Reps]=RIGHT(INDEX(Table5[#Headers],coln),2)*1)*(Table1[Name]=Table5[[#This Row],[Name]])*Table1[Bnk]))),\"\")","v":"B1"},{"$f":"IFERROR(INDEX(Table1[Pin],1/(1/SUMPRODUCT((Table1[Reps]=RIGHT(INDEX(Table5[#Headers],coln),2)*1)*(Table1[Name]=Table5[[#This Row],[Name]])*Table1[Bnk]))),\"\")","v":""},{"$f":"IFERROR(INDEX(Table1[Pin],1/(1/SUMPRODUCT((Table1[Reps]=RIGHT(INDEX(Table5[#Headers],coln),2)*1)*(Table1[Name]=Table5[[#This Row],[Name]])*Table1[Bnk]))),\"\")","v":""},{"$f":"IFERROR(INDEX(Table1[Pin],1/(1/SUMPRODUCT((Table1[Reps]=RIGHT(INDEX(Table5[#Headers],coln),2)*1)*(Table1[Name]=Table5[[#This Row],[Name]])*Table1[Bnk]))),\"\")","v":""},{"$f":"IFERROR(INDEX(Table1[Pin],1/(1/SUMPRODUCT((Table1[Reps]=RIGHT(INDEX(Table5[#Headers],coln),2)*1)*(Table1[Name]=Table5[[#This Row],[Name]])*Table1[Bnk]))),\"\")","v":""},{"$f":"IFERROR(INDEX(Table1[Pin],1/(1/SUMPRODUCT((Table1[Reps]=RIGHT(INDEX(Table5[#Headers],coln),2)*1)*(Table1[Name]=Table5[[#This Row],[Name]])*Table1[Bnk]))),\"\")","v":""},{"$f":"IFERROR(INDEX(Table1[Pin],1/(1/SUMPRODUCT((Table1[Reps]=RIGHT(INDEX(Table5[#Headers],coln),2)*1)*(Table1[Name]=Table5[[#This Row],[Name]])*Table1[Bnk]))),\"\")","v":""},{"$f":"IFERROR(INDEX(Table1[Pin],1/(1/SUMPRODUCT((Table1[Reps]=RIGHT(INDEX(Table5[#Headers],coln),2)*1)*(Table1[Name]=Table5[[#This Row],[Name]])*Table1[Bnk]))),\"\")","v":""},{"$f":"IFERROR(INDEX(Table1[Pin],1/(1/SUMPRODUCT((Table1[Reps]=RIGHT(INDEX(Table5[#Headers],coln),2)*1)*(Table1[Name]=Table5[[#This Row],[Name]])*Table1[Bnk]))),\"\")","v":""},{"$f":"IFERROR(INDEX(Table1[Pin],1/(1/SUMPRODUCT((Table1[Reps]=RIGHT(INDEX(Table5[#Headers],coln),2)*1)*(Table1[Name]=Table5[[#This Row],[Name]])*Table1[Bnk]))),\"\")","v":""},{"$f":"IFERROR(INDEX(Table1[Pin],1/(1/SUMPRODUCT((Table1[Reps]=RIGHT(INDEX(Table5[#Headers],coln),2)*1)*(Table1[Name]=Table5[[#This Row],[Name]])*Table1[Bnk]))),\"\")","v":""},{"$f":"IFERROR(INDEX(Table1[Pin],1/(1/SUMPRODUCT((Table1[Reps]=RIGHT(INDEX(Table5[#Headers],coln),2)*1)*(Table1[Name]=Table5[[#This Row],[Name]])*Table1[Bnk]))),\"\")","v":""},{"$f":"IFERROR(INDEX(Table1[Pin],1/(1/SUMPRODUCT((Table1[Reps]=RIGHT(INDEX(Table5[#Headers],coln),2)*1)*(Table1[Name]=Table5[[#This Row],[Name]])*Table1[Bnk]))),\"\")","v":""},{"$f":"[Pin01]","v":"B1"},{"$f":"CONCATENATE([Pin14],IF([Pin02]=\"\",\"\",\", \"&[Pin02]))","v":"B1"},{"$f":"CONCATENATE([Pin15],IF([Pin03]=\"\",\"\",\", \"&[Pin03]))","v":"B1"},{"$f":"CONCATENATE([Pin16],IF([Pin04]=\"\",\"\",\", \"&[Pin04]))","v":"B1"},{"$f":"CONCATENATE([Pin17],IF([Pin05]=\"\",\"\",\", \"&[Pin05]))","v":"B1"},{"$f":"CONCATENATE([Pin18],IF([Pin06]=\"\",\"\",\", \"&[Pin06]))","v":"B1"},{"$f":"CONCATENATE([Pin19],IF([Pin07]=\"\",\"\",\", \"&[Pin07]))","v":"B1"},{"$f":"CONCATENATE([Pin20],IF([Pin08]=\"\",\"\",\", \"&[Pin08]))","v":"B1"},{"$f":"CONCATENATE([Pin21],IF([Pin09]=\"\",\"\",\", \"&[Pin09]))","v":"B1"},{"$f":"CONCATENATE([Pin22],IF([Pin10]=\"\",\"\",\", \"&[Pin10]))","v":"B1"},{"$f":"CONCATENATE([Pin23],IF([Pin11]=\"\",\"\",\", \"&[Pin11]))","v":"B1"},{"$f":"CONCATENATE([Pin24],IF([Pin12]=\"\",\"\",\", \"&[Pin12]))","v":"B1"},{"$f":"CONCATENATE([Pin25],IF([Pin13]=\"\",\"\",\", \"&[Pin13]))","v":"B1"},{"$f":"IFERROR(INDEX(Table1[InOut],1/(1/SUMPRODUCT((Table1[Reps]=1)*(Table1[Name]=Table5[[#This Row],[Name]])*Table1[Seq]))),\"\")","v":"I"},{"$f":"IFERROR(INDEX(Table1[Level],1/(1/SUMPRODUCT((Table1[Reps]=1)*(Table1[Name]=Table5[[#This Row],[Name]])*Table1[Seq]))),\"\")","v":"Analog"},{"$f":"IFERROR(INDEX(Table1[Func],1/(1/SUMPRODUCT((Table1[Reps]=1)*(Table1[Name]=Table5[[#This Row],[Name]])*Table1[Seq]))),\"\")","v":"Analog-to-digitalconverterinput0."}]
[null,null,"A2","ADC4","I","Analog","Analog-to-digitalconverterinput4.",{"$f":"COUNTIF(INDEX([Name],1):Table1[[#This Row],[Name]],[Name])","v":1},{"$f":"IF(ISTEXT([Pin]),[Seq],INDEX([Bnk],[Seq]-1))","v":2},2,null,null,"ADC1",{"$f":"IFERROR(INDEX(Table1[Pin],1/(1/SUMPRODUCT((Table1[Reps]=RIGHT(INDEX(Table5[#Headers],coln),2)*1)*(Table1[Name]=Table5[[#This Row],[Name]])*Table1[Bnk]))),\"\")","v":"A1"},{"$f":"IFERROR(INDEX(Table1[Pin],1/(1/SUMPRODUCT((Table1[Reps]=RIGHT(INDEX(Table5[#Headers],coln),2)*1)*(Table1[Name]=Table5[[#This Row],[Name]])*Table1[Bnk]))),\"\")","v":""},{"$f":"IFERROR(INDEX(Table1[Pin],1/(1/SUMPRODUCT((Table1[Reps]=RIGHT(INDEX(Table5[#Headers],coln),2)*1)*(Table1[Name]=Table5[[#This Row],[Name]])*Table1[Bnk]))),\"\")","v":""},{"$f":"IFERROR(INDEX(Table1[Pin],1/(1/SUMPRODUCT((Table1[Reps]=RIGHT(INDEX(Table5[#Headers],coln),2)*1)*(Table1[Name]=Table5[[#This Row],[Name]])*Table1[Bnk]))),\"\")","v":""},{"$f":"IFERROR(INDEX(Table1[Pin],1/(1/SUMPRODUCT((Table1[Reps]=RIGHT(INDEX(Table5[#Headers],coln),2)*1)*(Table1[Name]=Table5[[#This Row],[Name]])*Table1[Bnk]))),\"\")","v":""},{"$f":"IFERROR(INDEX(Table1[Pin],1/(1/SUMPRODUCT((Table1[Reps]=RIGHT(INDEX(Table5[#Headers],coln),2)*1)*(Table1[Name]=Table5[[#This Row],[Name]])*Table1[Bnk]))),\"\")","v":""},{"$f":"IFERROR(INDEX(Table1[Pin],1/(1/SUMPRODUCT((Table1[Reps]=RIGHT(INDEX(Table5[#Headers],coln),2)*1)*(Table1[Name]=Table5[[#This Row],[Name]])*Table1[Bnk]))),\"\")","v":""},{"$f":"IFERROR(INDEX(Table1[Pin],1/(1/SUMPRODUCT((Table1[Reps]=RIGHT(INDEX(Table5[#Headers],coln),2)*1)*(Table1[Name]=Table5[[#This Row],[Name]])*Table1[Bnk]))),\"\")","v":""},{"$f":"IFERROR(INDEX(Table1[Pin],1/(1/SUMPRODUCT((Table1[Reps]=RIGHT(INDEX(Table5[#Headers],coln),2)*1)*(Table1[Name]=Table5[[#This Row],[Name]])*Table1[Bnk]))),\"\")","v":""},{"$f":"IFERROR(INDEX(Table1[Pin],1/(1/SUMPRODUCT((Table1[Reps]=RIGHT(INDEX(Table5[#Headers],coln),2)*1)*(Table1[Name]=Table5[[#This Row],[Name]])*Table1[Bnk]))),\"\")","v":""},{"$f":"IFERROR(INDEX(Table1[Pin],1/(1/SUMPRODUCT((Table1[Reps]=RIGHT(INDEX(Table5[#Headers],coln),2)*1)*(Table1[Name]=Table5[[#This Row],[Name]])*Table1[Bnk]))),\"\")","v":""},{"$f":"IFERROR(INDEX(Table1[Pin],1/(1/SUMPRODUCT((Table1[Reps]=RIGHT(INDEX(Table5[#Headers],coln),2)*1)*(Table1[Name]=Table5[[#This Row],[Name]])*Table1[Bnk]))),\"\")","v":""},{"$f":"IFERROR(INDEX(Table1[Pin],1/(1/SUMPRODUCT((Table1[Reps]=RIGHT(INDEX(Table5[#Headers],coln),2)*1)*(Table1[Name]=Table5[[#This Row],[Name]])*Table1[Bnk]))),\"\")","v":""},{"$f":"[Pin01]","v":"A1"},{"$f":"CONCATENATE([Pin14],IF([Pin02]=\"\",\"\",\", \"&[Pin02]))","v":"A1"},{"$f":"CONCATENATE([Pin15],IF([Pin03]=\"\",\"\",\", \"&[Pin03]))","v":"A1"},{"$f":"CONCATENATE([Pin16],IF([Pin04]=\"\",\"\",\", \"&[Pin04]))","v":"A1"},{"$f":"CONCATENATE([Pin17],IF([Pin05]=\"\",\"\",\", \"&[Pin05]))","v":"A1"},{"$f":"CONCATENATE([Pin18],IF([Pin06]=\"\",\"\",\", \"&[Pin06]))","v":"A1"},{"$f":"CONCATENATE([Pin19],IF([Pin07]=\"\",\"\",\", \"&[Pin07]))","v":"A1"},{"$f":"CONCATENATE([Pin20],IF([Pin08]=\"\",\"\",\", \"&[Pin08]))","v":"A1"},{"$f":"CONCATENATE([Pin21],IF([Pin09]=\"\",\"\",\", \"&[Pin09]))","v":"A1"},{"$f":"CONCATENATE([Pin22],IF([Pin10]=\"\",\"\",\", \"&[Pin10]))","v":"A1"},{"$f":"CONCATENATE([Pin23],IF([Pin11]=\"\",\"\",\", \"&[Pin11]))","v":"A1"},{"$f":"CONCATENATE([Pin24],IF([Pin12]=\"\",\"\",\", \"&[Pin12]))","v":"A1"},{"$f":"CONCATENATE([Pin25],IF([Pin13]=\"\",\"\",\", \"&[Pin13]))","v":"A1"},{"$f":"IFERROR(INDEX(Table1[InOut],1/(1/SUMPRODUCT((Table1[Reps]=1)*(Table1[Name]=Table5[[#This Row],[Name]])*Table1[Seq]))),\"\")","v":"I"},{"$f":"IFERROR(INDEX(Table1[Level],1/(1/SUMPRODUCT((Table1[Reps]=1)*(Table1[Name]=Table5[[#This Row],[Name]])*Table1[Seq]))),\"\")","v":"Analog"},{"$f":"IFERROR(INDEX(Table1[Func],1/(1/SUMPRODUCT((Table1[Reps]=1)*(Table1[Name]=Table5[[#This Row],[Name]])*Table1[Seq]))),\"\")","v":"Analog-to-digitalconverterinput1."}]
[null,null,"A3","ADC5","I","Analog","Analog-to-digitalconverterinput5.",{"$f":"COUNTIF(INDEX([Name],1):Table1[[#This Row],[Name]],[Name])","v":1},{"$f":"IF(ISTEXT([Pin]),[Seq],INDEX([Bnk],[Seq]-1))","v":3},3,null,null,"ADC2",{"$f":"IFERROR(INDEX(Table1[Pin],1/(1/SUMPRODUCT((Table1[Reps]=RIGHT(INDEX(Table5[#Headers],coln),2)*1)*(Table1[Name]=Table5[[#This Row],[Name]])*Table1[Bnk]))),\"\")","v":"B3"},{"$f":"IFERROR(INDEX(Table1[Pin],1/(1/SUMPRODUCT((Table1[Reps]=RIGHT(INDEX(Table5[#Headers],coln),2)*1)*(Table1[Name]=Table5[[#This Row],[Name]])*Table1[Bnk]))),\"\")","v":""},{"$f":"IFERROR(INDEX(Table1[Pin],1/(1/SUMPRODUCT((Table1[Reps]=RIGHT(INDEX(Table5[#Headers],coln),2)*1)*(Table1[Name]=Table5[[#This Row],[Name]])*Table1[Bnk]))),\"\")","v":""},{"$f":"IFERROR(INDEX(Table1[Pin],1/(1/SUMPRODUCT((Table1[Reps]=RIGHT(INDEX(Table5[#Headers],coln),2)*1)*(Table1[Name]=Table5[[#This Row],[Name]])*Table1[Bnk]))),\"\")","v":""},{"$f":"IFERROR(INDEX(Table1[Pin],1/(1/SUMPRODUCT((Table1[Reps]=RIGHT(INDEX(Table5[#Headers],coln),2)*1)*(Table1[Name]=Table5[[#This Row],[Name]])*Table1[Bnk]))),\"\")","v":""},{"$f":"IFERROR(INDEX(Table1[Pin],1/(1/SUMPRODUCT((Table1[Reps]=RIGHT(INDEX(Table5[#Headers],coln),2)*1)*(Table1[Name]=Table5[[#This Row],[Name]])*Table1[Bnk]))),\"\")","v":""},{"$f":"IFERROR(INDEX(Table1[Pin],1/(1/SUMPRODUCT((Table1[Reps]=RIGHT(INDEX(Table5[#Headers],coln),2)*1)*(Table1[Name]=Table5[[#This Row],[Name]])*Table1[Bnk]))),\"\")","v":""},{"$f":"IFERROR(INDEX(Table1[Pin],1/(1/SUMPRODUCT((Table1[Reps]=RIGHT(INDEX(Table5[#Headers],coln),2)*1)*(Table1[Name]=Table5[[#This Row],[Name]])*Table1[Bnk]))),\"\")","v":""},{"$f":"IFERROR(INDEX(Table1[Pin],1/(1/SUMPRODUCT((Table1[Reps]=RIGHT(INDEX(Table5[#Headers],coln),2)*1)*(Table1[Name]=Table5[[#This Row],[Name]])*Table1[Bnk]))),\"\")","v":""},{"$f":"IFERROR(INDEX(Table1[Pin],1/(1/SUMPRODUCT((Table1[Reps]=RIGHT(INDEX(Table5[#Headers],coln),2)*1)*(Table1[Name]=Table5[[#This Row],[Name]])*Table1[Bnk]))),\"\")","v":""},{"$f":"IFERROR(INDEX(Table1[Pin],1/(1/SUMPRODUCT((Table1[Reps]=RIGHT(INDEX(Table5[#Headers],coln),2)*1)*(Table1[Name]=Table5[[#This Row],[Name]])*Table1[Bnk]))),\"\")","v":""},{"$f":"IFERROR(INDEX(Table1[Pin],1/(1/SUMPRODUCT((Table1[Reps]=RIGHT(INDEX(Table5[#Headers],coln),2)*1)*(Table1[Name]=Table5[[#This Row],[Name]])*Table1[Bnk]))),\"\")","v":""},{"$f":"IFERROR(INDEX(Table1[Pin],1/(1/SUMPRODUCT((Table1[Reps]=RIGHT(INDEX(Table5[#Headers],coln),2)*1)*(Table1[Name]=Table5[[#This Row],[Name]])*Table1[Bnk]))),\"\")","v":""},{"$f":"[Pin01]","v":"B3"},{"$f":"CONCATENATE([Pin14],IF([Pin02]=\"\",\"\",\", \"&[Pin02]))","v":"B3"},{"$f":"CONCATENATE([Pin15],IF([Pin03]=\"\",\"\",\", \"&[Pin03]))","v":"B3"},{"$f":"CONCATENATE([Pin16],IF([Pin04]=\"\",\"\",\", \"&[Pin04]))","v":"B3"},{"$f":"CONCATENATE([Pin17],IF([Pin05]=\"\",\"\",\", \"&[Pin05]))","v":"B3"},{"$f":"CONCATENATE([Pin18],IF([Pin06]=\"\",\"\",\", \"&[Pin06]))","v":"B3"},{"$f":"CONCATENATE([Pin19],IF([Pin07]=\"\",\"\",\", \"&[Pin07]))","v":"B3"},{"$f":"CONCATENATE([Pin20],IF([Pin08]=\"\",\"\",\", \"&[Pin08]))","v":"B3"},{"$f":"CONCATENATE([Pin21],IF([Pin09]=\"\",\"\",\", \"&[Pin09]))","v":"B3"},{"$f":"CONCATENATE([Pin22],IF([Pin10]=\"\",\"\",\", \"&[Pin10]))","v":"B3"},{"$f":"CONCATENATE([Pin23],IF([Pin11]=\"\",\"\",\", \"&[Pin11]))","v":"B3"},{"$f":"CONCATENATE([Pin24],IF([Pin12]=\"\",\"\",\", \"&[Pin12]))","v":"B3"},{"$f":"CONCATENATE([Pin25],IF([Pin13]=\"\",\"\",\", \"&[Pin13]))","v":"B3"},{"$f":"IFERROR(INDEX(Table1[InOut],1/(1/SUMPRODUCT((Table1[Reps]=1)*(Table1[Name]=Table5[[#This Row],[Name]])*Table1[Seq]))),\"\")","v":"I"},{"$f":"IFERROR(INDEX(Table1[Level],1/(1/SUMPRODUCT((Table1[Reps]=1)*(Table1[Name]=Table5[[#This Row],[Name]])*Table1[Seq]))),\"\")","v":"Analog"},{"$f":"IFERROR(INDEX(Table1[Func],1/(1/SUMPRODUCT((Table1[Reps]=1)*(Table1[Name]=Table5[[#This Row],[Name]])*Table1[Seq]))),\"\")","v":"Analog-to-digitalconverterinput2."}]
[null,null,"A4","ADC7","I","Analog","Analog-to-digitalconverterinput7.",{"$f":"COUNTIF(INDEX([Name],1):Table1[[#This Row],[Name]],[Name])","v":1},{"$f":"IF(ISTEXT([Pin]),[Seq],INDEX([Bnk],[Seq]-1))","v":4},4,null,null,"ADC3",{"$f":"IFERROR(INDEX(Table1[Pin],1/(1/SUMPRODUCT((Table1[Reps]=RIGHT(INDEX(Table5[#Headers],coln),2)*1)*(Table1[Name]=Table5[[#This Row],[Name]])*Table1[Bnk]))),\"\")","v":"B2"},{"$f":"IFERROR(INDEX(Table1[Pin],1/(1/SUMPRODUCT((Table1[Reps]=RIGHT(INDEX(Table5[#Headers],coln),2)*1)*(Table1[Name]=Table5[[#This Row],[Name]])*Table1[Bnk]))),\"\")","v":""},{"$f":"IFERROR(INDEX(Table1[Pin],1/(1/SUMPRODUCT((Table1[Reps]=RIGHT(INDEX(Table5[#Headers],coln),2)*1)*(Table1[Name]=Table5[[#This Row],[Name]])*Table1[Bnk]))),\"\")","v":""},{"$f":"IFERROR(INDEX(Table1[Pin],1/(1/SUMPRODUCT((Table1[Reps]=RIGHT(INDEX(Table5[#Headers],coln),2)*1)*(Table1[Name]=Table5[[#This Row],[Name]])*Table1[Bnk]))),\"\")","v":""},{"$f":"IFERROR(INDEX(Table1[Pin],1/(1/SUMPRODUCT((Table1[Reps]=RIGHT(INDEX(Table5[#Headers],coln),2)*1)*(Table1[Name]=Table5[[#This Row],[Name]])*Table1[Bnk]))),\"\")","v":""},{"$f":"IFERROR(INDEX(Table1[Pin],1/(1/SUMPRODUCT((Table1[Reps]=RIGHT(INDEX(Table5[#Headers],coln),2)*1)*(Table1[Name]=Table5[[#This Row],[Name]])*Table1[Bnk]))),\"\")","v":""},{"$f":"IFERROR(INDEX(Table1[Pin],1/(1/SUMPRODUCT((Table1[Reps]=RIGHT(INDEX(Table5[#Headers],coln),2)*1)*(Table1[Name]=Table5[[#This Row],[Name]])*Table1[Bnk]))),\"\")","v":""},{"$f":"IFERROR(INDEX(Table1[Pin],1/(1/SUMPRODUCT((Table1[Reps]=RIGHT(INDEX(Table5[#Headers],coln),2)*1)*(Table1[Name]=Table5[[#This Row],[Name]])*Table1[Bnk]))),\"\")","v":""},{"$f":"IFERROR(INDEX(Table1[Pin],1/(1/SUMPRODUCT((Table1[Reps]=RIGHT(INDEX(Table5[#Headers],coln),2)*1)*(Table1[Name]=Table5[[#This Row],[Name]])*Table1[Bnk]))),\"\")","v":""},{"$f":"IFERROR(INDEX(Table1[Pin],1/(1/SUMPRODUCT((Table1[Reps]=RIGHT(INDEX(Table5[#Headers],coln),2)*1)*(Table1[Name]=Table5[[#This Row],[Name]])*Table1[Bnk]))),\"\")","v":""},{"$f":"IFERROR(INDEX(Table1[Pin],1/(1/SUMPRODUCT((Table1[Reps]=RIGHT(INDEX(Table5[#Headers],coln),2)*1)*(Table1[Name]=Table5[[#This Row],[Name]])*Table1[Bnk]))),\"\")","v":""},{"$f":"IFERROR(INDEX(Table1[Pin],1/(1/SUMPRODUCT((Table1[Reps]=RIGHT(INDEX(Table5[#Headers],coln),2)*1)*(Table1[Name]=Table5[[#This Row],[Name]])*Table1[Bnk]))),\"\")","v":""},{"$f":"IFERROR(INDEX(Table1[Pin],1/(1/SUMPRODUCT((Table1[Reps]=RIGHT(INDEX(Table5[#Headers],coln),2)*1)*(Table1[Name]=Table5[[#This Row],[Name]])*Table1[Bnk]))),\"\")","v":""},{"$f":"[Pin01]","v":"B2"},{"$f":"CONCATENATE([Pin14],IF([Pin02]=\"\",\"\",\", \"&[Pin02]))","v":"B2"},{"$f":"CONCATENATE([Pin15],IF([Pin03]=\"\",\"\",\", \"&[Pin03]))","v":"B2"},{"$f":"CONCATENATE([Pin16],IF([Pin04]=\"\",\"\",\", \"&[Pin04]))","v":"B2"},{"$f":"CONCATENATE([Pin17],IF([Pin05]=\"\",\"\",\", \"&[Pin05]))","v":"B2"},{"$f":"CONCATENATE([Pin18],IF([Pin06]=\"\",\"\",\", \"&[Pin06]))","v":"B2"},{"$f":"CONCATENATE([Pin19],IF([Pin07]=\"\",\"\",\", \"&[Pin07]))","v":"B2"},{"$f":"CONCATENATE([Pin20],IF([Pin08]=\"\",\"\",\", \"&[Pin08]))","v":"B2"},{"$f":"CONCATENATE([Pin21],IF([Pin09]=\"\",\"\",\", \"&[Pin09]))","v":"B2"},{"$f":"CONCATENATE([Pin22],IF([Pin10]=\"\",\"\",\", \"&[Pin10]))","v":"B2"},{"$f":"CONCATENATE([Pin23],IF([Pin11]=\"\",\"\",\", \"&[Pin11]))","v":"B2"},{"$f":"CONCATENATE([Pin24],IF([Pin12]=\"\",\"\",\", \"&[Pin12]))","v":"B2"},{"$f":"CONCATENATE([Pin25],IF([Pin13]=\"\",\"\",\", \"&[Pin13]))","v":"B2"},{"$f":"IFERROR(INDEX(Table1[InOut],1/(1/SUMPRODUCT((Table1[Reps]=1)*(Table1[Name]=Table5[[#This Row],[Name]])*Table1[Seq]))),\"\")","v":"I"},{"$f":"IFERROR(INDEX(Table1[Level],1/(1/SUMPRODUCT((Table1[Reps]=1)*(Table1[Name]=Table5[[#This Row],[Name]])*Table1[Seq]))),\"\")","v":"Analog"},{"$f":"IFERROR(INDEX(Table1[Func],1/(1/SUMPRODUCT((Table1[Reps]=1)*(Table1[Name]=Table5[[#This Row],[Name]])*Table1[Seq]))),\"\")","v":"Analog-to-digitalconverterinput3."}]
[null,null,"A5","GNDA","-","Power",null,{"$f":"COUNTIF(INDEX([Name],1):Table1[[#This Row],[Name]],[Name])","v":1},{"$f":"IF(ISTEXT([Pin]),[Seq],INDEX([Bnk],[Seq]-1))","v":5},5,null,null,"ADC4",{"$f":"IFERROR(INDEX(Table1[Pin],1/(1/SUMPRODUCT((Table1[Reps]=RIGHT(INDEX(Table5[#Headers],coln),2)*1)*(Table1[Name]=Table5[[#This Row],[Name]])*Table1[Bnk]))),\"\")","v":"A2"},{"$f":"IFERROR(INDEX(Table1[Pin],1/(1/SUMPRODUCT((Table1[Reps]=RIGHT(INDEX(Table5[#Headers],coln),2)*1)*(Table1[Name]=Table5[[#This Row],[Name]])*Table1[Bnk]))),\"\")","v":""},{"$f":"IFERROR(INDEX(Table1[Pin],1/(1/SUMPRODUCT((Table1[Reps]=RIGHT(INDEX(Table5[#Headers],coln),2)*1)*(Table1[Name]=Table5[[#This Row],[Name]])*Table1[Bnk]))),\"\")","v":""},{"$f":"IFERROR(INDEX(Table1[Pin],1/(1/SUMPRODUCT((Table1[Reps]=RIGHT(INDEX(Table5[#Headers],coln),2)*1)*(Table1[Name]=Table5[[#This Row],[Name]])*Table1[Bnk]))),\"\")","v":""},{"$f":"IFERROR(INDEX(Table1[Pin],1/(1/SUMPRODUCT((Table1[Reps]=RIGHT(INDEX(Table5[#Headers],coln),2)*1)*(Table1[Name]=Table5[[#This Row],[Name]])*Table1[Bnk]))),\"\")","v":""},{"$f":"IFERROR(INDEX(Table1[Pin],1/(1/SUMPRODUCT((Table1[Reps]=RIGHT(INDEX(Table5[#Headers],coln),2)*1)*(Table1[Name]=Table5[[#This Row],[Name]])*Table1[Bnk]))),\"\")","v":""},{"$f":"IFERROR(INDEX(Table1[Pin],1/(1/SUMPRODUCT((Table1[Reps]=RIGHT(INDEX(Table5[#Headers],coln),2)*1)*(Table1[Name]=Table5[[#This Row],[Name]])*Table1[Bnk]))),\"\")","v":""},{"$f":"IFERROR(INDEX(Table1[Pin],1/(1/SUMPRODUCT((Table1[Reps]=RIGHT(INDEX(Table5[#Headers],coln),2)*1)*(Table1[Name]=Table5[[#This Row],[Name]])*Table1[Bnk]))),\"\")","v":""},{"$f":"IFERROR(INDEX(Table1[Pin],1/(1/SUMPRODUCT((Table1[Reps]=RIGHT(INDEX(Table5[#Headers],coln),2)*1)*(Table1[Name]=Table5[[#This Row],[Name]])*Table1[Bnk]))),\"\")","v":""},{"$f":"IFERROR(INDEX(Table1[Pin],1/(1/SUMPRODUCT((Table1[Reps]=RIGHT(INDEX(Table5[#Headers],coln),2)*1)*(Table1[Name]=Table5[[#This Row],[Name]])*Table1[Bnk]))),\"\")","v":""},{"$f":"IFERROR(INDEX(Table1[Pin],1/(1/SUMPRODUCT((Table1[Reps]=RIGHT(INDEX(Table5[#Headers],coln),2)*1)*(Table1[Name]=Table5[[#This Row],[Name]])*Table1[Bnk]))),\"\")","v":""},{"$f":"IFERROR(INDEX(Table1[Pin],1/(1/SUMPRODUCT((Table1[Reps]=RIGHT(INDEX(Table5[#Headers],coln),2)*1)*(Table1[Name]=Table5[[#This Row],[Name]])*Table1[Bnk]))),\"\")","v":""},{"$f":"IFERROR(INDEX(Table1[Pin],1/(1/SUMPRODUCT((Table1[Reps]=RIGHT(INDEX(Table5[#Headers],coln),2)*1)*(Table1[Name]=Table5[[#This Row],[Name]])*Table1[Bnk]))),\"\")","v":""},{"$f":"[Pin01]","v":"A2"},{"$f":"CONCATENATE([Pin14],IF([Pin02]=\"\",\"\",\", \"&[Pin02]))","v":"A2"},{"$f":"CONCATENATE([Pin15],IF([Pin03]=\"\",\"\",\", \"&[Pin03]))","v":"A2"},{"$f":"CONCATENATE([Pin16],IF([Pin04]=\"\",\"\",\", \"&[Pin04]))","v":"A2"},{"$f":"CONCATENATE([Pin17],IF([Pin05]=\"\",\"\",\", \"&[Pin05]))","v":"A2"},{"$f":"CONCATENATE([Pin18],IF([Pin06]=\"\",\"\",\", \"&[Pin06]))","v":"A2"},{"$f":"CONCATENATE([Pin19],IF([Pin07]=\"\",\"\",\", \"&[Pin07]))","v":"A2"},{"$f":"CONCATENATE([Pin20],IF([Pin08]=\"\",\"\",\", \"&[Pin08]))","v":"A2"},{"$f":"CONCATENATE([Pin21],IF([Pin09]=\"\",\"\",\", \"&[Pin09]))","v":"A2"},{"$f":"CONCATENATE([Pin22],IF([Pin10]=\"\",\"\",\", \"&[Pin10]))","v":"A2"},{"$f":"CONCATENATE([Pin23],IF([Pin11]=\"\",\"\",\", \"&[Pin11]))","v":"A2"},{"$f":"CONCATENATE([Pin24],IF([Pin12]=\"\",\"\",\", \"&[Pin12]))","v":"A2"},{"$f":"CONCATENATE([Pin25],IF([Pin13]=\"\",\"\",\", \"&[Pin13]))","v":"A2"},{"$f":"IFERROR(INDEX(Table1[InOut],1/(1/SUMPRODUCT((Table1[Reps]=1)*(Table1[Name]=Table5[[#This Row],[Name]])*Table1[Seq]))),\"\")","v":"I"},{"$f":"IFERROR(INDEX(Table1[Level],1/(1/SUMPRODUCT((Table1[Reps]=1)*(Table1[Name]=Table5[[#This Row],[Name]])*Table1[Seq]))),\"\")","v":"Analog"},{"$f":"IFERROR(INDEX(Table1[Func],1/(1/SUMPRODUCT((Table1[Reps]=1)*(Table1[Name]=Table5[[#This Row],[Name]])*Table1[Seq]))),\"\")","v":"Analog-to-digitalconverterinput4."}]
[null,null,"A6","PB4","I/O","TTL","GPIOportBbit4.",{"$f":"COUNTIF(INDEX([Name],1):Table1[[#This Row],[Name]],[Name])","v":1},{"$f":"IF(ISTEXT([Pin]),[Seq],INDEX([Bnk],[Seq]-1))","v":6},6,null,null,"ADC5",{"$f":"IFERROR(INDEX(Table1[Pin],1/(1/SUMPRODUCT((Table1[Reps]=RIGHT(INDEX(Table5[#Headers],coln),2)*1)*(Table1[Name]=Table5[[#This Row],[Name]])*Table1[Bnk]))),\"\")","v":"A3"},{"$f":"IFERROR(INDEX(Table1[Pin],1/(1/SUMPRODUCT((Table1[Reps]=RIGHT(INDEX(Table5[#Headers],coln),2)*1)*(Table1[Name]=Table5[[#This Row],[Name]])*Table1[Bnk]))),\"\")","v":""},{"$f":"IFERROR(INDEX(Table1[Pin],1/(1/SUMPRODUCT((Table1[Reps]=RIGHT(INDEX(Table5[#Headers],coln),2)*1)*(Table1[Name]=Table5[[#This Row],[Name]])*Table1[Bnk]))),\"\")","v":""},{"$f":"IFERROR(INDEX(Table1[Pin],1/(1/SUMPRODUCT((Table1[Reps]=RIGHT(INDEX(Table5[#Headers],coln),2)*1)*(Table1[Name]=Table5[[#This Row],[Name]])*Table1[Bnk]))),\"\")","v":""},{"$f":"IFERROR(INDEX(Table1[Pin],1/(1/SUMPRODUCT((Table1[Reps]=RIGHT(INDEX(Table5[#Headers],coln),2)*1)*(Table1[Name]=Table5[[#This Row],[Name]])*Table1[Bnk]))),\"\")","v":""},{"$f":"IFERROR(INDEX(Table1[Pin],1/(1/SUMPRODUCT((Table1[Reps]=RIGHT(INDEX(Table5[#Headers],coln),2)*1)*(Table1[Name]=Table5[[#This Row],[Name]])*Table1[Bnk]))),\"\")","v":""},{"$f":"IFERROR(INDEX(Table1[Pin],1/(1/SUMPRODUCT((Table1[Reps]=RIGHT(INDEX(Table5[#Headers],coln),2)*1)*(Table1[Name]=Table5[[#This Row],[Name]])*Table1[Bnk]))),\"\")","v":""},{"$f":"IFERROR(INDEX(Table1[Pin],1/(1/SUMPRODUCT((Table1[Reps]=RIGHT(INDEX(Table5[#Headers],coln),2)*1)*(Table1[Name]=Table5[[#This Row],[Name]])*Table1[Bnk]))),\"\")","v":""},{"$f":"IFERROR(INDEX(Table1[Pin],1/(1/SUMPRODUCT((Table1[Reps]=RIGHT(INDEX(Table5[#Headers],coln),2)*1)*(Table1[Name]=Table5[[#This Row],[Name]])*Table1[Bnk]))),\"\")","v":""},{"$f":"IFERROR(INDEX(Table1[Pin],1/(1/SUMPRODUCT((Table1[Reps]=RIGHT(INDEX(Table5[#Headers],coln),2)*1)*(Table1[Name]=Table5[[#This Row],[Name]])*Table1[Bnk]))),\"\")","v":""},{"$f":"IFERROR(INDEX(Table1[Pin],1/(1/SUMPRODUCT((Table1[Reps]=RIGHT(INDEX(Table5[#Headers],coln),2)*1)*(Table1[Name]=Table5[[#This Row],[Name]])*Table1[Bnk]))),\"\")","v":""},{"$f":"IFERROR(INDEX(Table1[Pin],1/(1/SUMPRODUCT((Table1[Reps]=RIGHT(INDEX(Table5[#Headers],coln),2)*1)*(Table1[Name]=Table5[[#This Row],[Name]])*Table1[Bnk]))),\"\")","v":""},{"$f":"IFERROR(INDEX(Table1[Pin],1/(1/SUMPRODUCT((Table1[Reps]=RIGHT(INDEX(Table5[#Headers],coln),2)*1)*(Table1[Name]=Table5[[#This Row],[Name]])*Table1[Bnk]))),\"\")","v":""},{"$f":"[Pin01]","v":"A3"},{"$f":"CONCATENATE([Pin14],IF([Pin02]=\"\",\"\",\", \"&[Pin02]))","v":"A3"},{"$f":"CONCATENATE([Pin15],IF([Pin03]=\"\",\"\",\", \"&[Pin03]))","v":"A3"},{"$f":"CONCATENATE([Pin16],IF([Pin04]=\"\",\"\",\", \"&[Pin04]))","v":"A3"},{"$f":"CONCATENATE([Pin17],IF([Pin05]=\"\",\"\",\", \"&[Pin05]))","v":"A3"},{"$f":"CONCATENATE([Pin18],IF([Pin06]=\"\",\"\",\", \"&[Pin06]))","v":"A3"},{"$f":"CONCATENATE([Pin19],IF([Pin07]=\"\",\"\",\", \"&[Pin07]))","v":"A3"},{"$f":"CONCATENATE([Pin20],IF([Pin08]=\"\",\"\",\", \"&[Pin08]))","v":"A3"},{"$f":"CONCATENATE([Pin21],IF([Pin09]=\"\",\"\",\", \"&[Pin09]))","v":"A3"},{"$f":"CONCATENATE([Pin22],IF([Pin10]=\"\",\"\",\", \"&[Pin10]))","v":"A3"},{"$f":"CONCATENATE([Pin23],IF([Pin11]=\"\",\"\",\", \"&[Pin11]))","v":"A3"},{"$f":"CONCATENATE([Pin24],IF([Pin12]=\"\",\"\",\", \"&[Pin12]))","v":"A3"},{"$f":"CONCATENATE([Pin25],IF([Pin13]=\"\",\"\",\", \"&[Pin13]))","v":"A3"},{"$f":"IFERROR(INDEX(Table1[InOut],1/(1/SUMPRODUCT((Table1[Reps]=1)*(Table1[Name]=Table5[[#This Row],[Name]])*Table1[Seq]))),\"\")","v":"I"},{"$f":"IFERROR(INDEX(Table1[Level],1/(1/SUMPRODUCT((Table1[Reps]=1)*(Table1[Name]=Table5[[#This Row],[Name]])*Table1[Seq]))),\"\")","v":"Analog"},{"$f":"IFERROR(INDEX(Table1[Func],1/(1/SUMPRODUCT((Table1[Reps]=1)*(Table1[Name]=Table5[[#This Row],[Name]])*Table1[Seq]))),\"\")","v":"Analog-to-digitalconverterinput5."}]
[null,null,null,"C0-","I","Analog","Analogcomparator0negativeinput.",{"$f":"COUNTIF(INDEX([Name],1):Table1[[#This Row],[Name]],[Name])","v":1},{"$f":"IF(ISTEXT([Pin]),[Seq],INDEX([Bnk],[Seq]-1))","v":6},7,null,null,"ADC6",{"$f":"IFERROR(INDEX(Table1[Pin],1/(1/SUMPRODUCT((Table1[Reps]=RIGHT(INDEX(Table5[#Headers],coln),2)*1)*(Table1[Name]=Table5[[#This Row],[Name]])*Table1[Bnk]))),\"\")","v":"B4"},{"$f":"IFERROR(INDEX(Table1[Pin],1/(1/SUMPRODUCT((Table1[Reps]=RIGHT(INDEX(Table5[#Headers],coln),2)*1)*(Table1[Name]=Table5[[#This Row],[Name]])*Table1[Bnk]))),\"\")","v":""},{"$f":"IFERROR(INDEX(Table1[Pin],1/(1/SUMPRODUCT((Table1[Reps]=RIGHT(INDEX(Table5[#Headers],coln),2)*1)*(Table1[Name]=Table5[[#This Row],[Name]])*Table1[Bnk]))),\"\")","v":""},{"$f":"IFERROR(INDEX(Table1[Pin],1/(1/SUMPRODUCT((Table1[Reps]=RIGHT(INDEX(Table5[#Headers],coln),2)*1)*(Table1[Name]=Table5[[#This Row],[Name]])*Table1[Bnk]))),\"\")","v":""},{"$f":"IFERROR(INDEX(Table1[Pin],1/(1/SUMPRODUCT((Table1[Reps]=RIGHT(INDEX(Table5[#Headers],coln),2)*1)*(Table1[Name]=Table5[[#This Row],[Name]])*Table1[Bnk]))),\"\")","v":""},{"$f":"IFERROR(INDEX(Table1[Pin],1/(1/SUMPRODUCT((Table1[Reps]=RIGHT(INDEX(Table5[#Headers],coln),2)*1)*(Table1[Name]=Table5[[#This Row],[Name]])*Table1[Bnk]))),\"\")","v":""},{"$f":"IFERROR(INDEX(Table1[Pin],1/(1/SUMPRODUCT((Table1[Reps]=RIGHT(INDEX(Table5[#Headers],coln),2)*1)*(Table1[Name]=Table5[[#This Row],[Name]])*Table1[Bnk]))),\"\")","v":""},{"$f":"IFERROR(INDEX(Table1[Pin],1/(1/SUMPRODUCT((Table1[Reps]=RIGHT(INDEX(Table5[#Headers],coln),2)*1)*(Table1[Name]=Table5[[#This Row],[Name]])*Table1[Bnk]))),\"\")","v":""},{"$f":"IFERROR(INDEX(Table1[Pin],1/(1/SUMPRODUCT((Table1[Reps]=RIGHT(INDEX(Table5[#Headers],coln),2)*1)*(Table1[Name]=Table5[[#This Row],[Name]])*Table1[Bnk]))),\"\")","v":""},{"$f":"IFERROR(INDEX(Table1[Pin],1/(1/SUMPRODUCT((Table1[Reps]=RIGHT(INDEX(Table5[#Headers],coln),2)*1)*(Table1[Name]=Table5[[#This Row],[Name]])*Table1[Bnk]))),\"\")","v":""},{"$f":"IFERROR(INDEX(Table1[Pin],1/(1/SUMPRODUCT((Table1[Reps]=RIGHT(INDEX(Table5[#Headers],coln),2)*1)*(Table1[Name]=Table5[[#This Row],[Name]])*Table1[Bnk]))),\"\")","v":""},{"$f":"IFERROR(INDEX(Table1[Pin],1/(1/SUMPRODUCT((Table1[Reps]=RIGHT(INDEX(Table5[#Headers],coln),2)*1)*(Table1[Name]=Table5[[#This Row],[Name]])*Table1[Bnk]))),\"\")","v":""},{"$f":"IFERROR(INDEX(Table1[Pin],1/(1/SUMPRODUCT((Table1[Reps]=RIGHT(INDEX(Table5[#Headers],coln),2)*1)*(Table1[Name]=Table5[[#This Row],[Name]])*Table1[Bnk]))),\"\")","v":""},{"$f":"[Pin01]","v":"B4"},{"$f":"CONCATENATE([Pin14],IF([Pin02]=\"\",\"\",\", \"&[Pin02]))","v":"B4"},{"$f":"CONCATENATE([Pin15],IF([Pin03]=\"\",\"\",\", \"&[Pin03]))","v":"B4"},{"$f":"CONCATENATE([Pin16],IF([Pin04]=\"\",\"\",\", \"&[Pin04]))","v":"B4"},{"$f":"CONCATENATE([Pin17],IF([Pin05]=\"\",\"\",\", \"&[Pin05]))","v":"B4"},{"$f":"CONCATENATE([Pin18],IF([Pin06]=\"\",\"\",\", \"&[Pin06]))","v":"B4"},{"$f":"CONCATENATE([Pin19],IF([Pin07]=\"\",\"\",\", \"&[Pin07]))","v":"B4"},{"$f":"CONCATENATE([Pin20],IF([Pin08]=\"\",\"\",\", \"&[Pin08]))","v":"B4"},{"$f":"CONCATENATE([Pin21],IF([Pin09]=\"\",\"\",\", \"&[Pin09]))","v":"B4"},{"$f":"CONCATENATE([Pin22],IF([Pin10]=\"\",\"\",\", \"&[Pin10]))","v":"B4"},{"$f":"CONCATENATE([Pin23],IF([Pin11]=\"\",\"\",\", \"&[Pin11]))","v":"B4"},{"$f":"CONCATENATE([Pin24],IF([Pin12]=\"\",\"\",\", \"&[Pin12]))","v":"B4"},{"$f":"CONCATENATE([Pin25],IF([Pin13]=\"\",\"\",\", \"&[Pin13]))","v":"B4"},{"$f":"IFERROR(INDEX(Table1[InOut],1/(1/SUMPRODUCT((Table1[Reps]=1)*(Table1[Name]=Table5[[#This Row],[Name]])*Table1[Seq]))),\"\")","v":"I"},{"$f":"IFERROR(INDEX(Table1[Level],1/(1/SUMPRODUCT((Table1[Reps]=1)*(Table1[Name]=Table5[[#This Row],[Name]])*Table1[Seq]))),\"\")","v":"Analog"},{"$f":"IFERROR(INDEX(Table1[Func],1/(1/SUMPRODUCT((Table1[Reps]=1)*(Table1[Name]=Table5[[#This Row],[Name]])*Table1[Seq]))),\"\")","v":"Analog-to-digitalconverterinput6."}]
[null,null,"A7","PB6","I/O","TTL","GPIOportBbit6.",{"$f":"COUNTIF(INDEX([Name],1):Table1[[#This Row],[Name]],[Name])","v":1},{"$f":"IF(ISTEXT([Pin]),[Seq],INDEX([Bnk],[Seq]-1))","v":8},8,null,null,"ADC7",{"$f":"IFERROR(INDEX(Table1[Pin],1/(1/SUMPRODUCT((Table1[Reps]=RIGHT(INDEX(Table5[#Headers],coln),2)*1)*(Table1[Name]=Table5[[#This Row],[Name]])*Table1[Bnk]))),\"\")","v":"A4"},{"$f":"IFERROR(INDEX(Table1[Pin],1/(1/SUMPRODUCT((Table1[Reps]=RIGHT(INDEX(Table5[#Headers],coln),2)*1)*(Table1[Name]=Table5[[#This Row],[Name]])*Table1[Bnk]))),\"\")","v":""},{"$f":"IFERROR(INDEX(Table1[Pin],1/(1/SUMPRODUCT((Table1[Reps]=RIGHT(INDEX(Table5[#Headers],coln),2)*1)*(Table1[Name]=Table5[[#This Row],[Name]])*Table1[Bnk]))),\"\")","v":""},{"$f":"IFERROR(INDEX(Table1[Pin],1/(1/SUMPRODUCT((Table1[Reps]=RIGHT(INDEX(Table5[#Headers],coln),2)*1)*(Table1[Name]=Table5[[#This Row],[Name]])*Table1[Bnk]))),\"\")","v":""},{"$f":"IFERROR(INDEX(Table1[Pin],1/(1/SUMPRODUCT((Table1[Reps]=RIGHT(INDEX(Table5[#Headers],coln),2)*1)*(Table1[Name]=Table5[[#This Row],[Name]])*Table1[Bnk]))),\"\")","v":""},{"$f":"IFERROR(INDEX(Table1[Pin],1/(1/SUMPRODUCT((Table1[Reps]=RIGHT(INDEX(Table5[#Headers],coln),2)*1)*(Table1[Name]=Table5[[#This Row],[Name]])*Table1[Bnk]))),\"\")","v":""},{"$f":"IFERROR(INDEX(Table1[Pin],1/(1/SUMPRODUCT((Table1[Reps]=RIGHT(INDEX(Table5[#Headers],coln),2)*1)*(Table1[Name]=Table5[[#This Row],[Name]])*Table1[Bnk]))),\"\")","v":""},{"$f":"IFERROR(INDEX(Table1[Pin],1/(1/SUMPRODUCT((Table1[Reps]=RIGHT(INDEX(Table5[#Headers],coln),2)*1)*(Table1[Name]=Table5[[#This Row],[Name]])*Table1[Bnk]))),\"\")","v":""},{"$f":"IFERROR(INDEX(Table1[Pin],1/(1/SUMPRODUCT((Table1[Reps]=RIGHT(INDEX(Table5[#Headers],coln),2)*1)*(Table1[Name]=Table5[[#This Row],[Name]])*Table1[Bnk]))),\"\")","v":""},{"$f":"IFERROR(INDEX(Table1[Pin],1/(1/SUMPRODUCT((Table1[Reps]=RIGHT(INDEX(Table5[#Headers],coln),2)*1)*(Table1[Name]=Table5[[#This Row],[Name]])*Table1[Bnk]))),\"\")","v":""},{"$f":"IFERROR(INDEX(Table1[Pin],1/(1/SUMPRODUCT((Table1[Reps]=RIGHT(INDEX(Table5[#Headers],coln),2)*1)*(Table1[Name]=Table5[[#This Row],[Name]])*Table1[Bnk]))),\"\")","v":""},{"$f":"IFERROR(INDEX(Table1[Pin],1/(1/SUMPRODUCT((Table1[Reps]=RIGHT(INDEX(Table5[#Headers],coln),2)*1)*(Table1[Name]=Table5[[#This Row],[Name]])*Table1[Bnk]))),\"\")","v":""},{"$f":"IFERROR(INDEX(Table1[Pin],1/(1/SUMPRODUCT((Table1[Reps]=RIGHT(INDEX(Table5[#Headers],coln),2)*1)*(Table1[Name]=Table5[[#This Row],[Name]])*Table1[Bnk]))),\"\")","v":""},{"$f":"[Pin01]","v":"A4"},{"$f":"CONCATENATE([Pin14],IF([Pin02]=\"\",\"\",\", \"&[Pin02]))","v":"A4"},{"$f":"CONCATENATE([Pin15],IF([Pin03]=\"\",\"\",\", \"&[Pin03]))","v":"A4"},{"$f":"CONCATENATE([Pin16],IF([Pin04]=\"\",\"\",\", \"&[Pin04]))","v":"A4"},{"$f":"CONCATENATE([Pin17],IF([Pin05]=\"\",\"\",\", \"&[Pin05]))","v":"A4"},{"$f":"CONCATENATE([Pin18],IF([Pin06]=\"\",\"\",\", \"&[Pin06]))","v":"A4"},{"$f":"CONCATENATE([Pin19],IF([Pin07]=\"\",\"\",\", \"&[Pin07]))","v":"A4"},{"$f":"CONCATENATE([Pin20],IF([Pin08]=\"\",\"\",\", \"&[Pin08]))","v":"A4"},{"$f":"CONCATENATE([Pin21],IF([Pin09]=\"\",\"\",\", \"&[Pin09]))","v":"A4"},{"$f":"CONCATENATE([Pin22],IF([Pin10]=\"\",\"\",\", \"&[Pin10]))","v":"A4"},{"$f":"CONCATENATE([Pin23],IF([Pin11]=\"\",\"\",\", \"&[Pin11]))","v":"A4"},{"$f":"CONCATENATE([Pin24],IF([Pin12]=\"\",\"\",\", \"&[Pin12]))","v":"A4"},{"$f":"CONCATENATE([Pin25],IF([Pin13]=\"\",\"\",\", \"&[Pin13]))","v":"A4"},{"$f":"IFERROR(INDEX(Table1[InOut],1/(1/SUMPRODUCT((Table1[Reps]=1)*(Table1[Name]=Table5[[#This Row],[Name]])*Table1[Seq]))),\"\")","v":"I"},{"$f":"IFERROR(INDEX(Table1[Level],1/(1/SUMPRODUCT((Table1[Reps]=1)*(Table1[Name]=Table5[[#This Row],[Name]])*Table1[Seq]))),\"\")","v":"Analog"},{"$f":"IFERROR(INDEX(Table1[Func],1/(1/SUMPRODUCT((Table1[Reps]=1)*(Table1[Name]=Table5[[#This Row],[Name]])*Table1[Seq]))),\"\")","v":"Analog-to-digitalconverterinput7."}]
[null,null,null,"C0+","I","Analog","Analogcomparator0positiveinput.",{"$f":"COUNTIF(INDEX([Name],1):Table1[[#This Row],[Name]],[Name])","v":1},{"$f":"IF(ISTEXT([Pin]),[Seq],INDEX([Bnk],[Seq]-1))","v":8},9,null,null,"C0-",{"$f":"IFERROR(INDEX(Table1[Pin],1/(1/SUMPRODUCT((Table1[Reps]=RIGHT(INDEX(Table5[#Headers],coln),2)*1)*(Table1[Name]=Table5[[#This Row],[Name]])*Table1[Bnk]))),\"\")","v":"A6"},{"$f":"IFERROR(INDEX(Table1[Pin],1/(1/SUMPRODUCT((Table1[Reps]=RIGHT(INDEX(Table5[#Headers],coln),2)*1)*(Table1[Name]=Table5[[#This Row],[Name]])*Table1[Bnk]))),\"\")","v":""},{"$f":"IFERROR(INDEX(Table1[Pin],1/(1/SUMPRODUCT((Table1[Reps]=RIGHT(INDEX(Table5[#Headers],coln),2)*1)*(Table1[Name]=Table5[[#This Row],[Name]])*Table1[Bnk]))),\"\")","v":""},{"$f":"IFERROR(INDEX(Table1[Pin],1/(1/SUMPRODUCT((Table1[Reps]=RIGHT(INDEX(Table5[#Headers],coln),2)*1)*(Table1[Name]=Table5[[#This Row],[Name]])*Table1[Bnk]))),\"\")","v":""},{"$f":"IFERROR(INDEX(Table1[Pin],1/(1/SUMPRODUCT((Table1[Reps]=RIGHT(INDEX(Table5[#Headers],coln),2)*1)*(Table1[Name]=Table5[[#This Row],[Name]])*Table1[Bnk]))),\"\")","v":""},{"$f":"IFERROR(INDEX(Table1[Pin],1/(1/SUMPRODUCT((Table1[Reps]=RIGHT(INDEX(Table5[#Headers],coln),2)*1)*(Table1[Name]=Table5[[#This Row],[Name]])*Table1[Bnk]))),\"\")","v":""},{"$f":"IFERROR(INDEX(Table1[Pin],1/(1/SUMPRODUCT((Table1[Reps]=RIGHT(INDEX(Table5[#Headers],coln),2)*1)*(Table1[Name]=Table5[[#This Row],[Name]])*Table1[Bnk]))),\"\")","v":""},{"$f":"IFERROR(INDEX(Table1[Pin],1/(1/SUMPRODUCT((Table1[Reps]=RIGHT(INDEX(Table5[#Headers],coln),2)*1)*(Table1[Name]=Table5[[#This Row],[Name]])*Table1[Bnk]))),\"\")","v":""},{"$f":"IFERROR(INDEX(Table1[Pin],1/(1/SUMPRODUCT((Table1[Reps]=RIGHT(INDEX(Table5[#Headers],coln),2)*1)*(Table1[Name]=Table5[[#This Row],[Name]])*Table1[Bnk]))),\"\")","v":""},{"$f":"IFERROR(INDEX(Table1[Pin],1/(1/SUMPRODUCT((Table1[Reps]=RIGHT(INDEX(Table5[#Headers],coln),2)*1)*(Table1[Name]=Table5[[#This Row],[Name]])*Table1[Bnk]))),\"\")","v":""},{"$f":"IFERROR(INDEX(Table1[Pin],1/(1/SUMPRODUCT((Table1[Reps]=RIGHT(INDEX(Table5[#Headers],coln),2)*1)*(Table1[Name]=Table5[[#This Row],[Name]])*Table1[Bnk]))),\"\")","v":""},{"$f":"IFERROR(INDEX(Table1[Pin],1/(1/SUMPRODUCT((Table1[Reps]=RIGHT(INDEX(Table5[#Headers],coln),2)*1)*(Table1[Name]=Table5[[#This Row],[Name]])*Table1[Bnk]))),\"\")","v":""},{"$f":"IFERROR(INDEX(Table1[Pin],1/(1/SUMPRODUCT((Table1[Reps]=RIGHT(INDEX(Table5[#Headers],coln),2)*1)*(Table1[Name]=Table5[[#This Row],[Name]])*Table1[Bnk]))),\"\")","v":""},{"$f":"[Pin01]","v":"A6"},{"$f":"CONCATENATE([Pin14],IF([Pin02]=\"\",\"\",\", \"&[Pin02]))","v":"A6"},{"$f":"CONCATENATE([Pin15],IF([Pin03]=\"\",\"\",\", \"&[Pin03]))","v":"A6"},{"$f":"CONCATENATE([Pin16],IF([Pin04]=\"\",\"\",\", \"&[Pin04]))","v":"A6"},{"$f":"CONCATENATE([Pin17],IF([Pin05]=\"\",\"\",\", \"&[Pin05]))","v":"A6"},{"$f":"CONCATENATE([Pin18],IF([Pin06]=\"\",\"\",\", \"&[Pin06]))","v":"A6"},{"$f":"CONCATENATE([Pin19],IF([Pin07]=\"\",\"\",\", \"&[Pin07]))","v":"A6"},{"$f":"CONCATENATE([Pin20],IF([Pin08]=\"\",\"\",\", \"&[Pin08]))","v":"A6"},{"$f":"CONCATENATE([Pin21],IF([Pin09]=\"\",\"\",\", \"&[Pin09]))","v":"A6"},{"$f":"CONCATENATE([Pin22],IF([Pin10]=\"\",\"\",\", \"&[Pin10]))","v":"A6"},{"$f":"CONCATENATE([Pin23],IF([Pin11]=\"\",\"\",\", \"&[Pin11]))","v":"A6"},{"$f":"CONCATENATE([Pin24],IF([Pin12]=\"\",\"\",\", \"&[Pin12]))","v":"A6"},{"$f":"CONCATENATE([Pin25],IF([Pin13]=\"\",\"\",\", \"&[Pin13]))","v":"A6"},{"$f":"IFERROR(INDEX(Table1[InOut],1/(1/SUMPRODUCT((Table1[Reps]=1)*(Table1[Name]=Table5[[#This Row],[Name]])*Table1[Seq]))),\"\")","v":"I"},{"$f":"IFERROR(INDEX(Table1[Level],1/(1/SUMPRODUCT((Table1[Reps]=1)*(Table1[Name]=Table5[[#This Row],[Name]])*Table1[Seq]))),\"\")","v":"Analog"},{"$f":"IFERROR(INDEX(Table1[Func],1/(1/SUMPRODUCT((Table1[Reps]=1)*(Table1[Name]=Table5[[#This Row],[Name]])*Table1[Seq]))),\"\")","v":"Analogcomparator0negativeinput."}]
[null,null,"A8","PB7","I/O","TTL","GPIOportBbit7.",{"$f":"COUNTIF(INDEX([Name],1):Table1[[#This Row],[Name]],[Name])","v":1},{"$f":"IF(ISTEXT([Pin]),[Seq],INDEX([Bnk],[Seq]-1))","v":10},10,null,null,"C0+",{"$f":"IFERROR(INDEX(Table1[Pin],1/(1/SUMPRODUCT((Table1[Reps]=RIGHT(INDEX(Table5[#Headers],coln),2)*1)*(Table1[Name]=Table5[[#This Row],[Name]])*Table1[Bnk]))),\"\")","v":"A7"},{"$f":"IFERROR(INDEX(Table1[Pin],1/(1/SUMPRODUCT((Table1[Reps]=RIGHT(INDEX(Table5[#Headers],coln),2)*1)*(Table1[Name]=Table5[[#This Row],[Name]])*Table1[Bnk]))),\"\")","v":""},{"$f":"IFERROR(INDEX(Table1[Pin],1/(1/SUMPRODUCT((Table1[Reps]=RIGHT(INDEX(Table5[#Headers],coln),2)*1)*(Table1[Name]=Table5[[#This Row],[Name]])*Table1[Bnk]))),\"\")","v":""},{"$f":"IFERROR(INDEX(Table1[Pin],1/(1/SUMPRODUCT((Table1[Reps]=RIGHT(INDEX(Table5[#Headers],coln),2)*1)*(Table1[Name]=Table5[[#This Row],[Name]])*Table1[Bnk]))),\"\")","v":""},{"$f":"IFERROR(INDEX(Table1[Pin],1/(1/SUMPRODUCT((Table1[Reps]=RIGHT(INDEX(Table5[#Headers],coln),2)*1)*(Table1[Name]=Table5[[#This Row],[Name]])*Table1[Bnk]))),\"\")","v":""},{"$f":"IFERROR(INDEX(Table1[Pin],1/(1/SUMPRODUCT((Table1[Reps]=RIGHT(INDEX(Table5[#Headers],coln),2)*1)*(Table1[Name]=Table5[[#This Row],[Name]])*Table1[Bnk]))),\"\")","v":""},{"$f":"IFERROR(INDEX(Table1[Pin],1/(1/SUMPRODUCT((Table1[Reps]=RIGHT(INDEX(Table5[#Headers],coln),2)*1)*(Table1[Name]=Table5[[#This Row],[Name]])*Table1[Bnk]))),\"\")","v":""},{"$f":"IFERROR(INDEX(Table1[Pin],1/(1/SUMPRODUCT((Table1[Reps]=RIGHT(INDEX(Table5[#Headers],coln),2)*1)*(Table1[Name]=Table5[[#This Row],[Name]])*Table1[Bnk]))),\"\")","v":""},{"$f":"IFERROR(INDEX(Table1[Pin],1/(1/SUMPRODUCT((Table1[Reps]=RIGHT(INDEX(Table5[#Headers],coln),2)*1)*(Table1[Name]=Table5[[#This Row],[Name]])*Table1[Bnk]))),\"\")","v":""},{"$f":"IFERROR(INDEX(Table1[Pin],1/(1/SUMPRODUCT((Table1[Reps]=RIGHT(INDEX(Table5[#Headers],coln),2)*1)*(Table1[Name]=Table5[[#This Row],[Name]])*Table1[Bnk]))),\"\")","v":""},{"$f":"IFERROR(INDEX(Table1[Pin],1/(1/SUMPRODUCT((Table1[Reps]=RIGHT(INDEX(Table5[#Headers],coln),2)*1)*(Table1[Name]=Table5[[#This Row],[Name]])*Table1[Bnk]))),\"\")","v":""},{"$f":"IFERROR(INDEX(Table1[Pin],1/(1/SUMPRODUCT((Table1[Reps]=RIGHT(INDEX(Table5[#Headers],coln),2)*1)*(Table1[Name]=Table5[[#This Row],[Name]])*Table1[Bnk]))),\"\")","v":""},{"$f":"IFERROR(INDEX(Table1[Pin],1/(1/SUMPRODUCT((Table1[Reps]=RIGHT(INDEX(Table5[#Headers],coln),2)*1)*(Table1[Name]=Table5[[#This Row],[Name]])*Table1[Bnk]))),\"\")","v":""},{"$f":"[Pin01]","v":"A7"},{"$f":"CONCATENATE([Pin14],IF([Pin02]=\"\",\"\",\", \"&[Pin02]))","v":"A7"},{"$f":"CONCATENATE([Pin15],IF([Pin03]=\"\",\"\",\", \"&[Pin03]))","v":"A7"},{"$f":"CONCATENATE([Pin16],IF([Pin04]=\"\",\"\",\", \"&[Pin04]))","v":"A7"},{"$f":"CONCATENATE([Pin17],IF([Pin05]=\"\",\"\",\", \"&[Pin05]))","v":"A7"},{"$f":"CONCATENATE([Pin18],IF([Pin06]=\"\",\"\",\", \"&[Pin06]))","v":"A7"},{"$f":"CONCATENATE([Pin19],IF([Pin07]=\"\",\"\",\", \"&[Pin07]))","v":"A7"},{"$f":"CONCATENATE([Pin20],IF([Pin08]=\"\",\"\",\", \"&[Pin08]))","v":"A7"},{"$f":"CONCATENATE([Pin21],IF([Pin09]=\"\",\"\",\", \"&[Pin09]))","v":"A7"},{"$f":"CONCATENATE([Pin22],IF([Pin10]=\"\",\"\",\", \"&[Pin10]))","v":"A7"},{"$f":"CONCATENATE([Pin23],IF([Pin11]=\"\",\"\",\", \"&[Pin11]))","v":"A7"},{"$f":"CONCATENATE([Pin24],IF([Pin12]=\"\",\"\",\", \"&[Pin12]))","v":"A7"},{"$f":"CONCATENATE([Pin25],IF([Pin13]=\"\",\"\",\", \"&[Pin13]))","v":"A7"},{"$f":"IFERROR(INDEX(Table1[InOut],1/(1/SUMPRODUCT((Table1[Reps]=1)*(Table1[Name]=Table5[[#This Row],[Name]])*Table1[Seq]))),\"\")","v":"I"},{"$f":"IFERROR(INDEX(Table1[Level],1/(1/SUMPRODUCT((Table1[Reps]=1)*(Table1[Name]=Table5[[#This Row],[Name]])*Table1[Seq]))),\"\")","v":"Analog"},{"$f":"IFERROR(INDEX(Table1[Func],1/(1/SUMPRODUCT((Table1[Reps]=1)*(Table1[Name]=Table5[[#This Row],[Name]])*Table1[Seq]))),\"\")","v":"Analogcomparator0positiveinput."}]
[null,null,null,"TRST","I","TTL","JTAGTRST.",{"$f":"COUNTIF(INDEX([Name],1):Table1[[#This Row],[Name]],[Name])","v":1},{"$f":"IF(ISTEXT([Pin]),[Seq],INDEX([Bnk],[Seq]-1))","v":10},11,null,null,"C0o",{"$f":"IFERROR(INDEX(Table1[Pin],1/(1/SUMPRODUCT((Table1[Reps]=RIGHT(INDEX(Table5[#Headers],coln),2)*1)*(Table1[Name]=Table5[[#This Row],[Name]])*Table1[Bnk]))),\"\")","v":"M1"},{"$f":"IFERROR(INDEX(Table1[Pin],1/(1/SUMPRODUCT((Table1[Reps]=RIGHT(INDEX(Table5[#Headers],coln),2)*1)*(Table1[Name]=Table5[[#This Row],[Name]])*Table1[Bnk]))),\"\")","v":""},{"$f":"IFERROR(INDEX(Table1[Pin],1/(1/SUMPRODUCT((Table1[Reps]=RIGHT(INDEX(Table5[#Headers],coln),2)*1)*(Table1[Name]=Table5[[#This Row],[Name]])*Table1[Bnk]))),\"\")","v":""},{"$f":"IFERROR(INDEX(Table1[Pin],1/(1/SUMPRODUCT((Table1[Reps]=RIGHT(INDEX(Table5[#Headers],coln),2)*1)*(Table1[Name]=Table5[[#This Row],[Name]])*Table1[Bnk]))),\"\")","v":""},{"$f":"IFERROR(INDEX(Table1[Pin],1/(1/SUMPRODUCT((Table1[Reps]=RIGHT(INDEX(Table5[#Headers],coln),2)*1)*(Table1[Name]=Table5[[#This Row],[Name]])*Table1[Bnk]))),\"\")","v":""},{"$f":"IFERROR(INDEX(Table1[Pin],1/(1/SUMPRODUCT((Table1[Reps]=RIGHT(INDEX(Table5[#Headers],coln),2)*1)*(Table1[Name]=Table5[[#This Row],[Name]])*Table1[Bnk]))),\"\")","v":""},{"$f":"IFERROR(INDEX(Table1[Pin],1/(1/SUMPRODUCT((Table1[Reps]=RIGHT(INDEX(Table5[#Headers],coln),2)*1)*(Table1[Name]=Table5[[#This Row],[Name]])*Table1[Bnk]))),\"\")","v":""},{"$f":"IFERROR(INDEX(Table1[Pin],1/(1/SUMPRODUCT((Table1[Reps]=RIGHT(INDEX(Table5[#Headers],coln),2)*1)*(Table1[Name]=Table5[[#This Row],[Name]])*Table1[Bnk]))),\"\")","v":""},{"$f":"IFERROR(INDEX(Table1[Pin],1/(1/SUMPRODUCT((Table1[Reps]=RIGHT(INDEX(Table5[#Headers],coln),2)*1)*(Table1[Name]=Table5[[#This Row],[Name]])*Table1[Bnk]))),\"\")","v":""},{"$f":"IFERROR(INDEX(Table1[Pin],1/(1/SUMPRODUCT((Table1[Reps]=RIGHT(INDEX(Table5[#Headers],coln),2)*1)*(Table1[Name]=Table5[[#This Row],[Name]])*Table1[Bnk]))),\"\")","v":""},{"$f":"IFERROR(INDEX(Table1[Pin],1/(1/SUMPRODUCT((Table1[Reps]=RIGHT(INDEX(Table5[#Headers],coln),2)*1)*(Table1[Name]=Table5[[#This Row],[Name]])*Table1[Bnk]))),\"\")","v":""},{"$f":"IFERROR(INDEX(Table1[Pin],1/(1/SUMPRODUCT((Table1[Reps]=RIGHT(INDEX(Table5[#Headers],coln),2)*1)*(Table1[Name]=Table5[[#This Row],[Name]])*Table1[Bnk]))),\"\")","v":""},{"$f":"IFERROR(INDEX(Table1[Pin],1/(1/SUMPRODUCT((Table1[Reps]=RIGHT(INDEX(Table5[#Headers],coln),2)*1)*(Table1[Name]=Table5[[#This Row],[Name]])*Table1[Bnk]))),\"\")","v":""},{"$f":"[Pin01]","v":"M1"},{"$f":"CONCATENATE([Pin14],IF([Pin02]=\"\",\"\",\", \"&[Pin02]))","v":"M1"},{"$f":"CONCATENATE([Pin15],IF([Pin03]=\"\",\"\",\", \"&[Pin03]))","v":"M1"},{"$f":"CONCATENATE([Pin16],IF([Pin04]=\"\",\"\",\", \"&[Pin04]))","v":"M1"},{"$f":"CONCATENATE([Pin17],IF([Pin05]=\"\",\"\",\", \"&[Pin05]))","v":"M1"},{"$f":"CONCATENATE([Pin18],IF([Pin06]=\"\",\"\",\", \"&[Pin06]))","v":"M1"},{"$f":"CONCATENATE([Pin19],IF([Pin07]=\"\",\"\",\", \"&[Pin07]))","v":"M1"},{"$f":"CONCATENATE([Pin20],IF([Pin08]=\"\",\"\",\", \"&[Pin08]))","v":"M1"},{"$f":"CONCATENATE([Pin21],IF([Pin09]=\"\",\"\",\", \"&[Pin09]))","v":"M1"},{"$f":"CONCATENATE([Pin22],IF([Pin10]=\"\",\"\",\", \"&[Pin10]))","v":"M1"},{"$f":"CONCATENATE([Pin23],IF([Pin11]=\"\",\"\",\", \"&[Pin11]))","v":"M1"},{"$f":"CONCATENATE([Pin24],IF([Pin12]=\"\",\"\",\", \"&[Pin12]))","v":"M1"},{"$f":"CONCATENATE([Pin25],IF([Pin13]=\"\",\"\",\", \"&[Pin13]))","v":"M1"},{"$f":"IFERROR(INDEX(Table1[InOut],1/(1/SUMPRODUCT((Table1[Reps]=1)*(Table1[Name]=Table5[[#This Row],[Name]])*Table1[Seq]))),\"\")","v":"O"},{"$f":"IFERROR(INDEX(Table1[Level],1/(1/SUMPRODUCT((Table1[Reps]=1)*(Table1[Name]=Table5[[#This Row],[Name]])*Table1[Seq]))),\"\")","v":"TTL"},{"$f":"IFERROR(INDEX(Table1[Func],1/(1/SUMPRODUCT((Table1[Reps]=1)*(Table1[Name]=Table5[[#This Row],[Name]])*Table1[Seq]))),\"\")","v":"Analogcomparator0output."}]
[null,null,"A9","PC0","I/O","TTL","GPIOportCbit0.",{"$f":"COUNTIF(INDEX([Name],1):Table1[[#This Row],[Name]],[Name])","v":1},{"$f":"IF(ISTEXT([Pin]),[Seq],INDEX([Bnk],[Seq]-1))","v":12},12,null,null,"C1-",{"$f":"IFERROR(INDEX(Table1[Pin],1/(1/SUMPRODUCT((Table1[Reps]=RIGHT(INDEX(Table5[#Headers],coln),2)*1)*(Table1[Name]=Table5[[#This Row],[Name]])*Table1[Bnk]))),\"\")","v":"B7"},{"$f":"IFERROR(INDEX(Table1[Pin],1/(1/SUMPRODUCT((Table1[Reps]=RIGHT(INDEX(Table5[#Headers],coln),2)*1)*(Table1[Name]=Table5[[#This Row],[Name]])*Table1[Bnk]))),\"\")","v":""},{"$f":"IFERROR(INDEX(Table1[Pin],1/(1/SUMPRODUCT((Table1[Reps]=RIGHT(INDEX(Table5[#Headers],coln),2)*1)*(Table1[Name]=Table5[[#This Row],[Name]])*Table1[Bnk]))),\"\")","v":""},{"$f":"IFERROR(INDEX(Table1[Pin],1/(1/SUMPRODUCT((Table1[Reps]=RIGHT(INDEX(Table5[#Headers],coln),2)*1)*(Table1[Name]=Table5[[#This Row],[Name]])*Table1[Bnk]))),\"\")","v":""},{"$f":"IFERROR(INDEX(Table1[Pin],1/(1/SUMPRODUCT((Table1[Reps]=RIGHT(INDEX(Table5[#Headers],coln),2)*1)*(Table1[Name]=Table5[[#This Row],[Name]])*Table1[Bnk]))),\"\")","v":""},{"$f":"IFERROR(INDEX(Table1[Pin],1/(1/SUMPRODUCT((Table1[Reps]=RIGHT(INDEX(Table5[#Headers],coln),2)*1)*(Table1[Name]=Table5[[#This Row],[Name]])*Table1[Bnk]))),\"\")","v":""},{"$f":"IFERROR(INDEX(Table1[Pin],1/(1/SUMPRODUCT((Table1[Reps]=RIGHT(INDEX(Table5[#Headers],coln),2)*1)*(Table1[Name]=Table5[[#This Row],[Name]])*Table1[Bnk]))),\"\")","v":""},{"$f":"IFERROR(INDEX(Table1[Pin],1/(1/SUMPRODUCT((Table1[Reps]=RIGHT(INDEX(Table5[#Headers],coln),2)*1)*(Table1[Name]=Table5[[#This Row],[Name]])*Table1[Bnk]))),\"\")","v":""},{"$f":"IFERROR(INDEX(Table1[Pin],1/(1/SUMPRODUCT((Table1[Reps]=RIGHT(INDEX(Table5[#Headers],coln),2)*1)*(Table1[Name]=Table5[[#This Row],[Name]])*Table1[Bnk]))),\"\")","v":""},{"$f":"IFERROR(INDEX(Table1[Pin],1/(1/SUMPRODUCT((Table1[Reps]=RIGHT(INDEX(Table5[#Headers],coln),2)*1)*(Table1[Name]=Table5[[#This Row],[Name]])*Table1[Bnk]))),\"\")","v":""},{"$f":"IFERROR(INDEX(Table1[Pin],1/(1/SUMPRODUCT((Table1[Reps]=RIGHT(INDEX(Table5[#Headers],coln),2)*1)*(Table1[Name]=Table5[[#This Row],[Name]])*Table1[Bnk]))),\"\")","v":""},{"$f":"IFERROR(INDEX(Table1[Pin],1/(1/SUMPRODUCT((Table1[Reps]=RIGHT(INDEX(Table5[#Headers],coln),2)*1)*(Table1[Name]=Table5[[#This Row],[Name]])*Table1[Bnk]))),\"\")","v":""},{"$f":"IFERROR(INDEX(Table1[Pin],1/(1/SUMPRODUCT((Table1[Reps]=RIGHT(INDEX(Table5[#Headers],coln),2)*1)*(Table1[Name]=Table5[[#This Row],[Name]])*Table1[Bnk]))),\"\")","v":""},{"$f":"[Pin01]","v":"B7"},{"$f":"CONCATENATE([Pin14],IF([Pin02]=\"\",\"\",\", \"&[Pin02]))","v":"B7"},{"$f":"CONCATENATE([Pin15],IF([Pin03]=\"\",\"\",\", \"&[Pin03]))","v":"B7"},{"$f":"CONCATENATE([Pin16],IF([Pin04]=\"\",\"\",\", \"&[Pin04]))","v":"B7"},{"$f":"CONCATENATE([Pin17],IF([Pin05]=\"\",\"\",\", \"&[Pin05]))","v":"B7"},{"$f":"CONCATENATE([Pin18],IF([Pin06]=\"\",\"\",\", \"&[Pin06]))","v":"B7"},{"$f":"CONCATENATE([Pin19],IF([Pin07]=\"\",\"\",\", \"&[Pin07]))","v":"B7"},{"$f":"CONCATENATE([Pin20],IF([Pin08]=\"\",\"\",\", \"&[Pin08]))","v":"B7"},{"$f":"CONCATENATE([Pin21],IF([Pin09]=\"\",\"\",\", \"&[Pin09]))","v":"B7"},{"$f":"CONCATENATE([Pin22],IF([Pin10]=\"\",\"\",\", \"&[Pin10]))","v":"B7"},{"$f":"CONCATENATE([Pin23],IF([Pin11]=\"\",\"\",\", \"&[Pin11]))","v":"B7"},{"$f":"CONCATENATE([Pin24],IF([Pin12]=\"\",\"\",\", \"&[Pin12]))","v":"B7"},{"$f":"CONCATENATE([Pin25],IF([Pin13]=\"\",\"\",\", \"&[Pin13]))","v":"B7"},{"$f":"IFERROR(INDEX(Table1[InOut],1/(1/SUMPRODUCT((Table1[Reps]=1)*(Table1[Name]=Table5[[#This Row],[Name]])*Table1[Seq]))),\"\")","v":"I"},{"$f":"IFERROR(INDEX(Table1[Level],1/(1/SUMPRODUCT((Table1[Reps]=1)*(Table1[Name]=Table5[[#This Row],[Name]])*Table1[Seq]))),\"\")","v":"Analog"},{"$f":"IFERROR(INDEX(Table1[Func],1/(1/SUMPRODUCT((Table1[Reps]=1)*(Table1[Name]=Table5[[#This Row],[Name]])*Table1[Seq]))),\"\")","v":"Analogcomparator1negativeinput."}]
[null,null,null,"TCK","I","TTL","JTAG/SWDCLK.",{"$f":"COUNTIF(INDEX([Name],1):Table1[[#This Row],[Name]],[Name])","v":1},{"$f":"IF(ISTEXT([Pin]),[Seq],INDEX([Bnk],[Seq]-1))","v":12},13,null,null,"C1+",{"$f":"IFERROR(INDEX(Table1[Pin],1/(1/SUMPRODUCT((Table1[Reps]=RIGHT(INDEX(Table5[#Headers],coln),2)*1)*(Table1[Name]=Table5[[#This Row],[Name]])*Table1[Bnk]))),\"\")","v":"M1"},{"$f":"IFERROR(INDEX(Table1[Pin],1/(1/SUMPRODUCT((Table1[Reps]=RIGHT(INDEX(Table5[#Headers],coln),2)*1)*(Table1[Name]=Table5[[#This Row],[Name]])*Table1[Bnk]))),\"\")","v":""},{"$f":"IFERROR(INDEX(Table1[Pin],1/(1/SUMPRODUCT((Table1[Reps]=RIGHT(INDEX(Table5[#Headers],coln),2)*1)*(Table1[Name]=Table5[[#This Row],[Name]])*Table1[Bnk]))),\"\")","v":""},{"$f":"IFERROR(INDEX(Table1[Pin],1/(1/SUMPRODUCT((Table1[Reps]=RIGHT(INDEX(Table5[#Headers],coln),2)*1)*(Table1[Name]=Table5[[#This Row],[Name]])*Table1[Bnk]))),\"\")","v":""},{"$f":"IFERROR(INDEX(Table1[Pin],1/(1/SUMPRODUCT((Table1[Reps]=RIGHT(INDEX(Table5[#Headers],coln),2)*1)*(Table1[Name]=Table5[[#This Row],[Name]])*Table1[Bnk]))),\"\")","v":""},{"$f":"IFERROR(INDEX(Table1[Pin],1/(1/SUMPRODUCT((Table1[Reps]=RIGHT(INDEX(Table5[#Headers],coln),2)*1)*(Table1[Name]=Table5[[#This Row],[Name]])*Table1[Bnk]))),\"\")","v":""},{"$f":"IFERROR(INDEX(Table1[Pin],1/(1/SUMPRODUCT((Table1[Reps]=RIGHT(INDEX(Table5[#Headers],coln),2)*1)*(Table1[Name]=Table5[[#This Row],[Name]])*Table1[Bnk]))),\"\")","v":""},{"$f":"IFERROR(INDEX(Table1[Pin],1/(1/SUMPRODUCT((Table1[Reps]=RIGHT(INDEX(Table5[#Headers],coln),2)*1)*(Table1[Name]=Table5[[#This Row],[Name]])*Table1[Bnk]))),\"\")","v":""},{"$f":"IFERROR(INDEX(Table1[Pin],1/(1/SUMPRODUCT((Table1[Reps]=RIGHT(INDEX(Table5[#Headers],coln),2)*1)*(Table1[Name]=Table5[[#This Row],[Name]])*Table1[Bnk]))),\"\")","v":""},{"$f":"IFERROR(INDEX(Table1[Pin],1/(1/SUMPRODUCT((Table1[Reps]=RIGHT(INDEX(Table5[#Headers],coln),2)*1)*(Table1[Name]=Table5[[#This Row],[Name]])*Table1[Bnk]))),\"\")","v":""},{"$f":"IFERROR(INDEX(Table1[Pin],1/(1/SUMPRODUCT((Table1[Reps]=RIGHT(INDEX(Table5[#Headers],coln),2)*1)*(Table1[Name]=Table5[[#This Row],[Name]])*Table1[Bnk]))),\"\")","v":""},{"$f":"IFERROR(INDEX(Table1[Pin],1/(1/SUMPRODUCT((Table1[Reps]=RIGHT(INDEX(Table5[#Headers],coln),2)*1)*(Table1[Name]=Table5[[#This Row],[Name]])*Table1[Bnk]))),\"\")","v":""},{"$f":"IFERROR(INDEX(Table1[Pin],1/(1/SUMPRODUCT((Table1[Reps]=RIGHT(INDEX(Table5[#Headers],coln),2)*1)*(Table1[Name]=Table5[[#This Row],[Name]])*Table1[Bnk]))),\"\")","v":""},{"$f":"[Pin01]","v":"M1"},{"$f":"CONCATENATE([Pin14],IF([Pin02]=\"\",\"\",\", \"&[Pin02]))","v":"M1"},{"$f":"CONCATENATE([Pin15],IF([Pin03]=\"\",\"\",\", \"&[Pin03]))","v":"M1"},{"$f":"CONCATENATE([Pin16],IF([Pin04]=\"\",\"\",\", \"&[Pin04]))","v":"M1"},{"$f":"CONCATENATE([Pin17],IF([Pin05]=\"\",\"\",\", \"&[Pin05]))","v":"M1"},{"$f":"CONCATENATE([Pin18],IF([Pin06]=\"\",\"\",\", \"&[Pin06]))","v":"M1"},{"$f":"CONCATENATE([Pin19],IF([Pin07]=\"\",\"\",\", \"&[Pin07]))","v":"M1"},{"$f":"CONCATENATE([Pin20],IF([Pin08]=\"\",\"\",\", \"&[Pin08]))","v":"M1"},{"$f":"CONCATENATE([Pin21],IF([Pin09]=\"\",\"\",\", \"&[Pin09]))","v":"M1"},{"$f":"CONCATENATE([Pin22],IF([Pin10]=\"\",\"\",\", \"&[Pin10]))","v":"M1"},{"$f":"CONCATENATE([Pin23],IF([Pin11]=\"\",\"\",\", \"&[Pin11]))","v":"M1"},{"$f":"CONCATENATE([Pin24],IF([Pin12]=\"\",\"\",\", \"&[Pin12]))","v":"M1"},{"$f":"CONCATENATE([Pin25],IF([Pin13]=\"\",\"\",\", \"&[Pin13]))","v":"M1"},{"$f":"IFERROR(INDEX(Table1[InOut],1/(1/SUMPRODUCT((Table1[Reps]=1)*(Table1[Name]=Table5[[#This Row],[Name]])*Table1[Seq]))),\"\")","v":"I"},{"$f":"IFERROR(INDEX(Table1[Level],1/(1/SUMPRODUCT((Table1[Reps]=1)*(Table1[Name]=Table5[[#This Row],[Name]])*Table1[Seq]))),\"\")","v":"Analog"},{"$f":"IFERROR(INDEX(Table1[Func],1/(1/SUMPRODUCT((Table1[Reps]=1)*(Table1[Name]=Table5[[#This Row],[Name]])*Table1[Seq]))),\"\")","v":"Analogcomparator1positiveinput."}]
[null,null,null,"SWCLK","I","TTL","JTAG/SWDCLK.",{"$f":"COUNTIF(INDEX([Name],1):Table1[[#This Row],[Name]],[Name])","v":1},{"$f":"IF(ISTEXT([Pin]),[Seq],INDEX([Bnk],[Seq]-1))","v":12},14,null,null,"CCP0",{"$f":"IFERROR(INDEX(Table1[Pin],1/(1/SUMPRODUCT((Table1[Reps]=RIGHT(INDEX(Table5[#Headers],coln),2)*1)*(Table1[Name]=Table5[[#This Row],[Name]])*Table1[Bnk]))),\"\")","v":"E12"},{"$f":"IFERROR(INDEX(Table1[Pin],1/(1/SUMPRODUCT((Table1[Reps]=RIGHT(INDEX(Table5[#Headers],coln),2)*1)*(Table1[Name]=Table5[[#This Row],[Name]])*Table1[Bnk]))),\"\")","v":""},{"$f":"IFERROR(INDEX(Table1[Pin],1/(1/SUMPRODUCT((Table1[Reps]=RIGHT(INDEX(Table5[#Headers],coln),2)*1)*(Table1[Name]=Table5[[#This Row],[Name]])*Table1[Bnk]))),\"\")","v":""},{"$f":"IFERROR(INDEX(Table1[Pin],1/(1/SUMPRODUCT((Table1[Reps]=RIGHT(INDEX(Table5[#Headers],coln),2)*1)*(Table1[Name]=Table5[[#This Row],[Name]])*Table1[Bnk]))),\"\")","v":""},{"$f":"IFERROR(INDEX(Table1[Pin],1/(1/SUMPRODUCT((Table1[Reps]=RIGHT(INDEX(Table5[#Headers],coln),2)*1)*(Table1[Name]=Table5[[#This Row],[Name]])*Table1[Bnk]))),\"\")","v":""},{"$f":"IFERROR(INDEX(Table1[Pin],1/(1/SUMPRODUCT((Table1[Reps]=RIGHT(INDEX(Table5[#Headers],coln),2)*1)*(Table1[Name]=Table5[[#This Row],[Name]])*Table1[Bnk]))),\"\")","v":""},{"$f":"IFERROR(INDEX(Table1[Pin],1/(1/SUMPRODUCT((Table1[Reps]=RIGHT(INDEX(Table5[#Headers],coln),2)*1)*(Table1[Name]=Table5[[#This Row],[Name]])*Table1[Bnk]))),\"\")","v":""},{"$f":"IFERROR(INDEX(Table1[Pin],1/(1/SUMPRODUCT((Table1[Reps]=RIGHT(INDEX(Table5[#Headers],coln),2)*1)*(Table1[Name]=Table5[[#This Row],[Name]])*Table1[Bnk]))),\"\")","v":""},{"$f":"IFERROR(INDEX(Table1[Pin],1/(1/SUMPRODUCT((Table1[Reps]=RIGHT(INDEX(Table5[#Headers],coln),2)*1)*(Table1[Name]=Table5[[#This Row],[Name]])*Table1[Bnk]))),\"\")","v":""},{"$f":"IFERROR(INDEX(Table1[Pin],1/(1/SUMPRODUCT((Table1[Reps]=RIGHT(INDEX(Table5[#Headers],coln),2)*1)*(Table1[Name]=Table5[[#This Row],[Name]])*Table1[Bnk]))),\"\")","v":""},{"$f":"IFERROR(INDEX(Table1[Pin],1/(1/SUMPRODUCT((Table1[Reps]=RIGHT(INDEX(Table5[#Headers],coln),2)*1)*(Table1[Name]=Table5[[#This Row],[Name]])*Table1[Bnk]))),\"\")","v":""},{"$f":"IFERROR(INDEX(Table1[Pin],1/(1/SUMPRODUCT((Table1[Reps]=RIGHT(INDEX(Table5[#Headers],coln),2)*1)*(Table1[Name]=Table5[[#This Row],[Name]])*Table1[Bnk]))),\"\")","v":""},{"$f":"IFERROR(INDEX(Table1[Pin],1/(1/SUMPRODUCT((Table1[Reps]=RIGHT(INDEX(Table5[#Headers],coln),2)*1)*(Table1[Name]=Table5[[#This Row],[Name]])*Table1[Bnk]))),\"\")","v":""},{"$f":"[Pin01]","v":"E12"},{"$f":"CONCATENATE([Pin14],IF([Pin02]=\"\",\"\",\", \"&[Pin02]))","v":"E12"},{"$f":"CONCATENATE([Pin15],IF([Pin03]=\"\",\"\",\", \"&[Pin03]))","v":"E12"},{"$f":"CONCATENATE([Pin16],IF([Pin04]=\"\",\"\",\", \"&[Pin04]))","v":"E12"},{"$f":"CONCATENATE([Pin17],IF([Pin05]=\"\",\"\",\", \"&[Pin05]))","v":"E12"},{"$f":"CONCATENATE([Pin18],IF([Pin06]=\"\",\"\",\", \"&[Pin06]))","v":"E12"},{"$f":"CONCATENATE([Pin19],IF([Pin07]=\"\",\"\",\", \"&[Pin07]))","v":"E12"},{"$f":"CONCATENATE([Pin20],IF([Pin08]=\"\",\"\",\", \"&[Pin08]))","v":"E12"},{"$f":"CONCATENATE([Pin21],IF([Pin09]=\"\",\"\",\", \"&[Pin09]))","v":"E12"},{"$f":"CONCATENATE([Pin22],IF([Pin10]=\"\",\"\",\", \"&[Pin10]))","v":"E12"},{"$f":"CONCATENATE([Pin23],IF([Pin11]=\"\",\"\",\", \"&[Pin11]))","v":"E12"},{"$f":"CONCATENATE([Pin24],IF([Pin12]=\"\",\"\",\", \"&[Pin12]))","v":"E12"},{"$f":"CONCATENATE([Pin25],IF([Pin13]=\"\",\"\",\", \"&[Pin13]))","v":"E12"},{"$f":"IFERROR(INDEX(Table1[InOut],1/(1/SUMPRODUCT((Table1[Reps]=1)*(Table1[Name]=Table5[[#This Row],[Name]])*Table1[Seq]))),\"\")","v":"I/O"},{"$f":"IFERROR(INDEX(Table1[Level],1/(1/SUMPRODUCT((Table1[Reps]=1)*(Table1[Name]=Table5[[#This Row],[Name]])*Table1[Seq]))),\"\")","v":"TTL"},{"$f":"IFERROR(INDEX(Table1[Func],1/(1/SUMPRODUCT((Table1[Reps]=1)*(Table1[Name]=Table5[[#This Row],[Name]])*Table1[Seq]))),\"\")","v":"Capture/Compare/PWM0."}]
[null,null,"A10","PC3","I/O","TTL","GPIOportCbit3.",{"$f":"COUNTIF(INDEX([Name],1):Table1[[#This Row],[Name]],[Name])","v":1},{"$f":"IF(ISTEXT([Pin]),[Seq],INDEX([Bnk],[Seq]-1))","v":15},15,null,null,"CCP1",{"$f":"IFERROR(INDEX(Table1[Pin],1/(1/SUMPRODUCT((Table1[Reps]=RIGHT(INDEX(Table5[#Headers],coln),2)*1)*(Table1[Name]=Table5[[#This Row],[Name]])*Table1[Bnk]))),\"\")","v":"L6"},{"$f":"IFERROR(INDEX(Table1[Pin],1/(1/SUMPRODUCT((Table1[Reps]=RIGHT(INDEX(Table5[#Headers],coln),2)*1)*(Table1[Name]=Table5[[#This Row],[Name]])*Table1[Bnk]))),\"\")","v":""},{"$f":"IFERROR(INDEX(Table1[Pin],1/(1/SUMPRODUCT((Table1[Reps]=RIGHT(INDEX(Table5[#Headers],coln),2)*1)*(Table1[Name]=Table5[[#This Row],[Name]])*Table1[Bnk]))),\"\")","v":""},{"$f":"IFERROR(INDEX(Table1[Pin],1/(1/SUMPRODUCT((Table1[Reps]=RIGHT(INDEX(Table5[#Headers],coln),2)*1)*(Table1[Name]=Table5[[#This Row],[Name]])*Table1[Bnk]))),\"\")","v":""},{"$f":"IFERROR(INDEX(Table1[Pin],1/(1/SUMPRODUCT((Table1[Reps]=RIGHT(INDEX(Table5[#Headers],coln),2)*1)*(Table1[Name]=Table5[[#This Row],[Name]])*Table1[Bnk]))),\"\")","v":""},{"$f":"IFERROR(INDEX(Table1[Pin],1/(1/SUMPRODUCT((Table1[Reps]=RIGHT(INDEX(Table5[#Headers],coln),2)*1)*(Table1[Name]=Table5[[#This Row],[Name]])*Table1[Bnk]))),\"\")","v":""},{"$f":"IFERROR(INDEX(Table1[Pin],1/(1/SUMPRODUCT((Table1[Reps]=RIGHT(INDEX(Table5[#Headers],coln),2)*1)*(Table1[Name]=Table5[[#This Row],[Name]])*Table1[Bnk]))),\"\")","v":""},{"$f":"IFERROR(INDEX(Table1[Pin],1/(1/SUMPRODUCT((Table1[Reps]=RIGHT(INDEX(Table5[#Headers],coln),2)*1)*(Table1[Name]=Table5[[#This Row],[Name]])*Table1[Bnk]))),\"\")","v":""},{"$f":"IFERROR(INDEX(Table1[Pin],1/(1/SUMPRODUCT((Table1[Reps]=RIGHT(INDEX(Table5[#Headers],coln),2)*1)*(Table1[Name]=Table5[[#This Row],[Name]])*Table1[Bnk]))),\"\")","v":""},{"$f":"IFERROR(INDEX(Table1[Pin],1/(1/SUMPRODUCT((Table1[Reps]=RIGHT(INDEX(Table5[#Headers],coln),2)*1)*(Table1[Name]=Table5[[#This Row],[Name]])*Table1[Bnk]))),\"\")","v":""},{"$f":"IFERROR(INDEX(Table1[Pin],1/(1/SUMPRODUCT((Table1[Reps]=RIGHT(INDEX(Table5[#Headers],coln),2)*1)*(Table1[Name]=Table5[[#This Row],[Name]])*Table1[Bnk]))),\"\")","v":""},{"$f":"IFERROR(INDEX(Table1[Pin],1/(1/SUMPRODUCT((Table1[Reps]=RIGHT(INDEX(Table5[#Headers],coln),2)*1)*(Table1[Name]=Table5[[#This Row],[Name]])*Table1[Bnk]))),\"\")","v":""},{"$f":"IFERROR(INDEX(Table1[Pin],1/(1/SUMPRODUCT((Table1[Reps]=RIGHT(INDEX(Table5[#Headers],coln),2)*1)*(Table1[Name]=Table5[[#This Row],[Name]])*Table1[Bnk]))),\"\")","v":""},{"$f":"[Pin01]","v":"L6"},{"$f":"CONCATENATE([Pin14],IF([Pin02]=\"\",\"\",\", \"&[Pin02]))","v":"L6"},{"$f":"CONCATENATE([Pin15],IF([Pin03]=\"\",\"\",\", \"&[Pin03]))","v":"L6"},{"$f":"CONCATENATE([Pin16],IF([Pin04]=\"\",\"\",\", \"&[Pin04]))","v":"L6"},{"$f":"CONCATENATE([Pin17],IF([Pin05]=\"\",\"\",\", \"&[Pin05]))","v":"L6"},{"$f":"CONCATENATE([Pin18],IF([Pin06]=\"\",\"\",\", \"&[Pin06]))","v":"L6"},{"$f":"CONCATENATE([Pin19],IF([Pin07]=\"\",\"\",\", \"&[Pin07]))","v":"L6"},{"$f":"CONCATENATE([Pin20],IF([Pin08]=\"\",\"\",\", \"&[Pin08]))","v":"L6"},{"$f":"CONCATENATE([Pin21],IF([Pin09]=\"\",\"\",\", \"&[Pin09]))","v":"L6"},{"$f":"CONCATENATE([Pin22],IF([Pin10]=\"\",\"\",\", \"&[Pin10]))","v":"L6"},{"$f":"CONCATENATE([Pin23],IF([Pin11]=\"\",\"\",\", \"&[Pin11]))","v":"L6"},{"$f":"CONCATENATE([Pin24],IF([Pin12]=\"\",\"\",\", \"&[Pin12]))","v":"L6"},{"$f":"CONCATENATE([Pin25],IF([Pin13]=\"\",\"\",\", \"&[Pin13]))","v":"L6"},{"$f":"IFERROR(INDEX(Table1[InOut],1/(1/SUMPRODUCT((Table1[Reps]=1)*(Table1[Name]=Table5[[#This Row],[Name]])*Table1[Seq]))),\"\")","v":"I/O"},{"$f":"IFERROR(INDEX(Table1[Level],1/(1/SUMPRODUCT((Table1[Reps]=1)*(Table1[Name]=Table5[[#This Row],[Name]])*Table1[Seq]))),\"\")","v":"TTL"},{"$f":"IFERROR(INDEX(Table1[Func],1/(1/SUMPRODUCT((Table1[Reps]=1)*(Table1[Name]=Table5[[#This Row],[Name]])*Table1[Seq]))),\"\")","v":"Capture/Compare/PWM1."}]
[null,null,null,"TDO","O","TTL","JTAGTDOandSWO.",{"$f":"COUNTIF(INDEX([Name],1):Table1[[#This Row],[Name]],[Name])","v":1},{"$f":"IF(ISTEXT([Pin]),[Seq],INDEX([Bnk],[Seq]-1))","v":15},16,null,null,"CCP2",{"$f":"IFERROR(INDEX(Table1[Pin],1/(1/SUMPRODUCT((Table1[Reps]=RIGHT(INDEX(Table5[#Headers],coln),2)*1)*(Table1[Name]=Table5[[#This Row],[Name]])*Table1[Bnk]))),\"\")","v":"D12"},{"$f":"IFERROR(INDEX(Table1[Pin],1/(1/SUMPRODUCT((Table1[Reps]=RIGHT(INDEX(Table5[#Headers],coln),2)*1)*(Table1[Name]=Table5[[#This Row],[Name]])*Table1[Bnk]))),\"\")","v":""},{"$f":"IFERROR(INDEX(Table1[Pin],1/(1/SUMPRODUCT((Table1[Reps]=RIGHT(INDEX(Table5[#Headers],coln),2)*1)*(Table1[Name]=Table5[[#This Row],[Name]])*Table1[Bnk]))),\"\")","v":""},{"$f":"IFERROR(INDEX(Table1[Pin],1/(1/SUMPRODUCT((Table1[Reps]=RIGHT(INDEX(Table5[#Headers],coln),2)*1)*(Table1[Name]=Table5[[#This Row],[Name]])*Table1[Bnk]))),\"\")","v":""},{"$f":"IFERROR(INDEX(Table1[Pin],1/(1/SUMPRODUCT((Table1[Reps]=RIGHT(INDEX(Table5[#Headers],coln),2)*1)*(Table1[Name]=Table5[[#This Row],[Name]])*Table1[Bnk]))),\"\")","v":""},{"$f":"IFERROR(INDEX(Table1[Pin],1/(1/SUMPRODUCT((Table1[Reps]=RIGHT(INDEX(Table5[#Headers],coln),2)*1)*(Table1[Name]=Table5[[#This Row],[Name]])*Table1[Bnk]))),\"\")","v":""},{"$f":"IFERROR(INDEX(Table1[Pin],1/(1/SUMPRODUCT((Table1[Reps]=RIGHT(INDEX(Table5[#Headers],coln),2)*1)*(Table1[Name]=Table5[[#This Row],[Name]])*Table1[Bnk]))),\"\")","v":""},{"$f":"IFERROR(INDEX(Table1[Pin],1/(1/SUMPRODUCT((Table1[Reps]=RIGHT(INDEX(Table5[#Headers],coln),2)*1)*(Table1[Name]=Table5[[#This Row],[Name]])*Table1[Bnk]))),\"\")","v":""},{"$f":"IFERROR(INDEX(Table1[Pin],1/(1/SUMPRODUCT((Table1[Reps]=RIGHT(INDEX(Table5[#Headers],coln),2)*1)*(Table1[Name]=Table5[[#This Row],[Name]])*Table1[Bnk]))),\"\")","v":""},{"$f":"IFERROR(INDEX(Table1[Pin],1/(1/SUMPRODUCT((Table1[Reps]=RIGHT(INDEX(Table5[#Headers],coln),2)*1)*(Table1[Name]=Table5[[#This Row],[Name]])*Table1[Bnk]))),\"\")","v":""},{"$f":"IFERROR(INDEX(Table1[Pin],1/(1/SUMPRODUCT((Table1[Reps]=RIGHT(INDEX(Table5[#Headers],coln),2)*1)*(Table1[Name]=Table5[[#This Row],[Name]])*Table1[Bnk]))),\"\")","v":""},{"$f":"IFERROR(INDEX(Table1[Pin],1/(1/SUMPRODUCT((Table1[Reps]=RIGHT(INDEX(Table5[#Headers],coln),2)*1)*(Table1[Name]=Table5[[#This Row],[Name]])*Table1[Bnk]))),\"\")","v":""},{"$f":"IFERROR(INDEX(Table1[Pin],1/(1/SUMPRODUCT((Table1[Reps]=RIGHT(INDEX(Table5[#Headers],coln),2)*1)*(Table1[Name]=Table5[[#This Row],[Name]])*Table1[Bnk]))),\"\")","v":""},{"$f":"[Pin01]","v":"D12"},{"$f":"CONCATENATE([Pin14],IF([Pin02]=\"\",\"\",\", \"&[Pin02]))","v":"D12"},{"$f":"CONCATENATE([Pin15],IF([Pin03]=\"\",\"\",\", \"&[Pin03]))","v":"D12"},{"$f":"CONCATENATE([Pin16],IF([Pin04]=\"\",\"\",\", \"&[Pin04]))","v":"D12"},{"$f":"CONCATENATE([Pin17],IF([Pin05]=\"\",\"\",\", \"&[Pin05]))","v":"D12"},{"$f":"CONCATENATE([Pin18],IF([Pin06]=\"\",\"\",\", \"&[Pin06]))","v":"D12"},{"$f":"CONCATENATE([Pin19],IF([Pin07]=\"\",\"\",\", \"&[Pin07]))","v":"D12"},{"$f":"CONCATENATE([Pin20],IF([Pin08]=\"\",\"\",\", \"&[Pin08]))","v":"D12"},{"$f":"CONCATENATE([Pin21],IF([Pin09]=\"\",\"\",\", \"&[Pin09]))","v":"D12"},{"$f":"CONCATENATE([Pin22],IF([Pin10]=\"\",\"\",\", \"&[Pin10]))","v":"D12"},{"$f":"CONCATENATE([Pin23],IF([Pin11]=\"\",\"\",\", \"&[Pin11]))","v":"D12"},{"$f":"CONCATENATE([Pin24],IF([Pin12]=\"\",\"\",\", \"&[Pin12]))","v":"D12"},{"$f":"CONCATENATE([Pin25],IF([Pin13]=\"\",\"\",\", \"&[Pin13]))","v":"D12"},{"$f":"IFERROR(INDEX(Table1[InOut],1/(1/SUMPRODUCT((Table1[Reps]=1)*(Table1[Name]=Table5[[#This Row],[Name]])*Table1[Seq]))),\"\")","v":"I/O"},{"$f":"IFERROR(INDEX(Table1[Level],1/(1/SUMPRODUCT((Table1[Reps]=1)*(Table1[Name]=Table5[[#This Row],[Name]])*Table1[Seq]))),\"\")","v":"TTL"},{"$f":"IFERROR(INDEX(Table1[Func],1/(1/SUMPRODUCT((Table1[Reps]=1)*(Table1[Name]=Table5[[#This Row],[Name]])*Table1[Seq]))),\"\")","v":"Capture/Compare/PWM2."}]
[null,null,null,"SWO","O","TTL","JTAGTDOandSWO.",{"$f":"COUNTIF(INDEX([Name],1):Table1[[#This Row],[Name]],[Name])","v":1},{"$f":"IF(ISTEXT([Pin]),[Seq],INDEX([Bnk],[Seq]-1))","v":15},17,null,null,"CCP3",{"$f":"IFERROR(INDEX(Table1[Pin],1/(1/SUMPRODUCT((Table1[Reps]=RIGHT(INDEX(Table5[#Headers],coln),2)*1)*(Table1[Name]=Table5[[#This Row],[Name]])*Table1[Bnk]))),\"\")","v":"M2"},{"$f":"IFERROR(INDEX(Table1[Pin],1/(1/SUMPRODUCT((Table1[Reps]=RIGHT(INDEX(Table5[#Headers],coln),2)*1)*(Table1[Name]=Table5[[#This Row],[Name]])*Table1[Bnk]))),\"\")","v":""},{"$f":"IFERROR(INDEX(Table1[Pin],1/(1/SUMPRODUCT((Table1[Reps]=RIGHT(INDEX(Table5[#Headers],coln),2)*1)*(Table1[Name]=Table5[[#This Row],[Name]])*Table1[Bnk]))),\"\")","v":""},{"$f":"IFERROR(INDEX(Table1[Pin],1/(1/SUMPRODUCT((Table1[Reps]=RIGHT(INDEX(Table5[#Headers],coln),2)*1)*(Table1[Name]=Table5[[#This Row],[Name]])*Table1[Bnk]))),\"\")","v":""},{"$f":"IFERROR(INDEX(Table1[Pin],1/(1/SUMPRODUCT((Table1[Reps]=RIGHT(INDEX(Table5[#Headers],coln),2)*1)*(Table1[Name]=Table5[[#This Row],[Name]])*Table1[Bnk]))),\"\")","v":""},{"$f":"IFERROR(INDEX(Table1[Pin],1/(1/SUMPRODUCT((Table1[Reps]=RIGHT(INDEX(Table5[#Headers],coln),2)*1)*(Table1[Name]=Table5[[#This Row],[Name]])*Table1[Bnk]))),\"\")","v":""},{"$f":"IFERROR(INDEX(Table1[Pin],1/(1/SUMPRODUCT((Table1[Reps]=RIGHT(INDEX(Table5[#Headers],coln),2)*1)*(Table1[Name]=Table5[[#This Row],[Name]])*Table1[Bnk]))),\"\")","v":""},{"$f":"IFERROR(INDEX(Table1[Pin],1/(1/SUMPRODUCT((Table1[Reps]=RIGHT(INDEX(Table5[#Headers],coln),2)*1)*(Table1[Name]=Table5[[#This Row],[Name]])*Table1[Bnk]))),\"\")","v":""},{"$f":"IFERROR(INDEX(Table1[Pin],1/(1/SUMPRODUCT((Table1[Reps]=RIGHT(INDEX(Table5[#Headers],coln),2)*1)*(Table1[Name]=Table5[[#This Row],[Name]])*Table1[Bnk]))),\"\")","v":""},{"$f":"IFERROR(INDEX(Table1[Pin],1/(1/SUMPRODUCT((Table1[Reps]=RIGHT(INDEX(Table5[#Headers],coln),2)*1)*(Table1[Name]=Table5[[#This Row],[Name]])*Table1[Bnk]))),\"\")","v":""},{"$f":"IFERROR(INDEX(Table1[Pin],1/(1/SUMPRODUCT((Table1[Reps]=RIGHT(INDEX(Table5[#Headers],coln),2)*1)*(Table1[Name]=Table5[[#This Row],[Name]])*Table1[Bnk]))),\"\")","v":""},{"$f":"IFERROR(INDEX(Table1[Pin],1/(1/SUMPRODUCT((Table1[Reps]=RIGHT(INDEX(Table5[#Headers],coln),2)*1)*(Table1[Name]=Table5[[#This Row],[Name]])*Table1[Bnk]))),\"\")","v":""},{"$f":"IFERROR(INDEX(Table1[Pin],1/(1/SUMPRODUCT((Table1[Reps]=RIGHT(INDEX(Table5[#Headers],coln),2)*1)*(Table1[Name]=Table5[[#This Row],[Name]])*Table1[Bnk]))),\"\")","v":""},{"$f":"[Pin01]","v":"M2"},{"$f":"CONCATENATE([Pin14],IF([Pin02]=\"\",\"\",\", \"&[Pin02]))","v":"M2"},{"$f":"CONCATENATE([Pin15],IF([Pin03]=\"\",\"\",\", \"&[Pin03]))","v":"M2"},{"$f":"CONCATENATE([Pin16],IF([Pin04]=\"\",\"\",\", \"&[Pin04]))","v":"M2"},{"$f":"CONCATENATE([Pin17],IF([Pin05]=\"\",\"\",\", \"&[Pin05]))","v":"M2"},{"$f":"CONCATENATE([Pin18],IF([Pin06]=\"\",\"\",\", \"&[Pin06]))","v":"M2"},{"$f":"CONCATENATE([Pin19],IF([Pin07]=\"\",\"\",\", \"&[Pin07]))","v":"M2"},{"$f":"CONCATENATE([Pin20],IF([Pin08]=\"\",\"\",\", \"&[Pin08]))","v":"M2"},{"$f":"CONCATENATE([Pin21],IF([Pin09]=\"\",\"\",\", \"&[Pin09]))","v":"M2"},{"$f":"CONCATENATE([Pin22],IF([Pin10]=\"\",\"\",\", \"&[Pin10]))","v":"M2"},{"$f":"CONCATENATE([Pin23],IF([Pin11]=\"\",\"\",\", \"&[Pin11]))","v":"M2"},{"$f":"CONCATENATE([Pin24],IF([Pin12]=\"\",\"\",\", \"&[Pin12]))","v":"M2"},{"$f":"CONCATENATE([Pin25],IF([Pin13]=\"\",\"\",\", \"&[Pin13]))","v":"M2"},{"$f":"IFERROR(INDEX(Table1[InOut],1/(1/SUMPRODUCT((Table1[Reps]=1)*(Table1[Name]=Table5[[#This Row],[Name]])*Table1[Seq]))),\"\")","v":"I/O"},{"$f":"IFERROR(INDEX(Table1[Level],1/(1/SUMPRODUCT((Table1[Reps]=1)*(Table1[Name]=Table5[[#This Row],[Name]])*Table1[Seq]))),\"\")","v":"TTL"},{"$f":"IFERROR(INDEX(Table1[Func],1/(1/SUMPRODUCT((Table1[Reps]=1)*(Table1[Name]=Table5[[#This Row],[Name]])*Table1[Seq]))),\"\")","v":"Capture/Compare/PWM3."}]
[null,null,"A11","PE0","I/O","TTL","GPIOportEbit0.",{"$f":"COUNTIF(INDEX([Name],1):Table1[[#This Row],[Name]],[Name])","v":1},{"$f":"IF(ISTEXT([Pin]),[Seq],INDEX([Bnk],[Seq]-1))","v":18},18,null,null,"CCP4",{"$f":"IFERROR(INDEX(Table1[Pin],1/(1/SUMPRODUCT((Table1[Reps]=RIGHT(INDEX(Table5[#Headers],coln),2)*1)*(Table1[Name]=Table5[[#This Row],[Name]])*Table1[Bnk]))),\"\")","v":"L2"},{"$f":"IFERROR(INDEX(Table1[Pin],1/(1/SUMPRODUCT((Table1[Reps]=RIGHT(INDEX(Table5[#Headers],coln),2)*1)*(Table1[Name]=Table5[[#This Row],[Name]])*Table1[Bnk]))),\"\")","v":""},{"$f":"IFERROR(INDEX(Table1[Pin],1/(1/SUMPRODUCT((Table1[Reps]=RIGHT(INDEX(Table5[#Headers],coln),2)*1)*(Table1[Name]=Table5[[#This Row],[Name]])*Table1[Bnk]))),\"\")","v":""},{"$f":"IFERROR(INDEX(Table1[Pin],1/(1/SUMPRODUCT((Table1[Reps]=RIGHT(INDEX(Table5[#Headers],coln),2)*1)*(Table1[Name]=Table5[[#This Row],[Name]])*Table1[Bnk]))),\"\")","v":""},{"$f":"IFERROR(INDEX(Table1[Pin],1/(1/SUMPRODUCT((Table1[Reps]=RIGHT(INDEX(Table5[#Headers],coln),2)*1)*(Table1[Name]=Table5[[#This Row],[Name]])*Table1[Bnk]))),\"\")","v":""},{"$f":"IFERROR(INDEX(Table1[Pin],1/(1/SUMPRODUCT((Table1[Reps]=RIGHT(INDEX(Table5[#Headers],coln),2)*1)*(Table1[Name]=Table5[[#This Row],[Name]])*Table1[Bnk]))),\"\")","v":""},{"$f":"IFERROR(INDEX(Table1[Pin],1/(1/SUMPRODUCT((Table1[Reps]=RIGHT(INDEX(Table5[#Headers],coln),2)*1)*(Table1[Name]=Table5[[#This Row],[Name]])*Table1[Bnk]))),\"\")","v":""},{"$f":"IFERROR(INDEX(Table1[Pin],1/(1/SUMPRODUCT((Table1[Reps]=RIGHT(INDEX(Table5[#Headers],coln),2)*1)*(Table1[Name]=Table5[[#This Row],[Name]])*Table1[Bnk]))),\"\")","v":""},{"$f":"IFERROR(INDEX(Table1[Pin],1/(1/SUMPRODUCT((Table1[Reps]=RIGHT(INDEX(Table5[#Headers],coln),2)*1)*(Table1[Name]=Table5[[#This Row],[Name]])*Table1[Bnk]))),\"\")","v":""},{"$f":"IFERROR(INDEX(Table1[Pin],1/(1/SUMPRODUCT((Table1[Reps]=RIGHT(INDEX(Table5[#Headers],coln),2)*1)*(Table1[Name]=Table5[[#This Row],[Name]])*Table1[Bnk]))),\"\")","v":""},{"$f":"IFERROR(INDEX(Table1[Pin],1/(1/SUMPRODUCT((Table1[Reps]=RIGHT(INDEX(Table5[#Headers],coln),2)*1)*(Table1[Name]=Table5[[#This Row],[Name]])*Table1[Bnk]))),\"\")","v":""},{"$f":"IFERROR(INDEX(Table1[Pin],1/(1/SUMPRODUCT((Table1[Reps]=RIGHT(INDEX(Table5[#Headers],coln),2)*1)*(Table1[Name]=Table5[[#This Row],[Name]])*Table1[Bnk]))),\"\")","v":""},{"$f":"IFERROR(INDEX(Table1[Pin],1/(1/SUMPRODUCT((Table1[Reps]=RIGHT(INDEX(Table5[#Headers],coln),2)*1)*(Table1[Name]=Table5[[#This Row],[Name]])*Table1[Bnk]))),\"\")","v":""},{"$f":"[Pin01]","v":"L2"},{"$f":"CONCATENATE([Pin14],IF([Pin02]=\"\",\"\",\", \"&[Pin02]))","v":"L2"},{"$f":"CONCATENATE([Pin15],IF([Pin03]=\"\",\"\",\", \"&[Pin03]))","v":"L2"},{"$f":"CONCATENATE([Pin16],IF([Pin04]=\"\",\"\",\", \"&[Pin04]))","v":"L2"},{"$f":"CONCATENATE([Pin17],IF([Pin05]=\"\",\"\",\", \"&[Pin05]))","v":"L2"},{"$f":"CONCATENATE([Pin18],IF([Pin06]=\"\",\"\",\", \"&[Pin06]))","v":"L2"},{"$f":"CONCATENATE([Pin19],IF([Pin07]=\"\",\"\",\", \"&[Pin07]))","v":"L2"},{"$f":"CONCATENATE([Pin20],IF([Pin08]=\"\",\"\",\", \"&[Pin08]))","v":"L2"},{"$f":"CONCATENATE([Pin21],IF([Pin09]=\"\",\"\",\", \"&[Pin09]))","v":"L2"},{"$f":"CONCATENATE([Pin22],IF([Pin10]=\"\",\"\",\", \"&[Pin10]))","v":"L2"},{"$f":"CONCATENATE([Pin23],IF([Pin11]=\"\",\"\",\", \"&[Pin11]))","v":"L2"},{"$f":"CONCATENATE([Pin24],IF([Pin12]=\"\",\"\",\", \"&[Pin12]))","v":"L2"},{"$f":"CONCATENATE([Pin25],IF([Pin13]=\"\",\"\",\", \"&[Pin13]))","v":"L2"},{"$f":"IFERROR(INDEX(Table1[InOut],1/(1/SUMPRODUCT((Table1[Reps]=1)*(Table1[Name]=Table5[[#This Row],[Name]])*Table1[Seq]))),\"\")","v":"I/O"},{"$f":"IFERROR(INDEX(Table1[Level],1/(1/SUMPRODUCT((Table1[Reps]=1)*(Table1[Name]=Table5[[#This Row],[Name]])*Table1[Seq]))),\"\")","v":"TTL"},{"$f":"IFERROR(INDEX(Table1[Func],1/(1/SUMPRODUCT((Table1[Reps]=1)*(Table1[Name]=Table5[[#This Row],[Name]])*Table1[Seq]))),\"\")","v":"Capture/Compare/PWM4."}]
[null,null,null,"SSI1Clk","I/O","TTL","SSImodule1clock.",{"$f":"COUNTIF(INDEX([Name],1):Table1[[#This Row],[Name]],[Name])","v":1},{"$f":"IF(ISTEXT([Pin]),[Seq],INDEX([Bnk],[Seq]-1))","v":18},19,null,null,"CCP5",{"$f":"IFERROR(INDEX(Table1[Pin],1/(1/SUMPRODUCT((Table1[Reps]=RIGHT(INDEX(Table5[#Headers],coln),2)*1)*(Table1[Name]=Table5[[#This Row],[Name]])*Table1[Bnk]))),\"\")","v":"L1"},{"$f":"IFERROR(INDEX(Table1[Pin],1/(1/SUMPRODUCT((Table1[Reps]=RIGHT(INDEX(Table5[#Headers],coln),2)*1)*(Table1[Name]=Table5[[#This Row],[Name]])*Table1[Bnk]))),\"\")","v":""},{"$f":"IFERROR(INDEX(Table1[Pin],1/(1/SUMPRODUCT((Table1[Reps]=RIGHT(INDEX(Table5[#Headers],coln),2)*1)*(Table1[Name]=Table5[[#This Row],[Name]])*Table1[Bnk]))),\"\")","v":""},{"$f":"IFERROR(INDEX(Table1[Pin],1/(1/SUMPRODUCT((Table1[Reps]=RIGHT(INDEX(Table5[#Headers],coln),2)*1)*(Table1[Name]=Table5[[#This Row],[Name]])*Table1[Bnk]))),\"\")","v":""},{"$f":"IFERROR(INDEX(Table1[Pin],1/(1/SUMPRODUCT((Table1[Reps]=RIGHT(INDEX(Table5[#Headers],coln),2)*1)*(Table1[Name]=Table5[[#This Row],[Name]])*Table1[Bnk]))),\"\")","v":""},{"$f":"IFERROR(INDEX(Table1[Pin],1/(1/SUMPRODUCT((Table1[Reps]=RIGHT(INDEX(Table5[#Headers],coln),2)*1)*(Table1[Name]=Table5[[#This Row],[Name]])*Table1[Bnk]))),\"\")","v":""},{"$f":"IFERROR(INDEX(Table1[Pin],1/(1/SUMPRODUCT((Table1[Reps]=RIGHT(INDEX(Table5[#Headers],coln),2)*1)*(Table1[Name]=Table5[[#This Row],[Name]])*Table1[Bnk]))),\"\")","v":""},{"$f":"IFERROR(INDEX(Table1[Pin],1/(1/SUMPRODUCT((Table1[Reps]=RIGHT(INDEX(Table5[#Headers],coln),2)*1)*(Table1[Name]=Table5[[#This Row],[Name]])*Table1[Bnk]))),\"\")","v":""},{"$f":"IFERROR(INDEX(Table1[Pin],1/(1/SUMPRODUCT((Table1[Reps]=RIGHT(INDEX(Table5[#Headers],coln),2)*1)*(Table1[Name]=Table5[[#This Row],[Name]])*Table1[Bnk]))),\"\")","v":""},{"$f":"IFERROR(INDEX(Table1[Pin],1/(1/SUMPRODUCT((Table1[Reps]=RIGHT(INDEX(Table5[#Headers],coln),2)*1)*(Table1[Name]=Table5[[#This Row],[Name]])*Table1[Bnk]))),\"\")","v":""},{"$f":"IFERROR(INDEX(Table1[Pin],1/(1/SUMPRODUCT((Table1[Reps]=RIGHT(INDEX(Table5[#Headers],coln),2)*1)*(Table1[Name]=Table5[[#This Row],[Name]])*Table1[Bnk]))),\"\")","v":""},{"$f":"IFERROR(INDEX(Table1[Pin],1/(1/SUMPRODUCT((Table1[Reps]=RIGHT(INDEX(Table5[#Headers],coln),2)*1)*(Table1[Name]=Table5[[#This Row],[Name]])*Table1[Bnk]))),\"\")","v":""},{"$f":"IFERROR(INDEX(Table1[Pin],1/(1/SUMPRODUCT((Table1[Reps]=RIGHT(INDEX(Table5[#Headers],coln),2)*1)*(Table1[Name]=Table5[[#This Row],[Name]])*Table1[Bnk]))),\"\")","v":""},{"$f":"[Pin01]","v":"L1"},{"$f":"CONCATENATE([Pin14],IF([Pin02]=\"\",\"\",\", \"&[Pin02]))","v":"L1"},{"$f":"CONCATENATE([Pin15],IF([Pin03]=\"\",\"\",\", \"&[Pin03]))","v":"L1"},{"$f":"CONCATENATE([Pin16],IF([Pin04]=\"\",\"\",\", \"&[Pin04]))","v":"L1"},{"$f":"CONCATENATE([Pin17],IF([Pin05]=\"\",\"\",\", \"&[Pin05]))","v":"L1"},{"$f":"CONCATENATE([Pin18],IF([Pin06]=\"\",\"\",\", \"&[Pin06]))","v":"L1"},{"$f":"CONCATENATE([Pin19],IF([Pin07]=\"\",\"\",\", \"&[Pin07]))","v":"L1"},{"$f":"CONCATENATE([Pin20],IF([Pin08]=\"\",\"\",\", \"&[Pin08]))","v":"L1"},{"$f":"CONCATENATE([Pin21],IF([Pin09]=\"\",\"\",\", \"&[Pin09]))","v":"L1"},{"$f":"CONCATENATE([Pin22],IF([Pin10]=\"\",\"\",\", \"&[Pin10]))","v":"L1"},{"$f":"CONCATENATE([Pin23],IF([Pin11]=\"\",\"\",\", \"&[Pin11]))","v":"L1"},{"$f":"CONCATENATE([Pin24],IF([Pin12]=\"\",\"\",\", \"&[Pin12]))","v":"L1"},{"$f":"CONCATENATE([Pin25],IF([Pin13]=\"\",\"\",\", \"&[Pin13]))","v":"L1"},{"$f":"IFERROR(INDEX(Table1[InOut],1/(1/SUMPRODUCT((Table1[Reps]=1)*(Table1[Name]=Table5[[#This Row],[Name]])*Table1[Seq]))),\"\")","v":"I/O"},{"$f":"IFERROR(INDEX(Table1[Level],1/(1/SUMPRODUCT((Table1[Reps]=1)*(Table1[Name]=Table5[[#This Row],[Name]])*Table1[Seq]))),\"\")","v":"TTL"},{"$f":"IFERROR(INDEX(Table1[Func],1/(1/SUMPRODUCT((Table1[Reps]=1)*(Table1[Name]=Table5[[#This Row],[Name]])*Table1[Seq]))),\"\")","v":"Capture/Compare/PWM5."}]
[null,null,"A12","PE3","I/O","TTL","GPIOportEbit3.",{"$f":"COUNTIF(INDEX([Name],1):Table1[[#This Row],[Name]],[Name])","v":1},{"$f":"IF(ISTEXT([Pin]),[Seq],INDEX([Bnk],[Seq]-1))","v":20},20,null,null,"CMOD0",{"$f":"IFERROR(INDEX(Table1[Pin],1/(1/SUMPRODUCT((Table1[Reps]=RIGHT(INDEX(Table5[#Headers],coln),2)*1)*(Table1[Name]=Table5[[#This Row],[Name]])*Table1[Bnk]))),\"\")","v":"E11"},{"$f":"IFERROR(INDEX(Table1[Pin],1/(1/SUMPRODUCT((Table1[Reps]=RIGHT(INDEX(Table5[#Headers],coln),2)*1)*(Table1[Name]=Table5[[#This Row],[Name]])*Table1[Bnk]))),\"\")","v":""},{"$f":"IFERROR(INDEX(Table1[Pin],1/(1/SUMPRODUCT((Table1[Reps]=RIGHT(INDEX(Table5[#Headers],coln),2)*1)*(Table1[Name]=Table5[[#This Row],[Name]])*Table1[Bnk]))),\"\")","v":""},{"$f":"IFERROR(INDEX(Table1[Pin],1/(1/SUMPRODUCT((Table1[Reps]=RIGHT(INDEX(Table5[#Headers],coln),2)*1)*(Table1[Name]=Table5[[#This Row],[Name]])*Table1[Bnk]))),\"\")","v":""},{"$f":"IFERROR(INDEX(Table1[Pin],1/(1/SUMPRODUCT((Table1[Reps]=RIGHT(INDEX(Table5[#Headers],coln),2)*1)*(Table1[Name]=Table5[[#This Row],[Name]])*Table1[Bnk]))),\"\")","v":""},{"$f":"IFERROR(INDEX(Table1[Pin],1/(1/SUMPRODUCT((Table1[Reps]=RIGHT(INDEX(Table5[#Headers],coln),2)*1)*(Table1[Name]=Table5[[#This Row],[Name]])*Table1[Bnk]))),\"\")","v":""},{"$f":"IFERROR(INDEX(Table1[Pin],1/(1/SUMPRODUCT((Table1[Reps]=RIGHT(INDEX(Table5[#Headers],coln),2)*1)*(Table1[Name]=Table5[[#This Row],[Name]])*Table1[Bnk]))),\"\")","v":""},{"$f":"IFERROR(INDEX(Table1[Pin],1/(1/SUMPRODUCT((Table1[Reps]=RIGHT(INDEX(Table5[#Headers],coln),2)*1)*(Table1[Name]=Table5[[#This Row],[Name]])*Table1[Bnk]))),\"\")","v":""},{"$f":"IFERROR(INDEX(Table1[Pin],1/(1/SUMPRODUCT((Table1[Reps]=RIGHT(INDEX(Table5[#Headers],coln),2)*1)*(Table1[Name]=Table5[[#This Row],[Name]])*Table1[Bnk]))),\"\")","v":""},{"$f":"IFERROR(INDEX(Table1[Pin],1/(1/SUMPRODUCT((Table1[Reps]=RIGHT(INDEX(Table5[#Headers],coln),2)*1)*(Table1[Name]=Table5[[#This Row],[Name]])*Table1[Bnk]))),\"\")","v":""},{"$f":"IFERROR(INDEX(Table1[Pin],1/(1/SUMPRODUCT((Table1[Reps]=RIGHT(INDEX(Table5[#Headers],coln),2)*1)*(Table1[Name]=Table5[[#This Row],[Name]])*Table1[Bnk]))),\"\")","v":""},{"$f":"IFERROR(INDEX(Table1[Pin],1/(1/SUMPRODUCT((Table1[Reps]=RIGHT(INDEX(Table5[#Headers],coln),2)*1)*(Table1[Name]=Table5[[#This Row],[Name]])*Table1[Bnk]))),\"\")","v":""},{"$f":"IFERROR(INDEX(Table1[Pin],1/(1/SUMPRODUCT((Table1[Reps]=RIGHT(INDEX(Table5[#Headers],coln),2)*1)*(Table1[Name]=Table5[[#This Row],[Name]])*Table1[Bnk]))),\"\")","v":""},{"$f":"[Pin01]","v":"E11"},{"$f":"CONCATENATE([Pin14],IF([Pin02]=\"\",\"\",\", \"&[Pin02]))","v":"E11"},{"$f":"CONCATENATE([Pin15],IF([Pin03]=\"\",\"\",\", \"&[Pin03]))","v":"E11"},{"$f":"CONCATENATE([Pin16],IF([Pin04]=\"\",\"\",\", \"&[Pin04]))","v":"E11"},{"$f":"CONCATENATE([Pin17],IF([Pin05]=\"\",\"\",\", \"&[Pin05]))","v":"E11"},{"$f":"CONCATENATE([Pin18],IF([Pin06]=\"\",\"\",\", \"&[Pin06]))","v":"E11"},{"$f":"CONCATENATE([Pin19],IF([Pin07]=\"\",\"\",\", \"&[Pin07]))","v":"E11"},{"$f":"CONCATENATE([Pin20],IF([Pin08]=\"\",\"\",\", \"&[Pin08]))","v":"E11"},{"$f":"CONCATENATE([Pin21],IF([Pin09]=\"\",\"\",\", \"&[Pin09]))","v":"E11"},{"$f":"CONCATENATE([Pin22],IF([Pin10]=\"\",\"\",\", \"&[Pin10]))","v":"E11"},{"$f":"CONCATENATE([Pin23],IF([Pin11]=\"\",\"\",\", \"&[Pin11]))","v":"E11"},{"$f":"CONCATENATE([Pin24],IF([Pin12]=\"\",\"\",\", \"&[Pin12]))","v":"E11"},{"$f":"CONCATENATE([Pin25],IF([Pin13]=\"\",\"\",\", \"&[Pin13]))","v":"E11"},{"$f":"IFERROR(INDEX(Table1[InOut],1/(1/SUMPRODUCT((Table1[Reps]=1)*(Table1[Name]=Table5[[#This Row],[Name]])*Table1[Seq]))),\"\")","v":"I/O"},{"$f":"IFERROR(INDEX(Table1[Level],1/(1/SUMPRODUCT((Table1[Reps]=1)*(Table1[Name]=Table5[[#This Row],[Name]])*Table1[Seq]))),\"\")","v":"TTL"},{"$f":"IFERROR(INDEX(Table1[Func],1/(1/SUMPRODUCT((Table1[Reps]=1)*(Table1[Name]=Table5[[#This Row],[Name]])*Table1[Seq]))),\"\")","v":"CPUModebit0.Inputmustbesettologic0(grounded);other"}]
[null,null,null,"SSI1Tx","O","TTL","SSImodule1transmit.",{"$f":"COUNTIF(INDEX([Name],1):Table1[[#This Row],[Name]],[Name])","v":1},{"$f":"IF(ISTEXT([Pin]),[Seq],INDEX([Bnk],[Seq]-1))","v":20},21,null,null,"CMOD1",{"$f":"IFERROR(INDEX(Table1[Pin],1/(1/SUMPRODUCT((Table1[Reps]=RIGHT(INDEX(Table5[#Headers],coln),2)*1)*(Table1[Name]=Table5[[#This Row],[Name]])*Table1[Bnk]))),\"\")","v":"B10"},{"$f":"IFERROR(INDEX(Table1[Pin],1/(1/SUMPRODUCT((Table1[Reps]=RIGHT(INDEX(Table5[#Headers],coln),2)*1)*(Table1[Name]=Table5[[#This Row],[Name]])*Table1[Bnk]))),\"\")","v":""},{"$f":"IFERROR(INDEX(Table1[Pin],1/(1/SUMPRODUCT((Table1[Reps]=RIGHT(INDEX(Table5[#Headers],coln),2)*1)*(Table1[Name]=Table5[[#This Row],[Name]])*Table1[Bnk]))),\"\")","v":""},{"$f":"IFERROR(INDEX(Table1[Pin],1/(1/SUMPRODUCT((Table1[Reps]=RIGHT(INDEX(Table5[#Headers],coln),2)*1)*(Table1[Name]=Table5[[#This Row],[Name]])*Table1[Bnk]))),\"\")","v":""},{"$f":"IFERROR(INDEX(Table1[Pin],1/(1/SUMPRODUCT((Table1[Reps]=RIGHT(INDEX(Table5[#Headers],coln),2)*1)*(Table1[Name]=Table5[[#This Row],[Name]])*Table1[Bnk]))),\"\")","v":""},{"$f":"IFERROR(INDEX(Table1[Pin],1/(1/SUMPRODUCT((Table1[Reps]=RIGHT(INDEX(Table5[#Headers],coln),2)*1)*(Table1[Name]=Table5[[#This Row],[Name]])*Table1[Bnk]))),\"\")","v":""},{"$f":"IFERROR(INDEX(Table1[Pin],1/(1/SUMPRODUCT((Table1[Reps]=RIGHT(INDEX(Table5[#Headers],coln),2)*1)*(Table1[Name]=Table5[[#This Row],[Name]])*Table1[Bnk]))),\"\")","v":""},{"$f":"IFERROR(INDEX(Table1[Pin],1/(1/SUMPRODUCT((Table1[Reps]=RIGHT(INDEX(Table5[#Headers],coln),2)*1)*(Table1[Name]=Table5[[#This Row],[Name]])*Table1[Bnk]))),\"\")","v":""},{"$f":"IFERROR(INDEX(Table1[Pin],1/(1/SUMPRODUCT((Table1[Reps]=RIGHT(INDEX(Table5[#Headers],coln),2)*1)*(Table1[Name]=Table5[[#This Row],[Name]])*Table1[Bnk]))),\"\")","v":""},{"$f":"IFERROR(INDEX(Table1[Pin],1/(1/SUMPRODUCT((Table1[Reps]=RIGHT(INDEX(Table5[#Headers],coln),2)*1)*(Table1[Name]=Table5[[#This Row],[Name]])*Table1[Bnk]))),\"\")","v":""},{"$f":"IFERROR(INDEX(Table1[Pin],1/(1/SUMPRODUCT((Table1[Reps]=RIGHT(INDEX(Table5[#Headers],coln),2)*1)*(Table1[Name]=Table5[[#This Row],[Name]])*Table1[Bnk]))),\"\")","v":""},{"$f":"IFERROR(INDEX(Table1[Pin],1/(1/SUMPRODUCT((Table1[Reps]=RIGHT(INDEX(Table5[#Headers],coln),2)*1)*(Table1[Name]=Table5[[#This Row],[Name]])*Table1[Bnk]))),\"\")","v":""},{"$f":"IFERROR(INDEX(Table1[Pin],1/(1/SUMPRODUCT((Table1[Reps]=RIGHT(INDEX(Table5[#Headers],coln),2)*1)*(Table1[Name]=Table5[[#This Row],[Name]])*Table1[Bnk]))),\"\")","v":""},{"$f":"[Pin01]","v":"B10"},{"$f":"CONCATENATE([Pin14],IF([Pin02]=\"\",\"\",\", \"&[Pin02]))","v":"B10"},{"$f":"CONCATENATE([Pin15],IF([Pin03]=\"\",\"\",\", \"&[Pin03]))","v":"B10"},{"$f":"CONCATENATE([Pin16],IF([Pin04]=\"\",\"\",\", \"&[Pin04]))","v":"B10"},{"$f":"CONCATENATE([Pin17],IF([Pin05]=\"\",\"\",\", \"&[Pin05]))","v":"B10"},{"$f":"CONCATENATE([Pin18],IF([Pin06]=\"\",\"\",\", \"&[Pin06]))","v":"B10"},{"$f":"CONCATENATE([Pin19],IF([Pin07]=\"\",\"\",\", \"&[Pin07]))","v":"B10"},{"$f":"CONCATENATE([Pin20],IF([Pin08]=\"\",\"\",\", \"&[Pin08]))","v":"B10"},{"$f":"CONCATENATE([Pin21],IF([Pin09]=\"\",\"\",\", \"&[Pin09]))","v":"B10"},{"$f":"CONCATENATE([Pin22],IF([Pin10]=\"\",\"\",\", \"&[Pin10]))","v":"B10"},{"$f":"CONCATENATE([Pin23],IF([Pin11]=\"\",\"\",\", \"&[Pin11]))","v":"B10"},{"$f":"CONCATENATE([Pin24],IF([Pin12]=\"\",\"\",\", \"&[Pin12]))","v":"B10"},{"$f":"CONCATENATE([Pin25],IF([Pin13]=\"\",\"\",\", \"&[Pin13]))","v":"B10"},{"$f":"IFERROR(INDEX(Table1[InOut],1/(1/SUMPRODUCT((Table1[Reps]=1)*(Table1[Name]=Table5[[#This Row],[Name]])*Table1[Seq]))),\"\")","v":"I/O"},{"$f":"IFERROR(INDEX(Table1[Level],1/(1/SUMPRODUCT((Table1[Reps]=1)*(Table1[Name]=Table5[[#This Row],[Name]])*Table1[Seq]))),\"\")","v":"TTL"},{"$f":"IFERROR(INDEX(Table1[Func],1/(1/SUMPRODUCT((Table1[Reps]=1)*(Table1[Name]=Table5[[#This Row],[Name]])*Table1[Seq]))),\"\")","v":"CPUModebit1.Inputmustbesettologic0(grounded);other"}]
[null,null,"B1","ADC0","I","Analog","Analog-to-digitalconverterinput0.",{"$f":"COUNTIF(INDEX([Name],1):Table1[[#This Row],[Name]],[Name])","v":1},{"$f":"IF(ISTEXT([Pin]),[Seq],INDEX([Bnk],[Seq]-1))","v":22},22,null,null,"ERBIAS",{"$f":"IFERROR(INDEX(Table1[Pin],1/(1/SUMPRODUCT((Table1[Reps]=RIGHT(INDEX(Table5[#Headers],coln),2)*1)*(Table1[Name]=Table5[[#This Row],[Name]])*Table1[Bnk]))),\"\")","v":"K3"},{"$f":"IFERROR(INDEX(Table1[Pin],1/(1/SUMPRODUCT((Table1[Reps]=RIGHT(INDEX(Table5[#Headers],coln),2)*1)*(Table1[Name]=Table5[[#This Row],[Name]])*Table1[Bnk]))),\"\")","v":""},{"$f":"IFERROR(INDEX(Table1[Pin],1/(1/SUMPRODUCT((Table1[Reps]=RIGHT(INDEX(Table5[#Headers],coln),2)*1)*(Table1[Name]=Table5[[#This Row],[Name]])*Table1[Bnk]))),\"\")","v":""},{"$f":"IFERROR(INDEX(Table1[Pin],1/(1/SUMPRODUCT((Table1[Reps]=RIGHT(INDEX(Table5[#Headers],coln),2)*1)*(Table1[Name]=Table5[[#This Row],[Name]])*Table1[Bnk]))),\"\")","v":""},{"$f":"IFERROR(INDEX(Table1[Pin],1/(1/SUMPRODUCT((Table1[Reps]=RIGHT(INDEX(Table5[#Headers],coln),2)*1)*(Table1[Name]=Table5[[#This Row],[Name]])*Table1[Bnk]))),\"\")","v":""},{"$f":"IFERROR(INDEX(Table1[Pin],1/(1/SUMPRODUCT((Table1[Reps]=RIGHT(INDEX(Table5[#Headers],coln),2)*1)*(Table1[Name]=Table5[[#This Row],[Name]])*Table1[Bnk]))),\"\")","v":""},{"$f":"IFERROR(INDEX(Table1[Pin],1/(1/SUMPRODUCT((Table1[Reps]=RIGHT(INDEX(Table5[#Headers],coln),2)*1)*(Table1[Name]=Table5[[#This Row],[Name]])*Table1[Bnk]))),\"\")","v":""},{"$f":"IFERROR(INDEX(Table1[Pin],1/(1/SUMPRODUCT((Table1[Reps]=RIGHT(INDEX(Table5[#Headers],coln),2)*1)*(Table1[Name]=Table5[[#This Row],[Name]])*Table1[Bnk]))),\"\")","v":""},{"$f":"IFERROR(INDEX(Table1[Pin],1/(1/SUMPRODUCT((Table1[Reps]=RIGHT(INDEX(Table5[#Headers],coln),2)*1)*(Table1[Name]=Table5[[#This Row],[Name]])*Table1[Bnk]))),\"\")","v":""},{"$f":"IFERROR(INDEX(Table1[Pin],1/(1/SUMPRODUCT((Table1[Reps]=RIGHT(INDEX(Table5[#Headers],coln),2)*1)*(Table1[Name]=Table5[[#This Row],[Name]])*Table1[Bnk]))),\"\")","v":""},{"$f":"IFERROR(INDEX(Table1[Pin],1/(1/SUMPRODUCT((Table1[Reps]=RIGHT(INDEX(Table5[#Headers],coln),2)*1)*(Table1[Name]=Table5[[#This Row],[Name]])*Table1[Bnk]))),\"\")","v":""},{"$f":"IFERROR(INDEX(Table1[Pin],1/(1/SUMPRODUCT((Table1[Reps]=RIGHT(INDEX(Table5[#Headers],coln),2)*1)*(Table1[Name]=Table5[[#This Row],[Name]])*Table1[Bnk]))),\"\")","v":""},{"$f":"IFERROR(INDEX(Table1[Pin],1/(1/SUMPRODUCT((Table1[Reps]=RIGHT(INDEX(Table5[#Headers],coln),2)*1)*(Table1[Name]=Table5[[#This Row],[Name]])*Table1[Bnk]))),\"\")","v":""},{"$f":"[Pin01]","v":"K3"},{"$f":"CONCATENATE([Pin14],IF([Pin02]=\"\",\"\",\", \"&[Pin02]))","v":"K3"},{"$f":"CONCATENATE([Pin15],IF([Pin03]=\"\",\"\",\", \"&[Pin03]))","v":"K3"},{"$f":"CONCATENATE([Pin16],IF([Pin04]=\"\",\"\",\", \"&[Pin04]))","v":"K3"},{"$f":"CONCATENATE([Pin17],IF([Pin05]=\"\",\"\",\", \"&[Pin05]))","v":"K3"},{"$f":"CONCATENATE([Pin18],IF([Pin06]=\"\",\"\",\", \"&[Pin06]))","v":"K3"},{"$f":"CONCATENATE([Pin19],IF([Pin07]=\"\",\"\",\", \"&[Pin07]))","v":"K3"},{"$f":"CONCATENATE([Pin20],IF([Pin08]=\"\",\"\",\", \"&[Pin08]))","v":"K3"},{"$f":"CONCATENATE([Pin21],IF([Pin09]=\"\",\"\",\", \"&[Pin09]))","v":"K3"},{"$f":"CONCATENATE([Pin22],IF([Pin10]=\"\",\"\",\", \"&[Pin10]))","v":"K3"},{"$f":"CONCATENATE([Pin23],IF([Pin11]=\"\",\"\",\", \"&[Pin11]))","v":"K3"},{"$f":"CONCATENATE([Pin24],IF([Pin12]=\"\",\"\",\", \"&[Pin12]))","v":"K3"},{"$f":"CONCATENATE([Pin25],IF([Pin13]=\"\",\"\",\", \"&[Pin13]))","v":"K3"},{"$f":"IFERROR(INDEX(Table1[InOut],1/(1/SUMPRODUCT((Table1[Reps]=1)*(Table1[Name]=Table5[[#This Row],[Name]])*Table1[Seq]))),\"\")","v":"I"},{"$f":"IFERROR(INDEX(Table1[Level],1/(1/SUMPRODUCT((Table1[Reps]=1)*(Table1[Name]=Table5[[#This Row],[Name]])*Table1[Seq]))),\"\")","v":"Analog"},{"$f":"IFERROR(INDEX(Table1[Func],1/(1/SUMPRODUCT((Table1[Reps]=1)*(Table1[Name]=Table5[[#This Row],[Name]])*Table1[Seq]))),\"\")","v":"12.4-kOresistor(1%precision)usedinternallyforEthernetPHY."}]
[null,null,"B2","ADC3","I","Analog","Analog-to-digitalconverterinput3.",{"$f":"COUNTIF(INDEX([Name],1):Table1[[#This Row],[Name]],[Name])","v":1},{"$f":"IF(ISTEXT([Pin]),[Seq],INDEX([Bnk],[Seq]-1))","v":23},23,null,null,"GND",{"$f":"IFERROR(INDEX(Table1[Pin],1/(1/SUMPRODUCT((Table1[Reps]=RIGHT(INDEX(Table5[#Headers],coln),2)*1)*(Table1[Name]=Table5[[#This Row],[Name]])*Table1[Bnk]))),\"\")","v":"B6"},{"$f":"IFERROR(INDEX(Table1[Pin],1/(1/SUMPRODUCT((Table1[Reps]=RIGHT(INDEX(Table5[#Headers],coln),2)*1)*(Table1[Name]=Table5[[#This Row],[Name]])*Table1[Bnk]))),\"\")","v":"C4"},{"$f":"IFERROR(INDEX(Table1[Pin],1/(1/SUMPRODUCT((Table1[Reps]=RIGHT(INDEX(Table5[#Headers],coln),2)*1)*(Table1[Name]=Table5[[#This Row],[Name]])*Table1[Bnk]))),\"\")","v":"C5"},{"$f":"IFERROR(INDEX(Table1[Pin],1/(1/SUMPRODUCT((Table1[Reps]=RIGHT(INDEX(Table5[#Headers],coln),2)*1)*(Table1[Name]=Table5[[#This Row],[Name]])*Table1[Bnk]))),\"\")","v":"F10"},{"$f":"IFERROR(INDEX(Table1[Pin],1/(1/SUMPRODUCT((Table1[Reps]=RIGHT(INDEX(Table5[#Headers],coln),2)*1)*(Table1[Name]=Table5[[#This Row],[Name]])*Table1[Bnk]))),\"\")","v":"F11"},{"$f":"IFERROR(INDEX(Table1[Pin],1/(1/SUMPRODUCT((Table1[Reps]=RIGHT(INDEX(Table5[#Headers],coln),2)*1)*(Table1[Name]=Table5[[#This Row],[Name]])*Table1[Bnk]))),\"\")","v":"F12"},{"$f":"IFERROR(INDEX(Table1[Pin],1/(1/SUMPRODUCT((Table1[Reps]=RIGHT(INDEX(Table5[#Headers],coln),2)*1)*(Table1[Name]=Table5[[#This Row],[Name]])*Table1[Bnk]))),\"\")","v":"H3"},{"$f":"IFERROR(INDEX(Table1[Pin],1/(1/SUMPRODUCT((Table1[Reps]=RIGHT(INDEX(Table5[#Headers],coln),2)*1)*(Table1[Name]=Table5[[#This Row],[Name]])*Table1[Bnk]))),\"\")","v":"J3"},{"$f":"IFERROR(INDEX(Table1[Pin],1/(1/SUMPRODUCT((Table1[Reps]=RIGHT(INDEX(Table5[#Headers],coln),2)*1)*(Table1[Name]=Table5[[#This Row],[Name]])*Table1[Bnk]))),\"\")","v":"J10"},{"$f":"IFERROR(INDEX(Table1[Pin],1/(1/SUMPRODUCT((Table1[Reps]=RIGHT(INDEX(Table5[#Headers],coln),2)*1)*(Table1[Name]=Table5[[#This Row],[Name]])*Table1[Bnk]))),\"\")","v":"K5"},{"$f":"IFERROR(INDEX(Table1[Pin],1/(1/SUMPRODUCT((Table1[Reps]=RIGHT(INDEX(Table5[#Headers],coln),2)*1)*(Table1[Name]=Table5[[#This Row],[Name]])*Table1[Bnk]))),\"\")","v":"K6"},{"$f":"IFERROR(INDEX(Table1[Pin],1/(1/SUMPRODUCT((Table1[Reps]=RIGHT(INDEX(Table5[#Headers],coln),2)*1)*(Table1[Name]=Table5[[#This Row],[Name]])*Table1[Bnk]))),\"\")","v":"K10"},{"$f":"IFERROR(INDEX(Table1[Pin],1/(1/SUMPRODUCT((Table1[Reps]=RIGHT(INDEX(Table5[#Headers],coln),2)*1)*(Table1[Name]=Table5[[#This Row],[Name]])*Table1[Bnk]))),\"\")","v":"L10"},{"$f":"[Pin01]","v":"B6"},{"$f":"CONCATENATE([Pin14],IF([Pin02]=\"\",\"\",\", \"&[Pin02]))","v":"B6, C4"},{"$f":"CONCATENATE([Pin15],IF([Pin03]=\"\",\"\",\", \"&[Pin03]))","v":"B6, C4, C5"},{"$f":"CONCATENATE([Pin16],IF([Pin04]=\"\",\"\",\", \"&[Pin04]))","v":"B6, C4, C5, F10"},{"$f":"CONCATENATE([Pin17],IF([Pin05]=\"\",\"\",\", \"&[Pin05]))","v":"B6, C4, C5, F10, F11"},{"$f":"CONCATENATE([Pin18],IF([Pin06]=\"\",\"\",\", \"&[Pin06]))","v":"B6, C4, C5, F10, F11, F12"},{"$f":"CONCATENATE([Pin19],IF([Pin07]=\"\",\"\",\", \"&[Pin07]))","v":"B6, C4, C5, F10, F11, F12, H3"},{"$f":"CONCATENATE([Pin20],IF([Pin08]=\"\",\"\",\", \"&[Pin08]))","v":"B6, C4, C5, F10, F11, F12, H3, J3"},{"$f":"CONCATENATE([Pin21],IF([Pin09]=\"\",\"\",\", \"&[Pin09]))","v":"B6, C4, C5, F10, F11, F12, H3, J3, J10"},{"$f":"CONCATENATE([Pin22],IF([Pin10]=\"\",\"\",\", \"&[Pin10]))","v":"B6, C4, C5, F10, F11, F12, H3, J3, J10, K5"},{"$f":"CONCATENATE([Pin23],IF([Pin11]=\"\",\"\",\", \"&[Pin11]))","v":"B6, C4, C5, F10, F11, F12, H3, J3, J10, K5, K6"},{"$f":"CONCATENATE([Pin24],IF([Pin12]=\"\",\"\",\", \"&[Pin12]))","v":"B6, C4, C5, F10, F11, F12, H3, J3, J10, K5, K6, K10"},{"$f":"CONCATENATE([Pin25],IF([Pin13]=\"\",\"\",\", \"&[Pin13]))","v":"B6, C4, C5, F10, F11, F12, H3, J3, J10, K5, K6, K10, L10"},{"$f":"IFERROR(INDEX(Table1[InOut],1/(1/SUMPRODUCT((Table1[Reps]=1)*(Table1[Name]=Table5[[#This Row],[Name]])*Table1[Seq]))),\"\")","v":"-"},{"$f":"IFERROR(INDEX(Table1[Level],1/(1/SUMPRODUCT((Table1[Reps]=1)*(Table1[Name]=Table5[[#This Row],[Name]])*Table1[Seq]))),\"\")","v":"Power"},{"$f":"IFERROR(INDEX(Table1[Func],1/(1/SUMPRODUCT((Table1[Reps]=1)*(Table1[Name]=Table5[[#This Row],[Name]])*Table1[Seq]))),\"\")","v":"GroundreferenceforlogicandI/Opins."}]
[null,null,"B3","ADC2","I","Analog","Analog-to-digitalconverterinput2.",{"$f":"COUNTIF(INDEX([Name],1):Table1[[#This Row],[Name]],[Name])","v":1},{"$f":"IF(ISTEXT([Pin]),[Seq],INDEX([Bnk],[Seq]-1))","v":24},24,null,null,"GNDA",{"$f":"IFERROR(INDEX(Table1[Pin],1/(1/SUMPRODUCT((Table1[Reps]=RIGHT(INDEX(Table5[#Headers],coln),2)*1)*(Table1[Name]=Table5[[#This Row],[Name]])*Table1[Bnk]))),\"\")","v":"A5"},{"$f":"IFERROR(INDEX(Table1[Pin],1/(1/SUMPRODUCT((Table1[Reps]=RIGHT(INDEX(Table5[#Headers],coln),2)*1)*(Table1[Name]=Table5[[#This Row],[Name]])*Table1[Bnk]))),\"\")","v":"B5"},{"$f":"IFERROR(INDEX(Table1[Pin],1/(1/SUMPRODUCT((Table1[Reps]=RIGHT(INDEX(Table5[#Headers],coln),2)*1)*(Table1[Name]=Table5[[#This Row],[Name]])*Table1[Bnk]))),\"\")","v":""},{"$f":"IFERROR(INDEX(Table1[Pin],1/(1/SUMPRODUCT((Table1[Reps]=RIGHT(INDEX(Table5[#Headers],coln),2)*1)*(Table1[Name]=Table5[[#This Row],[Name]])*Table1[Bnk]))),\"\")","v":""},{"$f":"IFERROR(INDEX(Table1[Pin],1/(1/SUMPRODUCT((Table1[Reps]=RIGHT(INDEX(Table5[#Headers],coln),2)*1)*(Table1[Name]=Table5[[#This Row],[Name]])*Table1[Bnk]))),\"\")","v":""},{"$f":"IFERROR(INDEX(Table1[Pin],1/(1/SUMPRODUCT((Table1[Reps]=RIGHT(INDEX(Table5[#Headers],coln),2)*1)*(Table1[Name]=Table5[[#This Row],[Name]])*Table1[Bnk]))),\"\")","v":""},{"$f":"IFERROR(INDEX(Table1[Pin],1/(1/SUMPRODUCT((Table1[Reps]=RIGHT(INDEX(Table5[#Headers],coln),2)*1)*(Table1[Name]=Table5[[#This Row],[Name]])*Table1[Bnk]))),\"\")","v":""},{"$f":"IFERROR(INDEX(Table1[Pin],1/(1/SUMPRODUCT((Table1[Reps]=RIGHT(INDEX(Table5[#Headers],coln),2)*1)*(Table1[Name]=Table5[[#This Row],[Name]])*Table1[Bnk]))),\"\")","v":""},{"$f":"IFERROR(INDEX(Table1[Pin],1/(1/SUMPRODUCT((Table1[Reps]=RIGHT(INDEX(Table5[#Headers],coln),2)*1)*(Table1[Name]=Table5[[#This Row],[Name]])*Table1[Bnk]))),\"\")","v":""},{"$f":"IFERROR(INDEX(Table1[Pin],1/(1/SUMPRODUCT((Table1[Reps]=RIGHT(INDEX(Table5[#Headers],coln),2)*1)*(Table1[Name]=Table5[[#This Row],[Name]])*Table1[Bnk]))),\"\")","v":""},{"$f":"IFERROR(INDEX(Table1[Pin],1/(1/SUMPRODUCT((Table1[Reps]=RIGHT(INDEX(Table5[#Headers],coln),2)*1)*(Table1[Name]=Table5[[#This Row],[Name]])*Table1[Bnk]))),\"\")","v":""},{"$f":"IFERROR(INDEX(Table1[Pin],1/(1/SUMPRODUCT((Table1[Reps]=RIGHT(INDEX(Table5[#Headers],coln),2)*1)*(Table1[Name]=Table5[[#This Row],[Name]])*Table1[Bnk]))),\"\")","v":""},{"$f":"IFERROR(INDEX(Table1[Pin],1/(1/SUMPRODUCT((Table1[Reps]=RIGHT(INDEX(Table5[#Headers],coln),2)*1)*(Table1[Name]=Table5[[#This Row],[Name]])*Table1[Bnk]))),\"\")","v":""},{"$f":"[Pin01]","v":"A5"},{"$f":"CONCATENATE([Pin14],IF([Pin02]=\"\",\"\",\", \"&[Pin02]))","v":"A5, B5"},{"$f":"CONCATENATE([Pin15],IF([Pin03]=\"\",\"\",\", \"&[Pin03]))","v":"A5, B5"},{"$f":"CONCATENATE([Pin16],IF([Pin04]=\"\",\"\",\", \"&[Pin04]))","v":"A5, B5"},{"$f":"CONCATENATE([Pin17],IF([Pin05]=\"\",\"\",\", \"&[Pin05]))","v":"A5, B5"},{"$f":"CONCATENATE([Pin18],IF([Pin06]=\"\",\"\",\", \"&[Pin06]))","v":"A5, B5"},{"$f":"CONCATENATE([Pin19],IF([Pin07]=\"\",\"\",\", \"&[Pin07]))","v":"A5, B5"},{"$f":"CONCATENATE([Pin20],IF([Pin08]=\"\",\"\",\", \"&[Pin08]))","v":"A5, B5"},{"$f":"CONCATENATE([Pin21],IF([Pin09]=\"\",\"\",\", \"&[Pin09]))","v":"A5, B5"},{"$f":"CONCATENATE([Pin22],IF([Pin10]=\"\",\"\",\", \"&[Pin10]))","v":"A5, B5"},{"$f":"CONCATENATE([Pin23],IF([Pin11]=\"\",\"\",\", \"&[Pin11]))","v":"A5, B5"},{"$f":"CONCATENATE([Pin24],IF([Pin12]=\"\",\"\",\", \"&[Pin12]))","v":"A5, B5"},{"$f":"CONCATENATE([Pin25],IF([Pin13]=\"\",\"\",\", \"&[Pin13]))","v":"A5, B5"},{"$f":"IFERROR(INDEX(Table1[InOut],1/(1/SUMPRODUCT((Table1[Reps]=1)*(Table1[Name]=Table5[[#This Row],[Name]])*Table1[Seq]))),\"\")","v":"-"},{"$f":"IFERROR(INDEX(Table1[Level],1/(1/SUMPRODUCT((Table1[Reps]=1)*(Table1[Name]=Table5[[#This Row],[Name]])*Table1[Seq]))),\"\")","v":"Power"},{"$f":"IFERROR(INDEX(Table1[Func],1/(1/SUMPRODUCT((Table1[Reps]=1)*(Table1[Name]=Table5[[#This Row],[Name]])*Table1[Seq]))),\"\")","v":0}]
[null,null,"B4","ADC6","I","Analog","Analog-to-digitalconverterinput6.",{"$f":"COUNTIF(INDEX([Name],1):Table1[[#This Row],[Name]],[Name])","v":1},{"$f":"IF(ISTEXT([Pin]),[Seq],INDEX([Bnk],[Seq]-1))","v":25},25,null,null,"GNDPHY",{"$f":"IFERROR(INDEX(Table1[Pin],1/(1/SUMPRODUCT((Table1[Reps]=RIGHT(INDEX(Table5[#Headers],coln),2)*1)*(Table1[Name]=Table5[[#This Row],[Name]])*Table1[Bnk]))),\"\")","v":"C8"},{"$f":"IFERROR(INDEX(Table1[Pin],1/(1/SUMPRODUCT((Table1[Reps]=RIGHT(INDEX(Table5[#Headers],coln),2)*1)*(Table1[Name]=Table5[[#This Row],[Name]])*Table1[Bnk]))),\"\")","v":"C9"},{"$f":"IFERROR(INDEX(Table1[Pin],1/(1/SUMPRODUCT((Table1[Reps]=RIGHT(INDEX(Table5[#Headers],coln),2)*1)*(Table1[Name]=Table5[[#This Row],[Name]])*Table1[Bnk]))),\"\")","v":"K4"},{"$f":"IFERROR(INDEX(Table1[Pin],1/(1/SUMPRODUCT((Table1[Reps]=RIGHT(INDEX(Table5[#Headers],coln),2)*1)*(Table1[Name]=Table5[[#This Row],[Name]])*Table1[Bnk]))),\"\")","v":""},{"$f":"IFERROR(INDEX(Table1[Pin],1/(1/SUMPRODUCT((Table1[Reps]=RIGHT(INDEX(Table5[#Headers],coln),2)*1)*(Table1[Name]=Table5[[#This Row],[Name]])*Table1[Bnk]))),\"\")","v":""},{"$f":"IFERROR(INDEX(Table1[Pin],1/(1/SUMPRODUCT((Table1[Reps]=RIGHT(INDEX(Table5[#Headers],coln),2)*1)*(Table1[Name]=Table5[[#This Row],[Name]])*Table1[Bnk]))),\"\")","v":""},{"$f":"IFERROR(INDEX(Table1[Pin],1/(1/SUMPRODUCT((Table1[Reps]=RIGHT(INDEX(Table5[#Headers],coln),2)*1)*(Table1[Name]=Table5[[#This Row],[Name]])*Table1[Bnk]))),\"\")","v":""},{"$f":"IFERROR(INDEX(Table1[Pin],1/(1/SUMPRODUCT((Table1[Reps]=RIGHT(INDEX(Table5[#Headers],coln),2)*1)*(Table1[Name]=Table5[[#This Row],[Name]])*Table1[Bnk]))),\"\")","v":""},{"$f":"IFERROR(INDEX(Table1[Pin],1/(1/SUMPRODUCT((Table1[Reps]=RIGHT(INDEX(Table5[#Headers],coln),2)*1)*(Table1[Name]=Table5[[#This Row],[Name]])*Table1[Bnk]))),\"\")","v":""},{"$f":"IFERROR(INDEX(Table1[Pin],1/(1/SUMPRODUCT((Table1[Reps]=RIGHT(INDEX(Table5[#Headers],coln),2)*1)*(Table1[Name]=Table5[[#This Row],[Name]])*Table1[Bnk]))),\"\")","v":""},{"$f":"IFERROR(INDEX(Table1[Pin],1/(1/SUMPRODUCT((Table1[Reps]=RIGHT(INDEX(Table5[#Headers],coln),2)*1)*(Table1[Name]=Table5[[#This Row],[Name]])*Table1[Bnk]))),\"\")","v":""},{"$f":"IFERROR(INDEX(Table1[Pin],1/(1/SUMPRODUCT((Table1[Reps]=RIGHT(INDEX(Table5[#Headers],coln),2)*1)*(Table1[Name]=Table5[[#This Row],[Name]])*Table1[Bnk]))),\"\")","v":""},{"$f":"IFERROR(INDEX(Table1[Pin],1/(1/SUMPRODUCT((Table1[Reps]=RIGHT(INDEX(Table5[#Headers],coln),2)*1)*(Table1[Name]=Table5[[#This Row],[Name]])*Table1[Bnk]))),\"\")","v":""},{"$f":"[Pin01]","v":"C8"},{"$f":"CONCATENATE([Pin14],IF([Pin02]=\"\",\"\",\", \"&[Pin02]))","v":"C8, C9"},{"$f":"CONCATENATE([Pin15],IF([Pin03]=\"\",\"\",\", \"&[Pin03]))","v":"C8, C9, K4"},{"$f":"CONCATENATE([Pin16],IF([Pin04]=\"\",\"\",\", \"&[Pin04]))","v":"C8, C9, K4"},{"$f":"CONCATENATE([Pin17],IF([Pin05]=\"\",\"\",\", \"&[Pin05]))","v":"C8, C9, K4"},{"$f":"CONCATENATE([Pin18],IF([Pin06]=\"\",\"\",\", \"&[Pin06]))","v":"C8, C9, K4"},{"$f":"CONCATENATE([Pin19],IF([Pin07]=\"\",\"\",\", \"&[Pin07]))","v":"C8, C9, K4"},{"$f":"CONCATENATE([Pin20],IF([Pin08]=\"\",\"\",\", \"&[Pin08]))","v":"C8, C9, K4"},{"$f":"CONCATENATE([Pin21],IF([Pin09]=\"\",\"\",\", \"&[Pin09]))","v":"C8, C9, K4"},{"$f":"CONCATENATE([Pin22],IF([Pin10]=\"\",\"\",\", \"&[Pin10]))","v":"C8, C9, K4"},{"$f":"CONCATENATE([Pin23],IF([Pin11]=\"\",\"\",\", \"&[Pin11]))","v":"C8, C9, K4"},{"$f":"CONCATENATE([Pin24],IF([Pin12]=\"\",\"\",\", \"&[Pin12]))","v":"C8, C9, K4"},{"$f":"CONCATENATE([Pin25],IF([Pin13]=\"\",\"\",\", \"&[Pin13]))","v":"C8, C9, K4"},{"$f":"IFERROR(INDEX(Table1[InOut],1/(1/SUMPRODUCT((Table1[Reps]=1)*(Table1[Name]=Table5[[#This Row],[Name]])*Table1[Seq]))),\"\")","v":"-"},{"$f":"IFERROR(INDEX(Table1[Level],1/(1/SUMPRODUCT((Table1[Reps]=1)*(Table1[Name]=Table5[[#This Row],[Name]])*Table1[Seq]))),\"\")","v":"Power"},{"$f":"IFERROR(INDEX(Table1[Func],1/(1/SUMPRODUCT((Table1[Reps]=1)*(Table1[Name]=Table5[[#This Row],[Name]])*Table1[Seq]))),\"\")","v":"GNDoftheEthernetPHY."}]
[null,null,"B5","GNDA","-","Power",null,{"$f":"COUNTIF(INDEX([Name],1):Table1[[#This Row],[Name]],[Name])","v":2},{"$f":"IF(ISTEXT([Pin]),[Seq],INDEX([Bnk],[Seq]-1))","v":26},26,null,null,"HIB",{"$f":"IFERROR(INDEX(Table1[Pin],1/(1/SUMPRODUCT((Table1[Reps]=RIGHT(INDEX(Table5[#Headers],coln),2)*1)*(Table1[Name]=Table5[[#This Row],[Name]])*Table1[Bnk]))),\"\")","v":"M12"},{"$f":"IFERROR(INDEX(Table1[Pin],1/(1/SUMPRODUCT((Table1[Reps]=RIGHT(INDEX(Table5[#Headers],coln),2)*1)*(Table1[Name]=Table5[[#This Row],[Name]])*Table1[Bnk]))),\"\")","v":""},{"$f":"IFERROR(INDEX(Table1[Pin],1/(1/SUMPRODUCT((Table1[Reps]=RIGHT(INDEX(Table5[#Headers],coln),2)*1)*(Table1[Name]=Table5[[#This Row],[Name]])*Table1[Bnk]))),\"\")","v":""},{"$f":"IFERROR(INDEX(Table1[Pin],1/(1/SUMPRODUCT((Table1[Reps]=RIGHT(INDEX(Table5[#Headers],coln),2)*1)*(Table1[Name]=Table5[[#This Row],[Name]])*Table1[Bnk]))),\"\")","v":""},{"$f":"IFERROR(INDEX(Table1[Pin],1/(1/SUMPRODUCT((Table1[Reps]=RIGHT(INDEX(Table5[#Headers],coln),2)*1)*(Table1[Name]=Table5[[#This Row],[Name]])*Table1[Bnk]))),\"\")","v":""},{"$f":"IFERROR(INDEX(Table1[Pin],1/(1/SUMPRODUCT((Table1[Reps]=RIGHT(INDEX(Table5[#Headers],coln),2)*1)*(Table1[Name]=Table5[[#This Row],[Name]])*Table1[Bnk]))),\"\")","v":""},{"$f":"IFERROR(INDEX(Table1[Pin],1/(1/SUMPRODUCT((Table1[Reps]=RIGHT(INDEX(Table5[#Headers],coln),2)*1)*(Table1[Name]=Table5[[#This Row],[Name]])*Table1[Bnk]))),\"\")","v":""},{"$f":"IFERROR(INDEX(Table1[Pin],1/(1/SUMPRODUCT((Table1[Reps]=RIGHT(INDEX(Table5[#Headers],coln),2)*1)*(Table1[Name]=Table5[[#This Row],[Name]])*Table1[Bnk]))),\"\")","v":""},{"$f":"IFERROR(INDEX(Table1[Pin],1/(1/SUMPRODUCT((Table1[Reps]=RIGHT(INDEX(Table5[#Headers],coln),2)*1)*(Table1[Name]=Table5[[#This Row],[Name]])*Table1[Bnk]))),\"\")","v":""},{"$f":"IFERROR(INDEX(Table1[Pin],1/(1/SUMPRODUCT((Table1[Reps]=RIGHT(INDEX(Table5[#Headers],coln),2)*1)*(Table1[Name]=Table5[[#This Row],[Name]])*Table1[Bnk]))),\"\")","v":""},{"$f":"IFERROR(INDEX(Table1[Pin],1/(1/SUMPRODUCT((Table1[Reps]=RIGHT(INDEX(Table5[#Headers],coln),2)*1)*(Table1[Name]=Table5[[#This Row],[Name]])*Table1[Bnk]))),\"\")","v":""},{"$f":"IFERROR(INDEX(Table1[Pin],1/(1/SUMPRODUCT((Table1[Reps]=RIGHT(INDEX(Table5[#Headers],coln),2)*1)*(Table1[Name]=Table5[[#This Row],[Name]])*Table1[Bnk]))),\"\")","v":""},{"$f":"IFERROR(INDEX(Table1[Pin],1/(1/SUMPRODUCT((Table1[Reps]=RIGHT(INDEX(Table5[#Headers],coln),2)*1)*(Table1[Name]=Table5[[#This Row],[Name]])*Table1[Bnk]))),\"\")","v":""},{"$f":"[Pin01]","v":"M12"},{"$f":"CONCATENATE([Pin14],IF([Pin02]=\"\",\"\",\", \"&[Pin02]))","v":"M12"},{"$f":"CONCATENATE([Pin15],IF([Pin03]=\"\",\"\",\", \"&[Pin03]))","v":"M12"},{"$f":"CONCATENATE([Pin16],IF([Pin04]=\"\",\"\",\", \"&[Pin04]))","v":"M12"},{"$f":"CONCATENATE([Pin17],IF([Pin05]=\"\",\"\",\", \"&[Pin05]))","v":"M12"},{"$f":"CONCATENATE([Pin18],IF([Pin06]=\"\",\"\",\", \"&[Pin06]))","v":"M12"},{"$f":"CONCATENATE([Pin19],IF([Pin07]=\"\",\"\",\", \"&[Pin07]))","v":"M12"},{"$f":"CONCATENATE([Pin20],IF([Pin08]=\"\",\"\",\", \"&[Pin08]))","v":"M12"},{"$f":"CONCATENATE([Pin21],IF([Pin09]=\"\",\"\",\", \"&[Pin09]))","v":"M12"},{"$f":"CONCATENATE([Pin22],IF([Pin10]=\"\",\"\",\", \"&[Pin10]))","v":"M12"},{"$f":"CONCATENATE([Pin23],IF([Pin11]=\"\",\"\",\", \"&[Pin11]))","v":"M12"},{"$f":"CONCATENATE([Pin24],IF([Pin12]=\"\",\"\",\", \"&[Pin12]))","v":"M12"},{"$f":"CONCATENATE([Pin25],IF([Pin13]=\"\",\"\",\", \"&[Pin13]))","v":"M12"},{"$f":"IFERROR(INDEX(Table1[InOut],1/(1/SUMPRODUCT((Table1[Reps]=1)*(Table1[Name]=Table5[[#This Row],[Name]])*Table1[Seq]))),\"\")","v":"O"},{"$f":"IFERROR(INDEX(Table1[Level],1/(1/SUMPRODUCT((Table1[Reps]=1)*(Table1[Name]=Table5[[#This Row],[Name]])*Table1[Seq]))),\"\")","v":"OD"},{"$f":"IFERROR(INDEX(Table1[Func],1/(1/SUMPRODUCT((Table1[Reps]=1)*(Table1[Name]=Table5[[#This Row],[Name]])*Table1[Seq]))),\"\")","v":"Anopen-drainoutputwithinternalpull-upthatindicatesthe"}]
[null,null,"B6","GND","-","Power","GroundreferenceforlogicandI/Opins.",{"$f":"COUNTIF(INDEX([Name],1):Table1[[#This Row],[Name]],[Name])","v":1},{"$f":"IF(ISTEXT([Pin]),[Seq],INDEX([Bnk],[Seq]-1))","v":27},27,null,null,"I2C0SCL",{"$f":"IFERROR(INDEX(Table1[Pin],1/(1/SUMPRODUCT((Table1[Reps]=RIGHT(INDEX(Table5[#Headers],coln),2)*1)*(Table1[Name]=Table5[[#This Row],[Name]])*Table1[Bnk]))),\"\")","v":"C11"},{"$f":"IFERROR(INDEX(Table1[Pin],1/(1/SUMPRODUCT((Table1[Reps]=RIGHT(INDEX(Table5[#Headers],coln),2)*1)*(Table1[Name]=Table5[[#This Row],[Name]])*Table1[Bnk]))),\"\")","v":""},{"$f":"IFERROR(INDEX(Table1[Pin],1/(1/SUMPRODUCT((Table1[Reps]=RIGHT(INDEX(Table5[#Headers],coln),2)*1)*(Table1[Name]=Table5[[#This Row],[Name]])*Table1[Bnk]))),\"\")","v":""},{"$f":"IFERROR(INDEX(Table1[Pin],1/(1/SUMPRODUCT((Table1[Reps]=RIGHT(INDEX(Table5[#Headers],coln),2)*1)*(Table1[Name]=Table5[[#This Row],[Name]])*Table1[Bnk]))),\"\")","v":""},{"$f":"IFERROR(INDEX(Table1[Pin],1/(1/SUMPRODUCT((Table1[Reps]=RIGHT(INDEX(Table5[#Headers],coln),2)*1)*(Table1[Name]=Table5[[#This Row],[Name]])*Table1[Bnk]))),\"\")","v":""},{"$f":"IFERROR(INDEX(Table1[Pin],1/(1/SUMPRODUCT((Table1[Reps]=RIGHT(INDEX(Table5[#Headers],coln),2)*1)*(Table1[Name]=Table5[[#This Row],[Name]])*Table1[Bnk]))),\"\")","v":""},{"$f":"IFERROR(INDEX(Table1[Pin],1/(1/SUMPRODUCT((Table1[Reps]=RIGHT(INDEX(Table5[#Headers],coln),2)*1)*(Table1[Name]=Table5[[#This Row],[Name]])*Table1[Bnk]))),\"\")","v":""},{"$f":"IFERROR(INDEX(Table1[Pin],1/(1/SUMPRODUCT((Table1[Reps]=RIGHT(INDEX(Table5[#Headers],coln),2)*1)*(Table1[Name]=Table5[[#This Row],[Name]])*Table1[Bnk]))),\"\")","v":""},{"$f":"IFERROR(INDEX(Table1[Pin],1/(1/SUMPRODUCT((Table1[Reps]=RIGHT(INDEX(Table5[#Headers],coln),2)*1)*(Table1[Name]=Table5[[#This Row],[Name]])*Table1[Bnk]))),\"\")","v":""},{"$f":"IFERROR(INDEX(Table1[Pin],1/(1/SUMPRODUCT((Table1[Reps]=RIGHT(INDEX(Table5[#Headers],coln),2)*1)*(Table1[Name]=Table5[[#This Row],[Name]])*Table1[Bnk]))),\"\")","v":""},{"$f":"IFERROR(INDEX(Table1[Pin],1/(1/SUMPRODUCT((Table1[Reps]=RIGHT(INDEX(Table5[#Headers],coln),2)*1)*(Table1[Name]=Table5[[#This Row],[Name]])*Table1[Bnk]))),\"\")","v":""},{"$f":"IFERROR(INDEX(Table1[Pin],1/(1/SUMPRODUCT((Table1[Reps]=RIGHT(INDEX(Table5[#Headers],coln),2)*1)*(Table1[Name]=Table5[[#This Row],[Name]])*Table1[Bnk]))),\"\")","v":""},{"$f":"IFERROR(INDEX(Table1[Pin],1/(1/SUMPRODUCT((Table1[Reps]=RIGHT(INDEX(Table5[#Headers],coln),2)*1)*(Table1[Name]=Table5[[#This Row],[Name]])*Table1[Bnk]))),\"\")","v":""},{"$f":"[Pin01]","v":"C11"},{"$f":"CONCATENATE([Pin14],IF([Pin02]=\"\",\"\",\", \"&[Pin02]))","v":"C11"},{"$f":"CONCATENATE([Pin15],IF([Pin03]=\"\",\"\",\", \"&[Pin03]))","v":"C11"},{"$f":"CONCATENATE([Pin16],IF([Pin04]=\"\",\"\",\", \"&[Pin04]))","v":"C11"},{"$f":"CONCATENATE([Pin17],IF([Pin05]=\"\",\"\",\", \"&[Pin05]))","v":"C11"},{"$f":"CONCATENATE([Pin18],IF([Pin06]=\"\",\"\",\", \"&[Pin06]))","v":"C11"},{"$f":"CONCATENATE([Pin19],IF([Pin07]=\"\",\"\",\", \"&[Pin07]))","v":"C11"},{"$f":"CONCATENATE([Pin20],IF([Pin08]=\"\",\"\",\", \"&[Pin08]))","v":"C11"},{"$f":"CONCATENATE([Pin21],IF([Pin09]=\"\",\"\",\", \"&[Pin09]))","v":"C11"},{"$f":"CONCATENATE([Pin22],IF([Pin10]=\"\",\"\",\", \"&[Pin10]))","v":"C11"},{"$f":"CONCATENATE([Pin23],IF([Pin11]=\"\",\"\",\", \"&[Pin11]))","v":"C11"},{"$f":"CONCATENATE([Pin24],IF([Pin12]=\"\",\"\",\", \"&[Pin12]))","v":"C11"},{"$f":"CONCATENATE([Pin25],IF([Pin13]=\"\",\"\",\", \"&[Pin13]))","v":"C11"},{"$f":"IFERROR(INDEX(Table1[InOut],1/(1/SUMPRODUCT((Table1[Reps]=1)*(Table1[Name]=Table5[[#This Row],[Name]])*Table1[Seq]))),\"\")","v":"I/O"},{"$f":"IFERROR(INDEX(Table1[Level],1/(1/SUMPRODUCT((Table1[Reps]=1)*(Table1[Name]=Table5[[#This Row],[Name]])*Table1[Seq]))),\"\")","v":"OD"},{"$f":"IFERROR(INDEX(Table1[Func],1/(1/SUMPRODUCT((Table1[Reps]=1)*(Table1[Name]=Table5[[#This Row],[Name]])*Table1[Seq]))),\"\")","v":"2Cmodule0clock."}]
[null,null,"B7","PB5","I/O","TTL","GPIOportBbit5.",{"$f":"COUNTIF(INDEX([Name],1):Table1[[#This Row],[Name]],[Name])","v":1},{"$f":"IF(ISTEXT([Pin]),[Seq],INDEX([Bnk],[Seq]-1))","v":28},28,null,null,"I2C0SDA",{"$f":"IFERROR(INDEX(Table1[Pin],1/(1/SUMPRODUCT((Table1[Reps]=RIGHT(INDEX(Table5[#Headers],coln),2)*1)*(Table1[Name]=Table5[[#This Row],[Name]])*Table1[Bnk]))),\"\")","v":"C12"},{"$f":"IFERROR(INDEX(Table1[Pin],1/(1/SUMPRODUCT((Table1[Reps]=RIGHT(INDEX(Table5[#Headers],coln),2)*1)*(Table1[Name]=Table5[[#This Row],[Name]])*Table1[Bnk]))),\"\")","v":""},{"$f":"IFERROR(INDEX(Table1[Pin],1/(1/SUMPRODUCT((Table1[Reps]=RIGHT(INDEX(Table5[#Headers],coln),2)*1)*(Table1[Name]=Table5[[#This Row],[Name]])*Table1[Bnk]))),\"\")","v":""},{"$f":"IFERROR(INDEX(Table1[Pin],1/(1/SUMPRODUCT((Table1[Reps]=RIGHT(INDEX(Table5[#Headers],coln),2)*1)*(Table1[Name]=Table5[[#This Row],[Name]])*Table1[Bnk]))),\"\")","v":""},{"$f":"IFERROR(INDEX(Table1[Pin],1/(1/SUMPRODUCT((Table1[Reps]=RIGHT(INDEX(Table5[#Headers],coln),2)*1)*(Table1[Name]=Table5[[#This Row],[Name]])*Table1[Bnk]))),\"\")","v":""},{"$f":"IFERROR(INDEX(Table1[Pin],1/(1/SUMPRODUCT((Table1[Reps]=RIGHT(INDEX(Table5[#Headers],coln),2)*1)*(Table1[Name]=Table5[[#This Row],[Name]])*Table1[Bnk]))),\"\")","v":""},{"$f":"IFERROR(INDEX(Table1[Pin],1/(1/SUMPRODUCT((Table1[Reps]=RIGHT(INDEX(Table5[#Headers],coln),2)*1)*(Table1[Name]=Table5[[#This Row],[Name]])*Table1[Bnk]))),\"\")","v":""},{"$f":"IFERROR(INDEX(Table1[Pin],1/(1/SUMPRODUCT((Table1[Reps]=RIGHT(INDEX(Table5[#Headers],coln),2)*1)*(Table1[Name]=Table5[[#This Row],[Name]])*Table1[Bnk]))),\"\")","v":""},{"$f":"IFERROR(INDEX(Table1[Pin],1/(1/SUMPRODUCT((Table1[Reps]=RIGHT(INDEX(Table5[#Headers],coln),2)*1)*(Table1[Name]=Table5[[#This Row],[Name]])*Table1[Bnk]))),\"\")","v":""},{"$f":"IFERROR(INDEX(Table1[Pin],1/(1/SUMPRODUCT((Table1[Reps]=RIGHT(INDEX(Table5[#Headers],coln),2)*1)*(Table1[Name]=Table5[[#This Row],[Name]])*Table1[Bnk]))),\"\")","v":""},{"$f":"IFERROR(INDEX(Table1[Pin],1/(1/SUMPRODUCT((Table1[Reps]=RIGHT(INDEX(Table5[#Headers],coln),2)*1)*(Table1[Name]=Table5[[#This Row],[Name]])*Table1[Bnk]))),\"\")","v":""},{"$f":"IFERROR(INDEX(Table1[Pin],1/(1/SUMPRODUCT((Table1[Reps]=RIGHT(INDEX(Table5[#Headers],coln),2)*1)*(Table1[Name]=Table5[[#This Row],[Name]])*Table1[Bnk]))),\"\")","v":""},{"$f":"IFERROR(INDEX(Table1[Pin],1/(1/SUMPRODUCT((Table1[Reps]=RIGHT(INDEX(Table5[#Headers],coln),2)*1)*(Table1[Name]=Table5[[#This Row],[Name]])*Table1[Bnk]))),\"\")","v":""},{"$f":"[Pin01]","v":"C12"},{"$f":"CONCATENATE([Pin14],IF([Pin02]=\"\",\"\",\", \"&[Pin02]))","v":"C12"},{"$f":"CONCATENATE([Pin15],IF([Pin03]=\"\",\"\",\", \"&[Pin03]))","v":"C12"},{"$f":"CONCATENATE([Pin16],IF([Pin04]=\"\",\"\",\", \"&[Pin04]))","v":"C12"},{"$f":"CONCATENATE([Pin17],IF([Pin05]=\"\",\"\",\", \"&[Pin05]))","v":"C12"},{"$f":"CONCATENATE([Pin18],IF([Pin06]=\"\",\"\",\", \"&[Pin06]))","v":"C12"},{"$f":"CONCATENATE([Pin19],IF([Pin07]=\"\",\"\",\", \"&[Pin07]))","v":"C12"},{"$f":"CONCATENATE([Pin20],IF([Pin08]=\"\",\"\",\", \"&[Pin08]))","v":"C12"},{"$f":"CONCATENATE([Pin21],IF([Pin09]=\"\",\"\",\", \"&[Pin09]))","v":"C12"},{"$f":"CONCATENATE([Pin22],IF([Pin10]=\"\",\"\",\", \"&[Pin10]))","v":"C12"},{"$f":"CONCATENATE([Pin23],IF([Pin11]=\"\",\"\",\", \"&[Pin11]))","v":"C12"},{"$f":"CONCATENATE([Pin24],IF([Pin12]=\"\",\"\",\", \"&[Pin12]))","v":"C12"},{"$f":"CONCATENATE([Pin25],IF([Pin13]=\"\",\"\",\", \"&[Pin13]))","v":"C12"},{"$f":"IFERROR(INDEX(Table1[InOut],1/(1/SUMPRODUCT((Table1[Reps]=1)*(Table1[Name]=Table5[[#This Row],[Name]])*Table1[Seq]))),\"\")","v":"I/O"},{"$f":"IFERROR(INDEX(Table1[Level],1/(1/SUMPRODUCT((Table1[Reps]=1)*(Table1[Name]=Table5[[#This Row],[Name]])*Table1[Seq]))),\"\")","v":"OD"},{"$f":"IFERROR(INDEX(Table1[Func],1/(1/SUMPRODUCT((Table1[Reps]=1)*(Table1[Name]=Table5[[#This Row],[Name]])*Table1[Seq]))),\"\")","v":"2Cmodule0data."}]
[null,null,null,"C1-","I","Analog","Analogcomparator1negativeinput.",{"$f":"COUNTIF(INDEX([Name],1):Table1[[#This Row],[Name]],[Name])","v":1},{"$f":"IF(ISTEXT([Pin]),[Seq],INDEX([Bnk],[Seq]-1))","v":28},29,null,null,"I2C1SCL",{"$f":"IFERROR(INDEX(Table1[Pin],1/(1/SUMPRODUCT((Table1[Reps]=RIGHT(INDEX(Table5[#Headers],coln),2)*1)*(Table1[Name]=Table5[[#This Row],[Name]])*Table1[Bnk]))),\"\")","v":"K1"},{"$f":"IFERROR(INDEX(Table1[Pin],1/(1/SUMPRODUCT((Table1[Reps]=RIGHT(INDEX(Table5[#Headers],coln),2)*1)*(Table1[Name]=Table5[[#This Row],[Name]])*Table1[Bnk]))),\"\")","v":""},{"$f":"IFERROR(INDEX(Table1[Pin],1/(1/SUMPRODUCT((Table1[Reps]=RIGHT(INDEX(Table5[#Headers],coln),2)*1)*(Table1[Name]=Table5[[#This Row],[Name]])*Table1[Bnk]))),\"\")","v":""},{"$f":"IFERROR(INDEX(Table1[Pin],1/(1/SUMPRODUCT((Table1[Reps]=RIGHT(INDEX(Table5[#Headers],coln),2)*1)*(Table1[Name]=Table5[[#This Row],[Name]])*Table1[Bnk]))),\"\")","v":""},{"$f":"IFERROR(INDEX(Table1[Pin],1/(1/SUMPRODUCT((Table1[Reps]=RIGHT(INDEX(Table5[#Headers],coln),2)*1)*(Table1[Name]=Table5[[#This Row],[Name]])*Table1[Bnk]))),\"\")","v":""},{"$f":"IFERROR(INDEX(Table1[Pin],1/(1/SUMPRODUCT((Table1[Reps]=RIGHT(INDEX(Table5[#Headers],coln),2)*1)*(Table1[Name]=Table5[[#This Row],[Name]])*Table1[Bnk]))),\"\")","v":""},{"$f":"IFERROR(INDEX(Table1[Pin],1/(1/SUMPRODUCT((Table1[Reps]=RIGHT(INDEX(Table5[#Headers],coln),2)*1)*(Table1[Name]=Table5[[#This Row],[Name]])*Table1[Bnk]))),\"\")","v":""},{"$f":"IFERROR(INDEX(Table1[Pin],1/(1/SUMPRODUCT((Table1[Reps]=RIGHT(INDEX(Table5[#Headers],coln),2)*1)*(Table1[Name]=Table5[[#This Row],[Name]])*Table1[Bnk]))),\"\")","v":""},{"$f":"IFERROR(INDEX(Table1[Pin],1/(1/SUMPRODUCT((Table1[Reps]=RIGHT(INDEX(Table5[#Headers],coln),2)*1)*(Table1[Name]=Table5[[#This Row],[Name]])*Table1[Bnk]))),\"\")","v":""},{"$f":"IFERROR(INDEX(Table1[Pin],1/(1/SUMPRODUCT((Table1[Reps]=RIGHT(INDEX(Table5[#Headers],coln),2)*1)*(Table1[Name]=Table5[[#This Row],[Name]])*Table1[Bnk]))),\"\")","v":""},{"$f":"IFERROR(INDEX(Table1[Pin],1/(1/SUMPRODUCT((Table1[Reps]=RIGHT(INDEX(Table5[#Headers],coln),2)*1)*(Table1[Name]=Table5[[#This Row],[Name]])*Table1[Bnk]))),\"\")","v":""},{"$f":"IFERROR(INDEX(Table1[Pin],1/(1/SUMPRODUCT((Table1[Reps]=RIGHT(INDEX(Table5[#Headers],coln),2)*1)*(Table1[Name]=Table5[[#This Row],[Name]])*Table1[Bnk]))),\"\")","v":""},{"$f":"IFERROR(INDEX(Table1[Pin],1/(1/SUMPRODUCT((Table1[Reps]=RIGHT(INDEX(Table5[#Headers],coln),2)*1)*(Table1[Name]=Table5[[#This Row],[Name]])*Table1[Bnk]))),\"\")","v":""},{"$f":"[Pin01]","v":"K1"},{"$f":"CONCATENATE([Pin14],IF([Pin02]=\"\",\"\",\", \"&[Pin02]))","v":"K1"},{"$f":"CONCATENATE([Pin15],IF([Pin03]=\"\",\"\",\", \"&[Pin03]))","v":"K1"},{"$f":"CONCATENATE([Pin16],IF([Pin04]=\"\",\"\",\", \"&[Pin04]))","v":"K1"},{"$f":"CONCATENATE([Pin17],IF([Pin05]=\"\",\"\",\", \"&[Pin05]))","v":"K1"},{"$f":"CONCATENATE([Pin18],IF([Pin06]=\"\",\"\",\", \"&[Pin06]))","v":"K1"},{"$f":"CONCATENATE([Pin19],IF([Pin07]=\"\",\"\",\", \"&[Pin07]))","v":"K1"},{"$f":"CONCATENATE([Pin20],IF([Pin08]=\"\",\"\",\", \"&[Pin08]))","v":"K1"},{"$f":"CONCATENATE([Pin21],IF([Pin09]=\"\",\"\",\", \"&[Pin09]))","v":"K1"},{"$f":"CONCATENATE([Pin22],IF([Pin10]=\"\",\"\",\", \"&[Pin10]))","v":"K1"},{"$f":"CONCATENATE([Pin23],IF([Pin11]=\"\",\"\",\", \"&[Pin11]))","v":"K1"},{"$f":"CONCATENATE([Pin24],IF([Pin12]=\"\",\"\",\", \"&[Pin12]))","v":"K1"},{"$f":"CONCATENATE([Pin25],IF([Pin13]=\"\",\"\",\", \"&[Pin13]))","v":"K1"},{"$f":"IFERROR(INDEX(Table1[InOut],1/(1/SUMPRODUCT((Table1[Reps]=1)*(Table1[Name]=Table5[[#This Row],[Name]])*Table1[Seq]))),\"\")","v":"O"},{"$f":"IFERROR(INDEX(Table1[Level],1/(1/SUMPRODUCT((Table1[Reps]=1)*(Table1[Name]=Table5[[#This Row],[Name]])*Table1[Seq]))),\"\")","v":"TTL"},{"$f":"IFERROR(INDEX(Table1[Func],1/(1/SUMPRODUCT((Table1[Reps]=1)*(Table1[Name]=Table5[[#This Row],[Name]])*Table1[Seq]))),\"\")","v":"2Cmodule1clock."}]
[null,null,"B8","PC2","I/O","TTL","GPIOportCbit2.",{"$f":"COUNTIF(INDEX([Name],1):Table1[[#This Row],[Name]],[Name])","v":1},{"$f":"IF(ISTEXT([Pin]),[Seq],INDEX([Bnk],[Seq]-1))","v":30},30,null,null,"I2C1SDA",{"$f":"IFERROR(INDEX(Table1[Pin],1/(1/SUMPRODUCT((Table1[Reps]=RIGHT(INDEX(Table5[#Headers],coln),2)*1)*(Table1[Name]=Table5[[#This Row],[Name]])*Table1[Bnk]))),\"\")","v":"M6"},{"$f":"IFERROR(INDEX(Table1[Pin],1/(1/SUMPRODUCT((Table1[Reps]=RIGHT(INDEX(Table5[#Headers],coln),2)*1)*(Table1[Name]=Table5[[#This Row],[Name]])*Table1[Bnk]))),\"\")","v":""},{"$f":"IFERROR(INDEX(Table1[Pin],1/(1/SUMPRODUCT((Table1[Reps]=RIGHT(INDEX(Table5[#Headers],coln),2)*1)*(Table1[Name]=Table5[[#This Row],[Name]])*Table1[Bnk]))),\"\")","v":""},{"$f":"IFERROR(INDEX(Table1[Pin],1/(1/SUMPRODUCT((Table1[Reps]=RIGHT(INDEX(Table5[#Headers],coln),2)*1)*(Table1[Name]=Table5[[#This Row],[Name]])*Table1[Bnk]))),\"\")","v":""},{"$f":"IFERROR(INDEX(Table1[Pin],1/(1/SUMPRODUCT((Table1[Reps]=RIGHT(INDEX(Table5[#Headers],coln),2)*1)*(Table1[Name]=Table5[[#This Row],[Name]])*Table1[Bnk]))),\"\")","v":""},{"$f":"IFERROR(INDEX(Table1[Pin],1/(1/SUMPRODUCT((Table1[Reps]=RIGHT(INDEX(Table5[#Headers],coln),2)*1)*(Table1[Name]=Table5[[#This Row],[Name]])*Table1[Bnk]))),\"\")","v":""},{"$f":"IFERROR(INDEX(Table1[Pin],1/(1/SUMPRODUCT((Table1[Reps]=RIGHT(INDEX(Table5[#Headers],coln),2)*1)*(Table1[Name]=Table5[[#This Row],[Name]])*Table1[Bnk]))),\"\")","v":""},{"$f":"IFERROR(INDEX(Table1[Pin],1/(1/SUMPRODUCT((Table1[Reps]=RIGHT(INDEX(Table5[#Headers],coln),2)*1)*(Table1[Name]=Table5[[#This Row],[Name]])*Table1[Bnk]))),\"\")","v":""},{"$f":"IFERROR(INDEX(Table1[Pin],1/(1/SUMPRODUCT((Table1[Reps]=RIGHT(INDEX(Table5[#Headers],coln),2)*1)*(Table1[Name]=Table5[[#This Row],[Name]])*Table1[Bnk]))),\"\")","v":""},{"$f":"IFERROR(INDEX(Table1[Pin],1/(1/SUMPRODUCT((Table1[Reps]=RIGHT(INDEX(Table5[#Headers],coln),2)*1)*(Table1[Name]=Table5[[#This Row],[Name]])*Table1[Bnk]))),\"\")","v":""},{"$f":"IFERROR(INDEX(Table1[Pin],1/(1/SUMPRODUCT((Table1[Reps]=RIGHT(INDEX(Table5[#Headers],coln),2)*1)*(Table1[Name]=Table5[[#This Row],[Name]])*Table1[Bnk]))),\"\")","v":""},{"$f":"IFERROR(INDEX(Table1[Pin],1/(1/SUMPRODUCT((Table1[Reps]=RIGHT(INDEX(Table5[#Headers],coln),2)*1)*(Table1[Name]=Table5[[#This Row],[Name]])*Table1[Bnk]))),\"\")","v":""},{"$f":"IFERROR(INDEX(Table1[Pin],1/(1/SUMPRODUCT((Table1[Reps]=RIGHT(INDEX(Table5[#Headers],coln),2)*1)*(Table1[Name]=Table5[[#This Row],[Name]])*Table1[Bnk]))),\"\")","v":""},{"$f":"[Pin01]","v":"M6"},{"$f":"CONCATENATE([Pin14],IF([Pin02]=\"\",\"\",\", \"&[Pin02]))","v":"M6"},{"$f":"CONCATENATE([Pin15],IF([Pin03]=\"\",\"\",\", \"&[Pin03]))","v":"M6"},{"$f":"CONCATENATE([Pin16],IF([Pin04]=\"\",\"\",\", \"&[Pin04]))","v":"M6"},{"$f":"CONCATENATE([Pin17],IF([Pin05]=\"\",\"\",\", \"&[Pin05]))","v":"M6"},{"$f":"CONCATENATE([Pin18],IF([Pin06]=\"\",\"\",\", \"&[Pin06]))","v":"M6"},{"$f":"CONCATENATE([Pin19],IF([Pin07]=\"\",\"\",\", \"&[Pin07]))","v":"M6"},{"$f":"CONCATENATE([Pin20],IF([Pin08]=\"\",\"\",\", \"&[Pin08]))","v":"M6"},{"$f":"CONCATENATE([Pin21],IF([Pin09]=\"\",\"\",\", \"&[Pin09]))","v":"M6"},{"$f":"CONCATENATE([Pin22],IF([Pin10]=\"\",\"\",\", \"&[Pin10]))","v":"M6"},{"$f":"CONCATENATE([Pin23],IF([Pin11]=\"\",\"\",\", \"&[Pin11]))","v":"M6"},{"$f":"CONCATENATE([Pin24],IF([Pin12]=\"\",\"\",\", \"&[Pin12]))","v":"M6"},{"$f":"CONCATENATE([Pin25],IF([Pin13]=\"\",\"\",\", \"&[Pin13]))","v":"M6"},{"$f":"IFERROR(INDEX(Table1[InOut],1/(1/SUMPRODUCT((Table1[Reps]=1)*(Table1[Name]=Table5[[#This Row],[Name]])*Table1[Seq]))),\"\")","v":"I/O"},{"$f":"IFERROR(INDEX(Table1[Level],1/(1/SUMPRODUCT((Table1[Reps]=1)*(Table1[Name]=Table5[[#This Row],[Name]])*Table1[Seq]))),\"\")","v":"OD"},{"$f":"IFERROR(INDEX(Table1[Func],1/(1/SUMPRODUCT((Table1[Reps]=1)*(Table1[Name]=Table5[[#This Row],[Name]])*Table1[Seq]))),\"\")","v":"2Cmodule1data."}]
[null,null,null,"TDI","I","TTL","JTAGTDI.",{"$f":"COUNTIF(INDEX([Name],1):Table1[[#This Row],[Name]],[Name])","v":1},{"$f":"IF(ISTEXT([Pin]),[Seq],INDEX([Bnk],[Seq]-1))","v":30},31,null,null,"LDO",{"$f":"IFERROR(INDEX(Table1[Pin],1/(1/SUMPRODUCT((Table1[Reps]=RIGHT(INDEX(Table5[#Headers],coln),2)*1)*(Table1[Name]=Table5[[#This Row],[Name]])*Table1[Bnk]))),\"\")","v":"E3"},{"$f":"IFERROR(INDEX(Table1[Pin],1/(1/SUMPRODUCT((Table1[Reps]=RIGHT(INDEX(Table5[#Headers],coln),2)*1)*(Table1[Name]=Table5[[#This Row],[Name]])*Table1[Bnk]))),\"\")","v":""},{"$f":"IFERROR(INDEX(Table1[Pin],1/(1/SUMPRODUCT((Table1[Reps]=RIGHT(INDEX(Table5[#Headers],coln),2)*1)*(Table1[Name]=Table5[[#This Row],[Name]])*Table1[Bnk]))),\"\")","v":""},{"$f":"IFERROR(INDEX(Table1[Pin],1/(1/SUMPRODUCT((Table1[Reps]=RIGHT(INDEX(Table5[#Headers],coln),2)*1)*(Table1[Name]=Table5[[#This Row],[Name]])*Table1[Bnk]))),\"\")","v":""},{"$f":"IFERROR(INDEX(Table1[Pin],1/(1/SUMPRODUCT((Table1[Reps]=RIGHT(INDEX(Table5[#Headers],coln),2)*1)*(Table1[Name]=Table5[[#This Row],[Name]])*Table1[Bnk]))),\"\")","v":""},{"$f":"IFERROR(INDEX(Table1[Pin],1/(1/SUMPRODUCT((Table1[Reps]=RIGHT(INDEX(Table5[#Headers],coln),2)*1)*(Table1[Name]=Table5[[#This Row],[Name]])*Table1[Bnk]))),\"\")","v":""},{"$f":"IFERROR(INDEX(Table1[Pin],1/(1/SUMPRODUCT((Table1[Reps]=RIGHT(INDEX(Table5[#Headers],coln),2)*1)*(Table1[Name]=Table5[[#This Row],[Name]])*Table1[Bnk]))),\"\")","v":""},{"$f":"IFERROR(INDEX(Table1[Pin],1/(1/SUMPRODUCT((Table1[Reps]=RIGHT(INDEX(Table5[#Headers],coln),2)*1)*(Table1[Name]=Table5[[#This Row],[Name]])*Table1[Bnk]))),\"\")","v":""},{"$f":"IFERROR(INDEX(Table1[Pin],1/(1/SUMPRODUCT((Table1[Reps]=RIGHT(INDEX(Table5[#Headers],coln),2)*1)*(Table1[Name]=Table5[[#This Row],[Name]])*Table1[Bnk]))),\"\")","v":""},{"$f":"IFERROR(INDEX(Table1[Pin],1/(1/SUMPRODUCT((Table1[Reps]=RIGHT(INDEX(Table5[#Headers],coln),2)*1)*(Table1[Name]=Table5[[#This Row],[Name]])*Table1[Bnk]))),\"\")","v":""},{"$f":"IFERROR(INDEX(Table1[Pin],1/(1/SUMPRODUCT((Table1[Reps]=RIGHT(INDEX(Table5[#Headers],coln),2)*1)*(Table1[Name]=Table5[[#This Row],[Name]])*Table1[Bnk]))),\"\")","v":""},{"$f":"IFERROR(INDEX(Table1[Pin],1/(1/SUMPRODUCT((Table1[Reps]=RIGHT(INDEX(Table5[#Headers],coln),2)*1)*(Table1[Name]=Table5[[#This Row],[Name]])*Table1[Bnk]))),\"\")","v":""},{"$f":"IFERROR(INDEX(Table1[Pin],1/(1/SUMPRODUCT((Table1[Reps]=RIGHT(INDEX(Table5[#Headers],coln),2)*1)*(Table1[Name]=Table5[[#This Row],[Name]])*Table1[Bnk]))),\"\")","v":""},{"$f":"[Pin01]","v":"E3"},{"$f":"CONCATENATE([Pin14],IF([Pin02]=\"\",\"\",\", \"&[Pin02]))","v":"E3"},{"$f":"CONCATENATE([Pin15],IF([Pin03]=\"\",\"\",\", \"&[Pin03]))","v":"E3"},{"$f":"CONCATENATE([Pin16],IF([Pin04]=\"\",\"\",\", \"&[Pin04]))","v":"E3"},{"$f":"CONCATENATE([Pin17],IF([Pin05]=\"\",\"\",\", \"&[Pin05]))","v":"E3"},{"$f":"CONCATENATE([Pin18],IF([Pin06]=\"\",\"\",\", \"&[Pin06]))","v":"E3"},{"$f":"CONCATENATE([Pin19],IF([Pin07]=\"\",\"\",\", \"&[Pin07]))","v":"E3"},{"$f":"CONCATENATE([Pin20],IF([Pin08]=\"\",\"\",\", \"&[Pin08]))","v":"E3"},{"$f":"CONCATENATE([Pin21],IF([Pin09]=\"\",\"\",\", \"&[Pin09]))","v":"E3"},{"$f":"CONCATENATE([Pin22],IF([Pin10]=\"\",\"\",\", \"&[Pin10]))","v":"E3"},{"$f":"CONCATENATE([Pin23],IF([Pin11]=\"\",\"\",\", \"&[Pin11]))","v":"E3"},{"$f":"CONCATENATE([Pin24],IF([Pin12]=\"\",\"\",\", \"&[Pin12]))","v":"E3"},{"$f":"CONCATENATE([Pin25],IF([Pin13]=\"\",\"\",\", \"&[Pin13]))","v":"E3"},{"$f":"IFERROR(INDEX(Table1[InOut],1/(1/SUMPRODUCT((Table1[Reps]=1)*(Table1[Name]=Table5[[#This Row],[Name]])*Table1[Seq]))),\"\")","v":"-"},{"$f":"IFERROR(INDEX(Table1[Level],1/(1/SUMPRODUCT((Table1[Reps]=1)*(Table1[Name]=Table5[[#This Row],[Name]])*Table1[Seq]))),\"\")","v":"Power"},{"$f":"IFERROR(INDEX(Table1[Func],1/(1/SUMPRODUCT((Table1[Reps]=1)*(Table1[Name]=Table5[[#This Row],[Name]])*Table1[Seq]))),\"\")","v":"Lowdrop-outregulatoroutputvoltage.Thispinrequiresanexternal"}]
[null,null,"B9","PC1","I/O","TTL","GPIOportCbit1.",{"$f":"COUNTIF(INDEX([Name],1):Table1[[#This Row],[Name]],[Name])","v":1},{"$f":"IF(ISTEXT([Pin]),[Seq],INDEX([Bnk],[Seq]-1))","v":32},32,null,null,"LED0",{"$f":"IFERROR(INDEX(Table1[Pin],1/(1/SUMPRODUCT((Table1[Reps]=RIGHT(INDEX(Table5[#Headers],coln),2)*1)*(Table1[Name]=Table5[[#This Row],[Name]])*Table1[Bnk]))),\"\")","v":"J12"},{"$f":"IFERROR(INDEX(Table1[Pin],1/(1/SUMPRODUCT((Table1[Reps]=RIGHT(INDEX(Table5[#Headers],coln),2)*1)*(Table1[Name]=Table5[[#This Row],[Name]])*Table1[Bnk]))),\"\")","v":""},{"$f":"IFERROR(INDEX(Table1[Pin],1/(1/SUMPRODUCT((Table1[Reps]=RIGHT(INDEX(Table5[#Headers],coln),2)*1)*(Table1[Name]=Table5[[#This Row],[Name]])*Table1[Bnk]))),\"\")","v":""},{"$f":"IFERROR(INDEX(Table1[Pin],1/(1/SUMPRODUCT((Table1[Reps]=RIGHT(INDEX(Table5[#Headers],coln),2)*1)*(Table1[Name]=Table5[[#This Row],[Name]])*Table1[Bnk]))),\"\")","v":""},{"$f":"IFERROR(INDEX(Table1[Pin],1/(1/SUMPRODUCT((Table1[Reps]=RIGHT(INDEX(Table5[#Headers],coln),2)*1)*(Table1[Name]=Table5[[#This Row],[Name]])*Table1[Bnk]))),\"\")","v":""},{"$f":"IFERROR(INDEX(Table1[Pin],1/(1/SUMPRODUCT((Table1[Reps]=RIGHT(INDEX(Table5[#Headers],coln),2)*1)*(Table1[Name]=Table5[[#This Row],[Name]])*Table1[Bnk]))),\"\")","v":""},{"$f":"IFERROR(INDEX(Table1[Pin],1/(1/SUMPRODUCT((Table1[Reps]=RIGHT(INDEX(Table5[#Headers],coln),2)*1)*(Table1[Name]=Table5[[#This Row],[Name]])*Table1[Bnk]))),\"\")","v":""},{"$f":"IFERROR(INDEX(Table1[Pin],1/(1/SUMPRODUCT((Table1[Reps]=RIGHT(INDEX(Table5[#Headers],coln),2)*1)*(Table1[Name]=Table5[[#This Row],[Name]])*Table1[Bnk]))),\"\")","v":""},{"$f":"IFERROR(INDEX(Table1[Pin],1/(1/SUMPRODUCT((Table1[Reps]=RIGHT(INDEX(Table5[#Headers],coln),2)*1)*(Table1[Name]=Table5[[#This Row],[Name]])*Table1[Bnk]))),\"\")","v":""},{"$f":"IFERROR(INDEX(Table1[Pin],1/(1/SUMPRODUCT((Table1[Reps]=RIGHT(INDEX(Table5[#Headers],coln),2)*1)*(Table1[Name]=Table5[[#This Row],[Name]])*Table1[Bnk]))),\"\")","v":""},{"$f":"IFERROR(INDEX(Table1[Pin],1/(1/SUMPRODUCT((Table1[Reps]=RIGHT(INDEX(Table5[#Headers],coln),2)*1)*(Table1[Name]=Table5[[#This Row],[Name]])*Table1[Bnk]))),\"\")","v":""},{"$f":"IFERROR(INDEX(Table1[Pin],1/(1/SUMPRODUCT((Table1[Reps]=RIGHT(INDEX(Table5[#Headers],coln),2)*1)*(Table1[Name]=Table5[[#This Row],[Name]])*Table1[Bnk]))),\"\")","v":""},{"$f":"IFERROR(INDEX(Table1[Pin],1/(1/SUMPRODUCT((Table1[Reps]=RIGHT(INDEX(Table5[#Headers],coln),2)*1)*(Table1[Name]=Table5[[#This Row],[Name]])*Table1[Bnk]))),\"\")","v":""},{"$f":"[Pin01]","v":"J12"},{"$f":"CONCATENATE([Pin14],IF([Pin02]=\"\",\"\",\", \"&[Pin02]))","v":"J12"},{"$f":"CONCATENATE([Pin15],IF([Pin03]=\"\",\"\",\", \"&[Pin03]))","v":"J12"},{"$f":"CONCATENATE([Pin16],IF([Pin04]=\"\",\"\",\", \"&[Pin04]))","v":"J12"},{"$f":"CONCATENATE([Pin17],IF([Pin05]=\"\",\"\",\", \"&[Pin05]))","v":"J12"},{"$f":"CONCATENATE([Pin18],IF([Pin06]=\"\",\"\",\", \"&[Pin06]))","v":"J12"},{"$f":"CONCATENATE([Pin19],IF([Pin07]=\"\",\"\",\", \"&[Pin07]))","v":"J12"},{"$f":"CONCATENATE([Pin20],IF([Pin08]=\"\",\"\",\", \"&[Pin08]))","v":"J12"},{"$f":"CONCATENATE([Pin21],IF([Pin09]=\"\",\"\",\", \"&[Pin09]))","v":"J12"},{"$f":"CONCATENATE([Pin22],IF([Pin10]=\"\",\"\",\", \"&[Pin10]))","v":"J12"},{"$f":"CONCATENATE([Pin23],IF([Pin11]=\"\",\"\",\", \"&[Pin11]))","v":"J12"},{"$f":"CONCATENATE([Pin24],IF([Pin12]=\"\",\"\",\", \"&[Pin12]))","v":"J12"},{"$f":"CONCATENATE([Pin25],IF([Pin13]=\"\",\"\",\", \"&[Pin13]))","v":"J12"},{"$f":"IFERROR(INDEX(Table1[InOut],1/(1/SUMPRODUCT((Table1[Reps]=1)*(Table1[Name]=Table5[[#This Row],[Name]])*Table1[Seq]))),\"\")","v":"O"},{"$f":"IFERROR(INDEX(Table1[Level],1/(1/SUMPRODUCT((Table1[Reps]=1)*(Table1[Name]=Table5[[#This Row],[Name]])*Table1[Seq]))),\"\")","v":"TTL"},{"$f":"IFERROR(INDEX(Table1[Func],1/(1/SUMPRODUCT((Table1[Reps]=1)*(Table1[Name]=Table5[[#This Row],[Name]])*Table1[Seq]))),\"\")","v":"MIILED0."}]
[null,null,null,"TMS","I/O","TTL","JTAGTMSandSWDIO.",{"$f":"COUNTIF(INDEX([Name],1):Table1[[#This Row],[Name]],[Name])","v":1},{"$f":"IF(ISTEXT([Pin]),[Seq],INDEX([Bnk],[Seq]-1))","v":32},33,null,null,"LED1",{"$f":"IFERROR(INDEX(Table1[Pin],1/(1/SUMPRODUCT((Table1[Reps]=RIGHT(INDEX(Table5[#Headers],coln),2)*1)*(Table1[Name]=Table5[[#This Row],[Name]])*Table1[Bnk]))),\"\")","v":"J11"},{"$f":"IFERROR(INDEX(Table1[Pin],1/(1/SUMPRODUCT((Table1[Reps]=RIGHT(INDEX(Table5[#Headers],coln),2)*1)*(Table1[Name]=Table5[[#This Row],[Name]])*Table1[Bnk]))),\"\")","v":""},{"$f":"IFERROR(INDEX(Table1[Pin],1/(1/SUMPRODUCT((Table1[Reps]=RIGHT(INDEX(Table5[#Headers],coln),2)*1)*(Table1[Name]=Table5[[#This Row],[Name]])*Table1[Bnk]))),\"\")","v":""},{"$f":"IFERROR(INDEX(Table1[Pin],1/(1/SUMPRODUCT((Table1[Reps]=RIGHT(INDEX(Table5[#Headers],coln),2)*1)*(Table1[Name]=Table5[[#This Row],[Name]])*Table1[Bnk]))),\"\")","v":""},{"$f":"IFERROR(INDEX(Table1[Pin],1/(1/SUMPRODUCT((Table1[Reps]=RIGHT(INDEX(Table5[#Headers],coln),2)*1)*(Table1[Name]=Table5[[#This Row],[Name]])*Table1[Bnk]))),\"\")","v":""},{"$f":"IFERROR(INDEX(Table1[Pin],1/(1/SUMPRODUCT((Table1[Reps]=RIGHT(INDEX(Table5[#Headers],coln),2)*1)*(Table1[Name]=Table5[[#This Row],[Name]])*Table1[Bnk]))),\"\")","v":""},{"$f":"IFERROR(INDEX(Table1[Pin],1/(1/SUMPRODUCT((Table1[Reps]=RIGHT(INDEX(Table5[#Headers],coln),2)*1)*(Table1[Name]=Table5[[#This Row],[Name]])*Table1[Bnk]))),\"\")","v":""},{"$f":"IFERROR(INDEX(Table1[Pin],1/(1/SUMPRODUCT((Table1[Reps]=RIGHT(INDEX(Table5[#Headers],coln),2)*1)*(Table1[Name]=Table5[[#This Row],[Name]])*Table1[Bnk]))),\"\")","v":""},{"$f":"IFERROR(INDEX(Table1[Pin],1/(1/SUMPRODUCT((Table1[Reps]=RIGHT(INDEX(Table5[#Headers],coln),2)*1)*(Table1[Name]=Table5[[#This Row],[Name]])*Table1[Bnk]))),\"\")","v":""},{"$f":"IFERROR(INDEX(Table1[Pin],1/(1/SUMPRODUCT((Table1[Reps]=RIGHT(INDEX(Table5[#Headers],coln),2)*1)*(Table1[Name]=Table5[[#This Row],[Name]])*Table1[Bnk]))),\"\")","v":""},{"$f":"IFERROR(INDEX(Table1[Pin],1/(1/SUMPRODUCT((Table1[Reps]=RIGHT(INDEX(Table5[#Headers],coln),2)*1)*(Table1[Name]=Table5[[#This Row],[Name]])*Table1[Bnk]))),\"\")","v":""},{"$f":"IFERROR(INDEX(Table1[Pin],1/(1/SUMPRODUCT((Table1[Reps]=RIGHT(INDEX(Table5[#Headers],coln),2)*1)*(Table1[Name]=Table5[[#This Row],[Name]])*Table1[Bnk]))),\"\")","v":""},{"$f":"IFERROR(INDEX(Table1[Pin],1/(1/SUMPRODUCT((Table1[Reps]=RIGHT(INDEX(Table5[#Headers],coln),2)*1)*(Table1[Name]=Table5[[#This Row],[Name]])*Table1[Bnk]))),\"\")","v":""},{"$f":"[Pin01]","v":"J11"},{"$f":"CONCATENATE([Pin14],IF([Pin02]=\"\",\"\",\", \"&[Pin02]))","v":"J11"},{"$f":"CONCATENATE([Pin15],IF([Pin03]=\"\",\"\",\", \"&[Pin03]))","v":"J11"},{"$f":"CONCATENATE([Pin16],IF([Pin04]=\"\",\"\",\", \"&[Pin04]))","v":"J11"},{"$f":"CONCATENATE([Pin17],IF([Pin05]=\"\",\"\",\", \"&[Pin05]))","v":"J11"},{"$f":"CONCATENATE([Pin18],IF([Pin06]=\"\",\"\",\", \"&[Pin06]))","v":"J11"},{"$f":"CONCATENATE([Pin19],IF([Pin07]=\"\",\"\",\", \"&[Pin07]))","v":"J11"},{"$f":"CONCATENATE([Pin20],IF([Pin08]=\"\",\"\",\", \"&[Pin08]))","v":"J11"},{"$f":"CONCATENATE([Pin21],IF([Pin09]=\"\",\"\",\", \"&[Pin09]))","v":"J11"},{"$f":"CONCATENATE([Pin22],IF([Pin10]=\"\",\"\",\", \"&[Pin10]))","v":"J11"},{"$f":"CONCATENATE([Pin23],IF([Pin11]=\"\",\"\",\", \"&[Pin11]))","v":"J11"},{"$f":"CONCATENATE([Pin24],IF([Pin12]=\"\",\"\",\", \"&[Pin12]))","v":"J11"},{"$f":"CONCATENATE([Pin25],IF([Pin13]=\"\",\"\",\", \"&[Pin13]))","v":"J11"},{"$f":"IFERROR(INDEX(Table1[InOut],1/(1/SUMPRODUCT((Table1[Reps]=1)*(Table1[Name]=Table5[[#This Row],[Name]])*Table1[Seq]))),\"\")","v":"O"},{"$f":"IFERROR(INDEX(Table1[Level],1/(1/SUMPRODUCT((Table1[Reps]=1)*(Table1[Name]=Table5[[#This Row],[Name]])*Table1[Seq]))),\"\")","v":"TTL"},{"$f":"IFERROR(INDEX(Table1[Func],1/(1/SUMPRODUCT((Table1[Reps]=1)*(Table1[Name]=Table5[[#This Row],[Name]])*Table1[Seq]))),\"\")","v":"MIILED1."}]
[null,null,null,"SWDIO","I/O","TTL","JTAGTMSandSWDIO.",{"$f":"COUNTIF(INDEX([Name],1):Table1[[#This Row],[Name]],[Name])","v":1},{"$f":"IF(ISTEXT([Pin]),[Seq],INDEX([Bnk],[Seq]-1))","v":32},34,null,null,"MDIO",{"$f":"IFERROR(INDEX(Table1[Pin],1/(1/SUMPRODUCT((Table1[Reps]=RIGHT(INDEX(Table5[#Headers],coln),2)*1)*(Table1[Name]=Table5[[#This Row],[Name]])*Table1[Bnk]))),\"\")","v":"L9"},{"$f":"IFERROR(INDEX(Table1[Pin],1/(1/SUMPRODUCT((Table1[Reps]=RIGHT(INDEX(Table5[#Headers],coln),2)*1)*(Table1[Name]=Table5[[#This Row],[Name]])*Table1[Bnk]))),\"\")","v":""},{"$f":"IFERROR(INDEX(Table1[Pin],1/(1/SUMPRODUCT((Table1[Reps]=RIGHT(INDEX(Table5[#Headers],coln),2)*1)*(Table1[Name]=Table5[[#This Row],[Name]])*Table1[Bnk]))),\"\")","v":""},{"$f":"IFERROR(INDEX(Table1[Pin],1/(1/SUMPRODUCT((Table1[Reps]=RIGHT(INDEX(Table5[#Headers],coln),2)*1)*(Table1[Name]=Table5[[#This Row],[Name]])*Table1[Bnk]))),\"\")","v":""},{"$f":"IFERROR(INDEX(Table1[Pin],1/(1/SUMPRODUCT((Table1[Reps]=RIGHT(INDEX(Table5[#Headers],coln),2)*1)*(Table1[Name]=Table5[[#This Row],[Name]])*Table1[Bnk]))),\"\")","v":""},{"$f":"IFERROR(INDEX(Table1[Pin],1/(1/SUMPRODUCT((Table1[Reps]=RIGHT(INDEX(Table5[#Headers],coln),2)*1)*(Table1[Name]=Table5[[#This Row],[Name]])*Table1[Bnk]))),\"\")","v":""},{"$f":"IFERROR(INDEX(Table1[Pin],1/(1/SUMPRODUCT((Table1[Reps]=RIGHT(INDEX(Table5[#Headers],coln),2)*1)*(Table1[Name]=Table5[[#This Row],[Name]])*Table1[Bnk]))),\"\")","v":""},{"$f":"IFERROR(INDEX(Table1[Pin],1/(1/SUMPRODUCT((Table1[Reps]=RIGHT(INDEX(Table5[#Headers],coln),2)*1)*(Table1[Name]=Table5[[#This Row],[Name]])*Table1[Bnk]))),\"\")","v":""},{"$f":"IFERROR(INDEX(Table1[Pin],1/(1/SUMPRODUCT((Table1[Reps]=RIGHT(INDEX(Table5[#Headers],coln),2)*1)*(Table1[Name]=Table5[[#This Row],[Name]])*Table1[Bnk]))),\"\")","v":""},{"$f":"IFERROR(INDEX(Table1[Pin],1/(1/SUMPRODUCT((Table1[Reps]=RIGHT(INDEX(Table5[#Headers],coln),2)*1)*(Table1[Name]=Table5[[#This Row],[Name]])*Table1[Bnk]))),\"\")","v":""},{"$f":"IFERROR(INDEX(Table1[Pin],1/(1/SUMPRODUCT((Table1[Reps]=RIGHT(INDEX(Table5[#Headers],coln),2)*1)*(Table1[Name]=Table5[[#This Row],[Name]])*Table1[Bnk]))),\"\")","v":""},{"$f":"IFERROR(INDEX(Table1[Pin],1/(1/SUMPRODUCT((Table1[Reps]=RIGHT(INDEX(Table5[#Headers],coln),2)*1)*(Table1[Name]=Table5[[#This Row],[Name]])*Table1[Bnk]))),\"\")","v":""},{"$f":"IFERROR(INDEX(Table1[Pin],1/(1/SUMPRODUCT((Table1[Reps]=RIGHT(INDEX(Table5[#Headers],coln),2)*1)*(Table1[Name]=Table5[[#This Row],[Name]])*Table1[Bnk]))),\"\")","v":""},{"$f":"[Pin01]","v":"L9"},{"$f":"CONCATENATE([Pin14],IF([Pin02]=\"\",\"\",\", \"&[Pin02]))","v":"L9"},{"$f":"CONCATENATE([Pin15],IF([Pin03]=\"\",\"\",\", \"&[Pin03]))","v":"L9"},{"$f":"CONCATENATE([Pin16],IF([Pin04]=\"\",\"\",\", \"&[Pin04]))","v":"L9"},{"$f":"CONCATENATE([Pin17],IF([Pin05]=\"\",\"\",\", \"&[Pin05]))","v":"L9"},{"$f":"CONCATENATE([Pin18],IF([Pin06]=\"\",\"\",\", \"&[Pin06]))","v":"L9"},{"$f":"CONCATENATE([Pin19],IF([Pin07]=\"\",\"\",\", \"&[Pin07]))","v":"L9"},{"$f":"CONCATENATE([Pin20],IF([Pin08]=\"\",\"\",\", \"&[Pin08]))","v":"L9"},{"$f":"CONCATENATE([Pin21],IF([Pin09]=\"\",\"\",\", \"&[Pin09]))","v":"L9"},{"$f":"CONCATENATE([Pin22],IF([Pin10]=\"\",\"\",\", \"&[Pin10]))","v":"L9"},{"$f":"CONCATENATE([Pin23],IF([Pin11]=\"\",\"\",\", \"&[Pin11]))","v":"L9"},{"$f":"CONCATENATE([Pin24],IF([Pin12]=\"\",\"\",\", \"&[Pin12]))","v":"L9"},{"$f":"CONCATENATE([Pin25],IF([Pin13]=\"\",\"\",\", \"&[Pin13]))","v":"L9"},{"$f":"IFERROR(INDEX(Table1[InOut],1/(1/SUMPRODUCT((Table1[Reps]=1)*(Table1[Name]=Table5[[#This Row],[Name]])*Table1[Seq]))),\"\")","v":"I/O"},{"$f":"IFERROR(INDEX(Table1[Level],1/(1/SUMPRODUCT((Table1[Reps]=1)*(Table1[Name]=Table5[[#This Row],[Name]])*Table1[Seq]))),\"\")","v":"TTL"},{"$f":"IFERROR(INDEX(Table1[Func],1/(1/SUMPRODUCT((Table1[Reps]=1)*(Table1[Name]=Table5[[#This Row],[Name]])*Table1[Seq]))),\"\")","v":"MDIOoftheEthernetPHY."}]
[null,null,"B10","CMOD1","I/O","TTL","CPUModebit1.Inputmustbesettologic0(grounded);other",{"$f":"COUNTIF(INDEX([Name],1):Table1[[#This Row],[Name]],[Name])","v":1},{"$f":"IF(ISTEXT([Pin]),[Seq],INDEX([Bnk],[Seq]-1))","v":35},35,null,null,"NC",{"$f":"IFERROR(INDEX(Table1[Pin],1/(1/SUMPRODUCT((Table1[Reps]=RIGHT(INDEX(Table5[#Headers],coln),2)*1)*(Table1[Name]=Table5[[#This Row],[Name]])*Table1[Bnk]))),\"\")","v":"C1"},{"$f":"IFERROR(INDEX(Table1[Pin],1/(1/SUMPRODUCT((Table1[Reps]=RIGHT(INDEX(Table5[#Headers],coln),2)*1)*(Table1[Name]=Table5[[#This Row],[Name]])*Table1[Bnk]))),\"\")","v":"C2"},{"$f":"IFERROR(INDEX(Table1[Pin],1/(1/SUMPRODUCT((Table1[Reps]=RIGHT(INDEX(Table5[#Headers],coln),2)*1)*(Table1[Name]=Table5[[#This Row],[Name]])*Table1[Bnk]))),\"\")","v":"D1"},{"$f":"IFERROR(INDEX(Table1[Pin],1/(1/SUMPRODUCT((Table1[Reps]=RIGHT(INDEX(Table5[#Headers],coln),2)*1)*(Table1[Name]=Table5[[#This Row],[Name]])*Table1[Bnk]))),\"\")","v":"D2"},{"$f":"IFERROR(INDEX(Table1[Pin],1/(1/SUMPRODUCT((Table1[Reps]=RIGHT(INDEX(Table5[#Headers],coln),2)*1)*(Table1[Name]=Table5[[#This Row],[Name]])*Table1[Bnk]))),\"\")","v":"E1"},{"$f":"IFERROR(INDEX(Table1[Pin],1/(1/SUMPRODUCT((Table1[Reps]=RIGHT(INDEX(Table5[#Headers],coln),2)*1)*(Table1[Name]=Table5[[#This Row],[Name]])*Table1[Bnk]))),\"\")","v":"E2"},{"$f":"IFERROR(INDEX(Table1[Pin],1/(1/SUMPRODUCT((Table1[Reps]=RIGHT(INDEX(Table5[#Headers],coln),2)*1)*(Table1[Name]=Table5[[#This Row],[Name]])*Table1[Bnk]))),\"\")","v":"F1"},{"$f":"IFERROR(INDEX(Table1[Pin],1/(1/SUMPRODUCT((Table1[Reps]=RIGHT(INDEX(Table5[#Headers],coln),2)*1)*(Table1[Name]=Table5[[#This Row],[Name]])*Table1[Bnk]))),\"\")","v":"F2"},{"$f":"IFERROR(INDEX(Table1[Pin],1/(1/SUMPRODUCT((Table1[Reps]=RIGHT(INDEX(Table5[#Headers],coln),2)*1)*(Table1[Name]=Table5[[#This Row],[Name]])*Table1[Bnk]))),\"\")","v":""},{"$f":"IFERROR(INDEX(Table1[Pin],1/(1/SUMPRODUCT((Table1[Reps]=RIGHT(INDEX(Table5[#Headers],coln),2)*1)*(Table1[Name]=Table5[[#This Row],[Name]])*Table1[Bnk]))),\"\")","v":""},{"$f":"IFERROR(INDEX(Table1[Pin],1/(1/SUMPRODUCT((Table1[Reps]=RIGHT(INDEX(Table5[#Headers],coln),2)*1)*(Table1[Name]=Table5[[#This Row],[Name]])*Table1[Bnk]))),\"\")","v":""},{"$f":"IFERROR(INDEX(Table1[Pin],1/(1/SUMPRODUCT((Table1[Reps]=RIGHT(INDEX(Table5[#Headers],coln),2)*1)*(Table1[Name]=Table5[[#This Row],[Name]])*Table1[Bnk]))),\"\")","v":""},{"$f":"IFERROR(INDEX(Table1[Pin],1/(1/SUMPRODUCT((Table1[Reps]=RIGHT(INDEX(Table5[#Headers],coln),2)*1)*(Table1[Name]=Table5[[#This Row],[Name]])*Table1[Bnk]))),\"\")","v":""},{"$f":"[Pin01]","v":"C1"},{"$f":"CONCATENATE([Pin14],IF([Pin02]=\"\",\"\",\", \"&[Pin02]))","v":"C1, C2"},{"$f":"CONCATENATE([Pin15],IF([Pin03]=\"\",\"\",\", \"&[Pin03]))","v":"C1, C2, D1"},{"$f":"CONCATENATE([Pin16],IF([Pin04]=\"\",\"\",\", \"&[Pin04]))","v":"C1, C2, D1, D2"},{"$f":"CONCATENATE([Pin17],IF([Pin05]=\"\",\"\",\", \"&[Pin05]))","v":"C1, C2, D1, D2, E1"},{"$f":"CONCATENATE([Pin18],IF([Pin06]=\"\",\"\",\", \"&[Pin06]))","v":"C1, C2, D1, D2, E1, E2"},{"$f":"CONCATENATE([Pin19],IF([Pin07]=\"\",\"\",\", \"&[Pin07]))","v":"C1, C2, D1, D2, E1, E2, F1"},{"$f":"CONCATENATE([Pin20],IF([Pin08]=\"\",\"\",\", \"&[Pin08]))","v":"C1, C2, D1, D2, E1, E2, F1, F2"},{"$f":"CONCATENATE([Pin21],IF([Pin09]=\"\",\"\",\", \"&[Pin09]))","v":"C1, C2, D1, D2, E1, E2, F1, F2"},{"$f":"CONCATENATE([Pin22],IF([Pin10]=\"\",\"\",\", \"&[Pin10]))","v":"C1, C2, D1, D2, E1, E2, F1, F2"},{"$f":"CONCATENATE([Pin23],IF([Pin11]=\"\",\"\",\", \"&[Pin11]))","v":"C1, C2, D1, D2, E1, E2, F1, F2"},{"$f":"CONCATENATE([Pin24],IF([Pin12]=\"\",\"\",\", \"&[Pin12]))","v":"C1, C2, D1, D2, E1, E2, F1, F2"},{"$f":"CONCATENATE([Pin25],IF([Pin13]=\"\",\"\",\", \"&[Pin13]))","v":"C1, C2, D1, D2, E1, E2, F1, F2"},{"$f":"IFERROR(INDEX(Table1[InOut],1/(1/SUMPRODUCT((Table1[Reps]=1)*(Table1[Name]=Table5[[#This Row],[Name]])*Table1[Seq]))),\"\")","v":"-"},{"$f":"IFERROR(INDEX(Table1[Level],1/(1/SUMPRODUCT((Table1[Reps]=1)*(Table1[Name]=Table5[[#This Row],[Name]])*Table1[Seq]))),\"\")","v":"-"},{"$f":"IFERROR(INDEX(Table1[Func],1/(1/SUMPRODUCT((Table1[Reps]=1)*(Table1[Name]=Table5[[#This Row],[Name]])*Table1[Seq]))),\"\")","v":"Noconnect.Leavethepinelectricallyunconnected/isolated"}]
[null,null,"B11","PE2","I/O","TTL","GPIOportEbit2.",{"$f":"COUNTIF(INDEX([Name],1):Table1[[#This Row],[Name]],[Name])","v":1},{"$f":"IF(ISTEXT([Pin]),[Seq],INDEX([Bnk],[Seq]-1))","v":36},36,null,null,"OSC0",{"$f":"IFERROR(INDEX(Table1[Pin],1/(1/SUMPRODUCT((Table1[Reps]=RIGHT(INDEX(Table5[#Headers],coln),2)*1)*(Table1[Name]=Table5[[#This Row],[Name]])*Table1[Bnk]))),\"\")","v":"L11"},{"$f":"IFERROR(INDEX(Table1[Pin],1/(1/SUMPRODUCT((Table1[Reps]=RIGHT(INDEX(Table5[#Headers],coln),2)*1)*(Table1[Name]=Table5[[#This Row],[Name]])*Table1[Bnk]))),\"\")","v":""},{"$f":"IFERROR(INDEX(Table1[Pin],1/(1/SUMPRODUCT((Table1[Reps]=RIGHT(INDEX(Table5[#Headers],coln),2)*1)*(Table1[Name]=Table5[[#This Row],[Name]])*Table1[Bnk]))),\"\")","v":""},{"$f":"IFERROR(INDEX(Table1[Pin],1/(1/SUMPRODUCT((Table1[Reps]=RIGHT(INDEX(Table5[#Headers],coln),2)*1)*(Table1[Name]=Table5[[#This Row],[Name]])*Table1[Bnk]))),\"\")","v":""},{"$f":"IFERROR(INDEX(Table1[Pin],1/(1/SUMPRODUCT((Table1[Reps]=RIGHT(INDEX(Table5[#Headers],coln),2)*1)*(Table1[Name]=Table5[[#This Row],[Name]])*Table1[Bnk]))),\"\")","v":""},{"$f":"IFERROR(INDEX(Table1[Pin],1/(1/SUMPRODUCT((Table1[Reps]=RIGHT(INDEX(Table5[#Headers],coln),2)*1)*(Table1[Name]=Table5[[#This Row],[Name]])*Table1[Bnk]))),\"\")","v":""},{"$f":"IFERROR(INDEX(Table1[Pin],1/(1/SUMPRODUCT((Table1[Reps]=RIGHT(INDEX(Table5[#Headers],coln),2)*1)*(Table1[Name]=Table5[[#This Row],[Name]])*Table1[Bnk]))),\"\")","v":""},{"$f":"IFERROR(INDEX(Table1[Pin],1/(1/SUMPRODUCT((Table1[Reps]=RIGHT(INDEX(Table5[#Headers],coln),2)*1)*(Table1[Name]=Table5[[#This Row],[Name]])*Table1[Bnk]))),\"\")","v":""},{"$f":"IFERROR(INDEX(Table1[Pin],1/(1/SUMPRODUCT((Table1[Reps]=RIGHT(INDEX(Table5[#Headers],coln),2)*1)*(Table1[Name]=Table5[[#This Row],[Name]])*Table1[Bnk]))),\"\")","v":""},{"$f":"IFERROR(INDEX(Table1[Pin],1/(1/SUMPRODUCT((Table1[Reps]=RIGHT(INDEX(Table5[#Headers],coln),2)*1)*(Table1[Name]=Table5[[#This Row],[Name]])*Table1[Bnk]))),\"\")","v":""},{"$f":"IFERROR(INDEX(Table1[Pin],1/(1/SUMPRODUCT((Table1[Reps]=RIGHT(INDEX(Table5[#Headers],coln),2)*1)*(Table1[Name]=Table5[[#This Row],[Name]])*Table1[Bnk]))),\"\")","v":""},{"$f":"IFERROR(INDEX(Table1[Pin],1/(1/SUMPRODUCT((Table1[Reps]=RIGHT(INDEX(Table5[#Headers],coln),2)*1)*(Table1[Name]=Table5[[#This Row],[Name]])*Table1[Bnk]))),\"\")","v":""},{"$f":"IFERROR(INDEX(Table1[Pin],1/(1/SUMPRODUCT((Table1[Reps]=RIGHT(INDEX(Table5[#Headers],coln),2)*1)*(Table1[Name]=Table5[[#This Row],[Name]])*Table1[Bnk]))),\"\")","v":""},{"$f":"[Pin01]","v":"L11"},{"$f":"CONCATENATE([Pin14],IF([Pin02]=\"\",\"\",\", \"&[Pin02]))","v":"L11"},{"$f":"CONCATENATE([Pin15],IF([Pin03]=\"\",\"\",\", \"&[Pin03]))","v":"L11"},{"$f":"CONCATENATE([Pin16],IF([Pin04]=\"\",\"\",\", \"&[Pin04]))","v":"L11"},{"$f":"CONCATENATE([Pin17],IF([Pin05]=\"\",\"\",\", \"&[Pin05]))","v":"L11"},{"$f":"CONCATENATE([Pin18],IF([Pin06]=\"\",\"\",\", \"&[Pin06]))","v":"L11"},{"$f":"CONCATENATE([Pin19],IF([Pin07]=\"\",\"\",\", \"&[Pin07]))","v":"L11"},{"$f":"CONCATENATE([Pin20],IF([Pin08]=\"\",\"\",\", \"&[Pin08]))","v":"L11"},{"$f":"CONCATENATE([Pin21],IF([Pin09]=\"\",\"\",\", \"&[Pin09]))","v":"L11"},{"$f":"CONCATENATE([Pin22],IF([Pin10]=\"\",\"\",\", \"&[Pin10]))","v":"L11"},{"$f":"CONCATENATE([Pin23],IF([Pin11]=\"\",\"\",\", \"&[Pin11]))","v":"L11"},{"$f":"CONCATENATE([Pin24],IF([Pin12]=\"\",\"\",\", \"&[Pin12]))","v":"L11"},{"$f":"CONCATENATE([Pin25],IF([Pin13]=\"\",\"\",\", \"&[Pin13]))","v":"L11"},{"$f":"IFERROR(INDEX(Table1[InOut],1/(1/SUMPRODUCT((Table1[Reps]=1)*(Table1[Name]=Table5[[#This Row],[Name]])*Table1[Seq]))),\"\")","v":"I"},{"$f":"IFERROR(INDEX(Table1[Level],1/(1/SUMPRODUCT((Table1[Reps]=1)*(Table1[Name]=Table5[[#This Row],[Name]])*Table1[Seq]))),\"\")","v":"Analog"},{"$f":"IFERROR(INDEX(Table1[Func],1/(1/SUMPRODUCT((Table1[Reps]=1)*(Table1[Name]=Table5[[#This Row],[Name]])*Table1[Seq]))),\"\")","v":"Mainoscillatorcrystalinputoranexternalclockreferenceinput"}]
[null,null,null,"SSI1Rx","I","TTL","SSImodule1receive.",{"$f":"COUNTIF(INDEX([Name],1):Table1[[#This Row],[Name]],[Name])","v":1},{"$f":"IF(ISTEXT([Pin]),[Seq],INDEX([Bnk],[Seq]-1))","v":36},37,null,null,"OSC1",{"$f":"IFERROR(INDEX(Table1[Pin],1/(1/SUMPRODUCT((Table1[Reps]=RIGHT(INDEX(Table5[#Headers],coln),2)*1)*(Table1[Name]=Table5[[#This Row],[Name]])*Table1[Bnk]))),\"\")","v":"M11"},{"$f":"IFERROR(INDEX(Table1[Pin],1/(1/SUMPRODUCT((Table1[Reps]=RIGHT(INDEX(Table5[#Headers],coln),2)*1)*(Table1[Name]=Table5[[#This Row],[Name]])*Table1[Bnk]))),\"\")","v":""},{"$f":"IFERROR(INDEX(Table1[Pin],1/(1/SUMPRODUCT((Table1[Reps]=RIGHT(INDEX(Table5[#Headers],coln),2)*1)*(Table1[Name]=Table5[[#This Row],[Name]])*Table1[Bnk]))),\"\")","v":""},{"$f":"IFERROR(INDEX(Table1[Pin],1/(1/SUMPRODUCT((Table1[Reps]=RIGHT(INDEX(Table5[#Headers],coln),2)*1)*(Table1[Name]=Table5[[#This Row],[Name]])*Table1[Bnk]))),\"\")","v":""},{"$f":"IFERROR(INDEX(Table1[Pin],1/(1/SUMPRODUCT((Table1[Reps]=RIGHT(INDEX(Table5[#Headers],coln),2)*1)*(Table1[Name]=Table5[[#This Row],[Name]])*Table1[Bnk]))),\"\")","v":""},{"$f":"IFERROR(INDEX(Table1[Pin],1/(1/SUMPRODUCT((Table1[Reps]=RIGHT(INDEX(Table5[#Headers],coln),2)*1)*(Table1[Name]=Table5[[#This Row],[Name]])*Table1[Bnk]))),\"\")","v":""},{"$f":"IFERROR(INDEX(Table1[Pin],1/(1/SUMPRODUCT((Table1[Reps]=RIGHT(INDEX(Table5[#Headers],coln),2)*1)*(Table1[Name]=Table5[[#This Row],[Name]])*Table1[Bnk]))),\"\")","v":""},{"$f":"IFERROR(INDEX(Table1[Pin],1/(1/SUMPRODUCT((Table1[Reps]=RIGHT(INDEX(Table5[#Headers],coln),2)*1)*(Table1[Name]=Table5[[#This Row],[Name]])*Table1[Bnk]))),\"\")","v":""},{"$f":"IFERROR(INDEX(Table1[Pin],1/(1/SUMPRODUCT((Table1[Reps]=RIGHT(INDEX(Table5[#Headers],coln),2)*1)*(Table1[Name]=Table5[[#This Row],[Name]])*Table1[Bnk]))),\"\")","v":""},{"$f":"IFERROR(INDEX(Table1[Pin],1/(1/SUMPRODUCT((Table1[Reps]=RIGHT(INDEX(Table5[#Headers],coln),2)*1)*(Table1[Name]=Table5[[#This Row],[Name]])*Table1[Bnk]))),\"\")","v":""},{"$f":"IFERROR(INDEX(Table1[Pin],1/(1/SUMPRODUCT((Table1[Reps]=RIGHT(INDEX(Table5[#Headers],coln),2)*1)*(Table1[Name]=Table5[[#This Row],[Name]])*Table1[Bnk]))),\"\")","v":""},{"$f":"IFERROR(INDEX(Table1[Pin],1/(1/SUMPRODUCT((Table1[Reps]=RIGHT(INDEX(Table5[#Headers],coln),2)*1)*(Table1[Name]=Table5[[#This Row],[Name]])*Table1[Bnk]))),\"\")","v":""},{"$f":"IFERROR(INDEX(Table1[Pin],1/(1/SUMPRODUCT((Table1[Reps]=RIGHT(INDEX(Table5[#Headers],coln),2)*1)*(Table1[Name]=Table5[[#This Row],[Name]])*Table1[Bnk]))),\"\")","v":""},{"$f":"[Pin01]","v":"M11"},{"$f":"CONCATENATE([Pin14],IF([Pin02]=\"\",\"\",\", \"&[Pin02]))","v":"M11"},{"$f":"CONCATENATE([Pin15],IF([Pin03]=\"\",\"\",\", \"&[Pin03]))","v":"M11"},{"$f":"CONCATENATE([Pin16],IF([Pin04]=\"\",\"\",\", \"&[Pin04]))","v":"M11"},{"$f":"CONCATENATE([Pin17],IF([Pin05]=\"\",\"\",\", \"&[Pin05]))","v":"M11"},{"$f":"CONCATENATE([Pin18],IF([Pin06]=\"\",\"\",\", \"&[Pin06]))","v":"M11"},{"$f":"CONCATENATE([Pin19],IF([Pin07]=\"\",\"\",\", \"&[Pin07]))","v":"M11"},{"$f":"CONCATENATE([Pin20],IF([Pin08]=\"\",\"\",\", \"&[Pin08]))","v":"M11"},{"$f":"CONCATENATE([Pin21],IF([Pin09]=\"\",\"\",\", \"&[Pin09]))","v":"M11"},{"$f":"CONCATENATE([Pin22],IF([Pin10]=\"\",\"\",\", \"&[Pin10]))","v":"M11"},{"$f":"CONCATENATE([Pin23],IF([Pin11]=\"\",\"\",\", \"&[Pin11]))","v":"M11"},{"$f":"CONCATENATE([Pin24],IF([Pin12]=\"\",\"\",\", \"&[Pin12]))","v":"M11"},{"$f":"CONCATENATE([Pin25],IF([Pin13]=\"\",\"\",\", \"&[Pin13]))","v":"M11"},{"$f":"IFERROR(INDEX(Table1[InOut],1/(1/SUMPRODUCT((Table1[Reps]=1)*(Table1[Name]=Table5[[#This Row],[Name]])*Table1[Seq]))),\"\")","v":"O"},{"$f":"IFERROR(INDEX(Table1[Level],1/(1/SUMPRODUCT((Table1[Reps]=1)*(Table1[Name]=Table5[[#This Row],[Name]])*Table1[Seq]))),\"\")","v":"Analog"},{"$f":"IFERROR(INDEX(Table1[Func],1/(1/SUMPRODUCT((Table1[Reps]=1)*(Table1[Name]=Table5[[#This Row],[Name]])*Table1[Seq]))),\"\")","v":"Mainoscillatorcrystaloutput."}]
[null,null,"B12","PE1","I/O","TTL","GPIOportEbit1.",{"$f":"COUNTIF(INDEX([Name],1):Table1[[#This Row],[Name]],[Name])","v":1},{"$f":"IF(ISTEXT([Pin]),[Seq],INDEX([Bnk],[Seq]-1))","v":38},38,null,null,"PA0",{"$f":"IFERROR(INDEX(Table1[Pin],1/(1/SUMPRODUCT((Table1[Reps]=RIGHT(INDEX(Table5[#Headers],coln),2)*1)*(Table1[Name]=Table5[[#This Row],[Name]])*Table1[Bnk]))),\"\")","v":"L3"},{"$f":"IFERROR(INDEX(Table1[Pin],1/(1/SUMPRODUCT((Table1[Reps]=RIGHT(INDEX(Table5[#Headers],coln),2)*1)*(Table1[Name]=Table5[[#This Row],[Name]])*Table1[Bnk]))),\"\")","v":""},{"$f":"IFERROR(INDEX(Table1[Pin],1/(1/SUMPRODUCT((Table1[Reps]=RIGHT(INDEX(Table5[#Headers],coln),2)*1)*(Table1[Name]=Table5[[#This Row],[Name]])*Table1[Bnk]))),\"\")","v":""},{"$f":"IFERROR(INDEX(Table1[Pin],1/(1/SUMPRODUCT((Table1[Reps]=RIGHT(INDEX(Table5[#Headers],coln),2)*1)*(Table1[Name]=Table5[[#This Row],[Name]])*Table1[Bnk]))),\"\")","v":""},{"$f":"IFERROR(INDEX(Table1[Pin],1/(1/SUMPRODUCT((Table1[Reps]=RIGHT(INDEX(Table5[#Headers],coln),2)*1)*(Table1[Name]=Table5[[#This Row],[Name]])*Table1[Bnk]))),\"\")","v":""},{"$f":"IFERROR(INDEX(Table1[Pin],1/(1/SUMPRODUCT((Table1[Reps]=RIGHT(INDEX(Table5[#Headers],coln),2)*1)*(Table1[Name]=Table5[[#This Row],[Name]])*Table1[Bnk]))),\"\")","v":""},{"$f":"IFERROR(INDEX(Table1[Pin],1/(1/SUMPRODUCT((Table1[Reps]=RIGHT(INDEX(Table5[#Headers],coln),2)*1)*(Table1[Name]=Table5[[#This Row],[Name]])*Table1[Bnk]))),\"\")","v":""},{"$f":"IFERROR(INDEX(Table1[Pin],1/(1/SUMPRODUCT((Table1[Reps]=RIGHT(INDEX(Table5[#Headers],coln),2)*1)*(Table1[Name]=Table5[[#This Row],[Name]])*Table1[Bnk]))),\"\")","v":""},{"$f":"IFERROR(INDEX(Table1[Pin],1/(1/SUMPRODUCT((Table1[Reps]=RIGHT(INDEX(Table5[#Headers],coln),2)*1)*(Table1[Name]=Table5[[#This Row],[Name]])*Table1[Bnk]))),\"\")","v":""},{"$f":"IFERROR(INDEX(Table1[Pin],1/(1/SUMPRODUCT((Table1[Reps]=RIGHT(INDEX(Table5[#Headers],coln),2)*1)*(Table1[Name]=Table5[[#This Row],[Name]])*Table1[Bnk]))),\"\")","v":""},{"$f":"IFERROR(INDEX(Table1[Pin],1/(1/SUMPRODUCT((Table1[Reps]=RIGHT(INDEX(Table5[#Headers],coln),2)*1)*(Table1[Name]=Table5[[#This Row],[Name]])*Table1[Bnk]))),\"\")","v":""},{"$f":"IFERROR(INDEX(Table1[Pin],1/(1/SUMPRODUCT((Table1[Reps]=RIGHT(INDEX(Table5[#Headers],coln),2)*1)*(Table1[Name]=Table5[[#This Row],[Name]])*Table1[Bnk]))),\"\")","v":""},{"$f":"IFERROR(INDEX(Table1[Pin],1/(1/SUMPRODUCT((Table1[Reps]=RIGHT(INDEX(Table5[#Headers],coln),2)*1)*(Table1[Name]=Table5[[#This Row],[Name]])*Table1[Bnk]))),\"\")","v":""},{"$f":"[Pin01]","v":"L3"},{"$f":"CONCATENATE([Pin14],IF([Pin02]=\"\",\"\",\", \"&[Pin02]))","v":"L3"},{"$f":"CONCATENATE([Pin15],IF([Pin03]=\"\",\"\",\", \"&[Pin03]))","v":"L3"},{"$f":"CONCATENATE([Pin16],IF([Pin04]=\"\",\"\",\", \"&[Pin04]))","v":"L3"},{"$f":"CONCATENATE([Pin17],IF([Pin05]=\"\",\"\",\", \"&[Pin05]))","v":"L3"},{"$f":"CONCATENATE([Pin18],IF([Pin06]=\"\",\"\",\", \"&[Pin06]))","v":"L3"},{"$f":"CONCATENATE([Pin19],IF([Pin07]=\"\",\"\",\", \"&[Pin07]))","v":"L3"},{"$f":"CONCATENATE([Pin20],IF([Pin08]=\"\",\"\",\", \"&[Pin08]))","v":"L3"},{"$f":"CONCATENATE([Pin21],IF([Pin09]=\"\",\"\",\", \"&[Pin09]))","v":"L3"},{"$f":"CONCATENATE([Pin22],IF([Pin10]=\"\",\"\",\", \"&[Pin10]))","v":"L3"},{"$f":"CONCATENATE([Pin23],IF([Pin11]=\"\",\"\",\", \"&[Pin11]))","v":"L3"},{"$f":"CONCATENATE([Pin24],IF([Pin12]=\"\",\"\",\", \"&[Pin12]))","v":"L3"},{"$f":"CONCATENATE([Pin25],IF([Pin13]=\"\",\"\",\", \"&[Pin13]))","v":"L3"},{"$f":"IFERROR(INDEX(Table1[InOut],1/(1/SUMPRODUCT((Table1[Reps]=1)*(Table1[Name]=Table5[[#This Row],[Name]])*Table1[Seq]))),\"\")","v":"I/O"},{"$f":"IFERROR(INDEX(Table1[Level],1/(1/SUMPRODUCT((Table1[Reps]=1)*(Table1[Name]=Table5[[#This Row],[Name]])*Table1[Seq]))),\"\")","v":"TTL"},{"$f":"IFERROR(INDEX(Table1[Func],1/(1/SUMPRODUCT((Table1[Reps]=1)*(Table1[Name]=Table5[[#This Row],[Name]])*Table1[Seq]))),\"\")","v":"GPIOportAbit0."}]
[null,null,null,"SSI1Fss","I/O","TTL","SSImodule1frame.",{"$f":"COUNTIF(INDEX([Name],1):Table1[[#This Row],[Name]],[Name])","v":1},{"$f":"IF(ISTEXT([Pin]),[Seq],INDEX([Bnk],[Seq]-1))","v":38},39,null,null,"PA1",{"$f":"IFERROR(INDEX(Table1[Pin],1/(1/SUMPRODUCT((Table1[Reps]=RIGHT(INDEX(Table5[#Headers],coln),2)*1)*(Table1[Name]=Table5[[#This Row],[Name]])*Table1[Bnk]))),\"\")","v":"M3"},{"$f":"IFERROR(INDEX(Table1[Pin],1/(1/SUMPRODUCT((Table1[Reps]=RIGHT(INDEX(Table5[#Headers],coln),2)*1)*(Table1[Name]=Table5[[#This Row],[Name]])*Table1[Bnk]))),\"\")","v":""},{"$f":"IFERROR(INDEX(Table1[Pin],1/(1/SUMPRODUCT((Table1[Reps]=RIGHT(INDEX(Table5[#Headers],coln),2)*1)*(Table1[Name]=Table5[[#This Row],[Name]])*Table1[Bnk]))),\"\")","v":""},{"$f":"IFERROR(INDEX(Table1[Pin],1/(1/SUMPRODUCT((Table1[Reps]=RIGHT(INDEX(Table5[#Headers],coln),2)*1)*(Table1[Name]=Table5[[#This Row],[Name]])*Table1[Bnk]))),\"\")","v":""},{"$f":"IFERROR(INDEX(Table1[Pin],1/(1/SUMPRODUCT((Table1[Reps]=RIGHT(INDEX(Table5[#Headers],coln),2)*1)*(Table1[Name]=Table5[[#This Row],[Name]])*Table1[Bnk]))),\"\")","v":""},{"$f":"IFERROR(INDEX(Table1[Pin],1/(1/SUMPRODUCT((Table1[Reps]=RIGHT(INDEX(Table5[#Headers],coln),2)*1)*(Table1[Name]=Table5[[#This Row],[Name]])*Table1[Bnk]))),\"\")","v":""},{"$f":"IFERROR(INDEX(Table1[Pin],1/(1/SUMPRODUCT((Table1[Reps]=RIGHT(INDEX(Table5[#Headers],coln),2)*1)*(Table1[Name]=Table5[[#This Row],[Name]])*Table1[Bnk]))),\"\")","v":""},{"$f":"IFERROR(INDEX(Table1[Pin],1/(1/SUMPRODUCT((Table1[Reps]=RIGHT(INDEX(Table5[#Headers],coln),2)*1)*(Table1[Name]=Table5[[#This Row],[Name]])*Table1[Bnk]))),\"\")","v":""},{"$f":"IFERROR(INDEX(Table1[Pin],1/(1/SUMPRODUCT((Table1[Reps]=RIGHT(INDEX(Table5[#Headers],coln),2)*1)*(Table1[Name]=Table5[[#This Row],[Name]])*Table1[Bnk]))),\"\")","v":""},{"$f":"IFERROR(INDEX(Table1[Pin],1/(1/SUMPRODUCT((Table1[Reps]=RIGHT(INDEX(Table5[#Headers],coln),2)*1)*(Table1[Name]=Table5[[#This Row],[Name]])*Table1[Bnk]))),\"\")","v":""},{"$f":"IFERROR(INDEX(Table1[Pin],1/(1/SUMPRODUCT((Table1[Reps]=RIGHT(INDEX(Table5[#Headers],coln),2)*1)*(Table1[Name]=Table5[[#This Row],[Name]])*Table1[Bnk]))),\"\")","v":""},{"$f":"IFERROR(INDEX(Table1[Pin],1/(1/SUMPRODUCT((Table1[Reps]=RIGHT(INDEX(Table5[#Headers],coln),2)*1)*(Table1[Name]=Table5[[#This Row],[Name]])*Table1[Bnk]))),\"\")","v":""},{"$f":"IFERROR(INDEX(Table1[Pin],1/(1/SUMPRODUCT((Table1[Reps]=RIGHT(INDEX(Table5[#Headers],coln),2)*1)*(Table1[Name]=Table5[[#This Row],[Name]])*Table1[Bnk]))),\"\")","v":""},{"$f":"[Pin01]","v":"M3"},{"$f":"CONCATENATE([Pin14],IF([Pin02]=\"\",\"\",\", \"&[Pin02]))","v":"M3"},{"$f":"CONCATENATE([Pin15],IF([Pin03]=\"\",\"\",\", \"&[Pin03]))","v":"M3"},{"$f":"CONCATENATE([Pin16],IF([Pin04]=\"\",\"\",\", \"&[Pin04]))","v":"M3"},{"$f":"CONCATENATE([Pin17],IF([Pin05]=\"\",\"\",\", \"&[Pin05]))","v":"M3"},{"$f":"CONCATENATE([Pin18],IF([Pin06]=\"\",\"\",\", \"&[Pin06]))","v":"M3"},{"$f":"CONCATENATE([Pin19],IF([Pin07]=\"\",\"\",\", \"&[Pin07]))","v":"M3"},{"$f":"CONCATENATE([Pin20],IF([Pin08]=\"\",\"\",\", \"&[Pin08]))","v":"M3"},{"$f":"CONCATENATE([Pin21],IF([Pin09]=\"\",\"\",\", \"&[Pin09]))","v":"M3"},{"$f":"CONCATENATE([Pin22],IF([Pin10]=\"\",\"\",\", \"&[Pin10]))","v":"M3"},{"$f":"CONCATENATE([Pin23],IF([Pin11]=\"\",\"\",\", \"&[Pin11]))","v":"M3"},{"$f":"CONCATENATE([Pin24],IF([Pin12]=\"\",\"\",\", \"&[Pin12]))","v":"M3"},{"$f":"CONCATENATE([Pin25],IF([Pin13]=\"\",\"\",\", \"&[Pin13]))","v":"M3"},{"$f":"IFERROR(INDEX(Table1[InOut],1/(1/SUMPRODUCT((Table1[Reps]=1)*(Table1[Name]=Table5[[#This Row],[Name]])*Table1[Seq]))),\"\")","v":"I/O"},{"$f":"IFERROR(INDEX(Table1[Level],1/(1/SUMPRODUCT((Table1[Reps]=1)*(Table1[Name]=Table5[[#This Row],[Name]])*Table1[Seq]))),\"\")","v":"TTL"},{"$f":"IFERROR(INDEX(Table1[Func],1/(1/SUMPRODUCT((Table1[Reps]=1)*(Table1[Name]=Table5[[#This Row],[Name]])*Table1[Seq]))),\"\")","v":"GPIOportAbit1."}]
[null,null,"C1","NC","-","-","Noconnect.Leavethepinelectricallyunconnected/isolated",{"$f":"COUNTIF(INDEX([Name],1):Table1[[#This Row],[Name]],[Name])","v":1},{"$f":"IF(ISTEXT([Pin]),[Seq],INDEX([Bnk],[Seq]-1))","v":40},40,null,null,"PA2",{"$f":"IFERROR(INDEX(Table1[Pin],1/(1/SUMPRODUCT((Table1[Reps]=RIGHT(INDEX(Table5[#Headers],coln),2)*1)*(Table1[Name]=Table5[[#This Row],[Name]])*Table1[Bnk]))),\"\")","v":"M4"},{"$f":"IFERROR(INDEX(Table1[Pin],1/(1/SUMPRODUCT((Table1[Reps]=RIGHT(INDEX(Table5[#Headers],coln),2)*1)*(Table1[Name]=Table5[[#This Row],[Name]])*Table1[Bnk]))),\"\")","v":""},{"$f":"IFERROR(INDEX(Table1[Pin],1/(1/SUMPRODUCT((Table1[Reps]=RIGHT(INDEX(Table5[#Headers],coln),2)*1)*(Table1[Name]=Table5[[#This Row],[Name]])*Table1[Bnk]))),\"\")","v":""},{"$f":"IFERROR(INDEX(Table1[Pin],1/(1/SUMPRODUCT((Table1[Reps]=RIGHT(INDEX(Table5[#Headers],coln),2)*1)*(Table1[Name]=Table5[[#This Row],[Name]])*Table1[Bnk]))),\"\")","v":""},{"$f":"IFERROR(INDEX(Table1[Pin],1/(1/SUMPRODUCT((Table1[Reps]=RIGHT(INDEX(Table5[#Headers],coln),2)*1)*(Table1[Name]=Table5[[#This Row],[Name]])*Table1[Bnk]))),\"\")","v":""},{"$f":"IFERROR(INDEX(Table1[Pin],1/(1/SUMPRODUCT((Table1[Reps]=RIGHT(INDEX(Table5[#Headers],coln),2)*1)*(Table1[Name]=Table5[[#This Row],[Name]])*Table1[Bnk]))),\"\")","v":""},{"$f":"IFERROR(INDEX(Table1[Pin],1/(1/SUMPRODUCT((Table1[Reps]=RIGHT(INDEX(Table5[#Headers],coln),2)*1)*(Table1[Name]=Table5[[#This Row],[Name]])*Table1[Bnk]))),\"\")","v":""},{"$f":"IFERROR(INDEX(Table1[Pin],1/(1/SUMPRODUCT((Table1[Reps]=RIGHT(INDEX(Table5[#Headers],coln),2)*1)*(Table1[Name]=Table5[[#This Row],[Name]])*Table1[Bnk]))),\"\")","v":""},{"$f":"IFERROR(INDEX(Table1[Pin],1/(1/SUMPRODUCT((Table1[Reps]=RIGHT(INDEX(Table5[#Headers],coln),2)*1)*(Table1[Name]=Table5[[#This Row],[Name]])*Table1[Bnk]))),\"\")","v":""},{"$f":"IFERROR(INDEX(Table1[Pin],1/(1/SUMPRODUCT((Table1[Reps]=RIGHT(INDEX(Table5[#Headers],coln),2)*1)*(Table1[Name]=Table5[[#This Row],[Name]])*Table1[Bnk]))),\"\")","v":""},{"$f":"IFERROR(INDEX(Table1[Pin],1/(1/SUMPRODUCT((Table1[Reps]=RIGHT(INDEX(Table5[#Headers],coln),2)*1)*(Table1[Name]=Table5[[#This Row],[Name]])*Table1[Bnk]))),\"\")","v":""},{"$f":"IFERROR(INDEX(Table1[Pin],1/(1/SUMPRODUCT((Table1[Reps]=RIGHT(INDEX(Table5[#Headers],coln),2)*1)*(Table1[Name]=Table5[[#This Row],[Name]])*Table1[Bnk]))),\"\")","v":""},{"$f":"IFERROR(INDEX(Table1[Pin],1/(1/SUMPRODUCT((Table1[Reps]=RIGHT(INDEX(Table5[#Headers],coln),2)*1)*(Table1[Name]=Table5[[#This Row],[Name]])*Table1[Bnk]))),\"\")","v":""},{"$f":"[Pin01]","v":"M4"},{"$f":"CONCATENATE([Pin14],IF([Pin02]=\"\",\"\",\", \"&[Pin02]))","v":"M4"},{"$f":"CONCATENATE([Pin15],IF([Pin03]=\"\",\"\",\", \"&[Pin03]))","v":"M4"},{"$f":"CONCATENATE([Pin16],IF([Pin04]=\"\",\"\",\", \"&[Pin04]))","v":"M4"},{"$f":"CONCATENATE([Pin17],IF([Pin05]=\"\",\"\",\", \"&[Pin05]))","v":"M4"},{"$f":"CONCATENATE([Pin18],IF([Pin06]=\"\",\"\",\", \"&[Pin06]))","v":"M4"},{"$f":"CONCATENATE([Pin19],IF([Pin07]=\"\",\"\",\", \"&[Pin07]))","v":"M4"},{"$f":"CONCATENATE([Pin20],IF([Pin08]=\"\",\"\",\", \"&[Pin08]))","v":"M4"},{"$f":"CONCATENATE([Pin21],IF([Pin09]=\"\",\"\",\", \"&[Pin09]))","v":"M4"},{"$f":"CONCATENATE([Pin22],IF([Pin10]=\"\",\"\",\", \"&[Pin10]))","v":"M4"},{"$f":"CONCATENATE([Pin23],IF([Pin11]=\"\",\"\",\", \"&[Pin11]))","v":"M4"},{"$f":"CONCATENATE([Pin24],IF([Pin12]=\"\",\"\",\", \"&[Pin12]))","v":"M4"},{"$f":"CONCATENATE([Pin25],IF([Pin13]=\"\",\"\",\", \"&[Pin13]))","v":"M4"},{"$f":"IFERROR(INDEX(Table1[InOut],1/(1/SUMPRODUCT((Table1[Reps]=1)*(Table1[Name]=Table5[[#This Row],[Name]])*Table1[Seq]))),\"\")","v":"I/O"},{"$f":"IFERROR(INDEX(Table1[Level],1/(1/SUMPRODUCT((Table1[Reps]=1)*(Table1[Name]=Table5[[#This Row],[Name]])*Table1[Seq]))),\"\")","v":"TTL"},{"$f":"IFERROR(INDEX(Table1[Func],1/(1/SUMPRODUCT((Table1[Reps]=1)*(Table1[Name]=Table5[[#This Row],[Name]])*Table1[Seq]))),\"\")","v":"GPIOportAbit2."}]
[null,null,"C2","NC","-","-","Noconnect.Leavethepinelectricallyunconnected/isolated",{"$f":"COUNTIF(INDEX([Name],1):Table1[[#This Row],[Name]],[Name])","v":2},{"$f":"IF(ISTEXT([Pin]),[Seq],INDEX([Bnk],[Seq]-1))","v":41},41,null,null,"PA3",{"$f":"IFERROR(INDEX(Table1[Pin],1/(1/SUMPRODUCT((Table1[Reps]=RIGHT(INDEX(Table5[#Headers],coln),2)*1)*(Table1[Name]=Table5[[#This Row],[Name]])*Table1[Bnk]))),\"\")","v":"L4"},{"$f":"IFERROR(INDEX(Table1[Pin],1/(1/SUMPRODUCT((Table1[Reps]=RIGHT(INDEX(Table5[#Headers],coln),2)*1)*(Table1[Name]=Table5[[#This Row],[Name]])*Table1[Bnk]))),\"\")","v":""},{"$f":"IFERROR(INDEX(Table1[Pin],1/(1/SUMPRODUCT((Table1[Reps]=RIGHT(INDEX(Table5[#Headers],coln),2)*1)*(Table1[Name]=Table5[[#This Row],[Name]])*Table1[Bnk]))),\"\")","v":""},{"$f":"IFERROR(INDEX(Table1[Pin],1/(1/SUMPRODUCT((Table1[Reps]=RIGHT(INDEX(Table5[#Headers],coln),2)*1)*(Table1[Name]=Table5[[#This Row],[Name]])*Table1[Bnk]))),\"\")","v":""},{"$f":"IFERROR(INDEX(Table1[Pin],1/(1/SUMPRODUCT((Table1[Reps]=RIGHT(INDEX(Table5[#Headers],coln),2)*1)*(Table1[Name]=Table5[[#This Row],[Name]])*Table1[Bnk]))),\"\")","v":""},{"$f":"IFERROR(INDEX(Table1[Pin],1/(1/SUMPRODUCT((Table1[Reps]=RIGHT(INDEX(Table5[#Headers],coln),2)*1)*(Table1[Name]=Table5[[#This Row],[Name]])*Table1[Bnk]))),\"\")","v":""},{"$f":"IFERROR(INDEX(Table1[Pin],1/(1/SUMPRODUCT((Table1[Reps]=RIGHT(INDEX(Table5[#Headers],coln),2)*1)*(Table1[Name]=Table5[[#This Row],[Name]])*Table1[Bnk]))),\"\")","v":""},{"$f":"IFERROR(INDEX(Table1[Pin],1/(1/SUMPRODUCT((Table1[Reps]=RIGHT(INDEX(Table5[#Headers],coln),2)*1)*(Table1[Name]=Table5[[#This Row],[Name]])*Table1[Bnk]))),\"\")","v":""},{"$f":"IFERROR(INDEX(Table1[Pin],1/(1/SUMPRODUCT((Table1[Reps]=RIGHT(INDEX(Table5[#Headers],coln),2)*1)*(Table1[Name]=Table5[[#This Row],[Name]])*Table1[Bnk]))),\"\")","v":""},{"$f":"IFERROR(INDEX(Table1[Pin],1/(1/SUMPRODUCT((Table1[Reps]=RIGHT(INDEX(Table5[#Headers],coln),2)*1)*(Table1[Name]=Table5[[#This Row],[Name]])*Table1[Bnk]))),\"\")","v":""},{"$f":"IFERROR(INDEX(Table1[Pin],1/(1/SUMPRODUCT((Table1[Reps]=RIGHT(INDEX(Table5[#Headers],coln),2)*1)*(Table1[Name]=Table5[[#This Row],[Name]])*Table1[Bnk]))),\"\")","v":""},{"$f":"IFERROR(INDEX(Table1[Pin],1/(1/SUMPRODUCT((Table1[Reps]=RIGHT(INDEX(Table5[#Headers],coln),2)*1)*(Table1[Name]=Table5[[#This Row],[Name]])*Table1[Bnk]))),\"\")","v":""},{"$f":"IFERROR(INDEX(Table1[Pin],1/(1/SUMPRODUCT((Table1[Reps]=RIGHT(INDEX(Table5[#Headers],coln),2)*1)*(Table1[Name]=Table5[[#This Row],[Name]])*Table1[Bnk]))),\"\")","v":""},{"$f":"[Pin01]","v":"L4"},{"$f":"CONCATENATE([Pin14],IF([Pin02]=\"\",\"\",\", \"&[Pin02]))","v":"L4"},{"$f":"CONCATENATE([Pin15],IF([Pin03]=\"\",\"\",\", \"&[Pin03]))","v":"L4"},{"$f":"CONCATENATE([Pin16],IF([Pin04]=\"\",\"\",\", \"&[Pin04]))","v":"L4"},{"$f":"CONCATENATE([Pin17],IF([Pin05]=\"\",\"\",\", \"&[Pin05]))","v":"L4"},{"$f":"CONCATENATE([Pin18],IF([Pin06]=\"\",\"\",\", \"&[Pin06]))","v":"L4"},{"$f":"CONCATENATE([Pin19],IF([Pin07]=\"\",\"\",\", \"&[Pin07]))","v":"L4"},{"$f":"CONCATENATE([Pin20],IF([Pin08]=\"\",\"\",\", \"&[Pin08]))","v":"L4"},{"$f":"CONCATENATE([Pin21],IF([Pin09]=\"\",\"\",\", \"&[Pin09]))","v":"L4"},{"$f":"CONCATENATE([Pin22],IF([Pin10]=\"\",\"\",\", \"&[Pin10]))","v":"L4"},{"$f":"CONCATENATE([Pin23],IF([Pin11]=\"\",\"\",\", \"&[Pin11]))","v":"L4"},{"$f":"CONCATENATE([Pin24],IF([Pin12]=\"\",\"\",\", \"&[Pin12]))","v":"L4"},{"$f":"CONCATENATE([Pin25],IF([Pin13]=\"\",\"\",\", \"&[Pin13]))","v":"L4"},{"$f":"IFERROR(INDEX(Table1[InOut],1/(1/SUMPRODUCT((Table1[Reps]=1)*(Table1[Name]=Table5[[#This Row],[Name]])*Table1[Seq]))),\"\")","v":"I/O"},{"$f":"IFERROR(INDEX(Table1[Level],1/(1/SUMPRODUCT((Table1[Reps]=1)*(Table1[Name]=Table5[[#This Row],[Name]])*Table1[Seq]))),\"\")","v":"TTL"},{"$f":"IFERROR(INDEX(Table1[Func],1/(1/SUMPRODUCT((Table1[Reps]=1)*(Table1[Name]=Table5[[#This Row],[Name]])*Table1[Seq]))),\"\")","v":"GPIOportAbit3."}]
[null,null,"C3","VDD25","-","Power","Positivesupplyformostofthelogicfunction,includingthe",{"$f":"COUNTIF(INDEX([Name],1):Table1[[#This Row],[Name]],[Name])","v":1},{"$f":"IF(ISTEXT([Pin]),[Seq],INDEX([Bnk],[Seq]-1))","v":42},42,null,null,"PA4",{"$f":"IFERROR(INDEX(Table1[Pin],1/(1/SUMPRODUCT((Table1[Reps]=RIGHT(INDEX(Table5[#Headers],coln),2)*1)*(Table1[Name]=Table5[[#This Row],[Name]])*Table1[Bnk]))),\"\")","v":"L5"},{"$f":"IFERROR(INDEX(Table1[Pin],1/(1/SUMPRODUCT((Table1[Reps]=RIGHT(INDEX(Table5[#Headers],coln),2)*1)*(Table1[Name]=Table5[[#This Row],[Name]])*Table1[Bnk]))),\"\")","v":""},{"$f":"IFERROR(INDEX(Table1[Pin],1/(1/SUMPRODUCT((Table1[Reps]=RIGHT(INDEX(Table5[#Headers],coln),2)*1)*(Table1[Name]=Table5[[#This Row],[Name]])*Table1[Bnk]))),\"\")","v":""},{"$f":"IFERROR(INDEX(Table1[Pin],1/(1/SUMPRODUCT((Table1[Reps]=RIGHT(INDEX(Table5[#Headers],coln),2)*1)*(Table1[Name]=Table5[[#This Row],[Name]])*Table1[Bnk]))),\"\")","v":""},{"$f":"IFERROR(INDEX(Table1[Pin],1/(1/SUMPRODUCT((Table1[Reps]=RIGHT(INDEX(Table5[#Headers],coln),2)*1)*(Table1[Name]=Table5[[#This Row],[Name]])*Table1[Bnk]))),\"\")","v":""},{"$f":"IFERROR(INDEX(Table1[Pin],1/(1/SUMPRODUCT((Table1[Reps]=RIGHT(INDEX(Table5[#Headers],coln),2)*1)*(Table1[Name]=Table5[[#This Row],[Name]])*Table1[Bnk]))),\"\")","v":""},{"$f":"IFERROR(INDEX(Table1[Pin],1/(1/SUMPRODUCT((Table1[Reps]=RIGHT(INDEX(Table5[#Headers],coln),2)*1)*(Table1[Name]=Table5[[#This Row],[Name]])*Table1[Bnk]))),\"\")","v":""},{"$f":"IFERROR(INDEX(Table1[Pin],1/(1/SUMPRODUCT((Table1[Reps]=RIGHT(INDEX(Table5[#Headers],coln),2)*1)*(Table1[Name]=Table5[[#This Row],[Name]])*Table1[Bnk]))),\"\")","v":""},{"$f":"IFERROR(INDEX(Table1[Pin],1/(1/SUMPRODUCT((Table1[Reps]=RIGHT(INDEX(Table5[#Headers],coln),2)*1)*(Table1[Name]=Table5[[#This Row],[Name]])*Table1[Bnk]))),\"\")","v":""},{"$f":"IFERROR(INDEX(Table1[Pin],1/(1/SUMPRODUCT((Table1[Reps]=RIGHT(INDEX(Table5[#Headers],coln),2)*1)*(Table1[Name]=Table5[[#This Row],[Name]])*Table1[Bnk]))),\"\")","v":""},{"$f":"IFERROR(INDEX(Table1[Pin],1/(1/SUMPRODUCT((Table1[Reps]=RIGHT(INDEX(Table5[#Headers],coln),2)*1)*(Table1[Name]=Table5[[#This Row],[Name]])*Table1[Bnk]))),\"\")","v":""},{"$f":"IFERROR(INDEX(Table1[Pin],1/(1/SUMPRODUCT((Table1[Reps]=RIGHT(INDEX(Table5[#Headers],coln),2)*1)*(Table1[Name]=Table5[[#This Row],[Name]])*Table1[Bnk]))),\"\")","v":""},{"$f":"IFERROR(INDEX(Table1[Pin],1/(1/SUMPRODUCT((Table1[Reps]=RIGHT(INDEX(Table5[#Headers],coln),2)*1)*(Table1[Name]=Table5[[#This Row],[Name]])*Table1[Bnk]))),\"\")","v":""},{"$f":"[Pin01]","v":"L5"},{"$f":"CONCATENATE([Pin14],IF([Pin02]=\"\",\"\",\", \"&[Pin02]))","v":"L5"},{"$f":"CONCATENATE([Pin15],IF([Pin03]=\"\",\"\",\", \"&[Pin03]))","v":"L5"},{"$f":"CONCATENATE([Pin16],IF([Pin04]=\"\",\"\",\", \"&[Pin04]))","v":"L5"},{"$f":"CONCATENATE([Pin17],IF([Pin05]=\"\",\"\",\", \"&[Pin05]))","v":"L5"},{"$f":"CONCATENATE([Pin18],IF([Pin06]=\"\",\"\",\", \"&[Pin06]))","v":"L5"},{"$f":"CONCATENATE([Pin19],IF([Pin07]=\"\",\"\",\", \"&[Pin07]))","v":"L5"},{"$f":"CONCATENATE([Pin20],IF([Pin08]=\"\",\"\",\", \"&[Pin08]))","v":"L5"},{"$f":"CONCATENATE([Pin21],IF([Pin09]=\"\",\"\",\", \"&[Pin09]))","v":"L5"},{"$f":"CONCATENATE([Pin22],IF([Pin10]=\"\",\"\",\", \"&[Pin10]))","v":"L5"},{"$f":"CONCATENATE([Pin23],IF([Pin11]=\"\",\"\",\", \"&[Pin11]))","v":"L5"},{"$f":"CONCATENATE([Pin24],IF([Pin12]=\"\",\"\",\", \"&[Pin12]))","v":"L5"},{"$f":"CONCATENATE([Pin25],IF([Pin13]=\"\",\"\",\", \"&[Pin13]))","v":"L5"},{"$f":"IFERROR(INDEX(Table1[InOut],1/(1/SUMPRODUCT((Table1[Reps]=1)*(Table1[Name]=Table5[[#This Row],[Name]])*Table1[Seq]))),\"\")","v":"I/O"},{"$f":"IFERROR(INDEX(Table1[Level],1/(1/SUMPRODUCT((Table1[Reps]=1)*(Table1[Name]=Table5[[#This Row],[Name]])*Table1[Seq]))),\"\")","v":"TTL"},{"$f":"IFERROR(INDEX(Table1[Func],1/(1/SUMPRODUCT((Table1[Reps]=1)*(Table1[Name]=Table5[[#This Row],[Name]])*Table1[Seq]))),\"\")","v":"GPIOportAbit4."}]
[null,null,"C4","GND","-","Power","GroundreferenceforlogicandI/Opins.",{"$f":"COUNTIF(INDEX([Name],1):Table1[[#This Row],[Name]],[Name])","v":2},{"$f":"IF(ISTEXT([Pin]),[Seq],INDEX([Bnk],[Seq]-1))","v":43},43,null,null,"PA5",{"$f":"IFERROR(INDEX(Table1[Pin],1/(1/SUMPRODUCT((Table1[Reps]=RIGHT(INDEX(Table5[#Headers],coln),2)*1)*(Table1[Name]=Table5[[#This Row],[Name]])*Table1[Bnk]))),\"\")","v":"M5"},{"$f":"IFERROR(INDEX(Table1[Pin],1/(1/SUMPRODUCT((Table1[Reps]=RIGHT(INDEX(Table5[#Headers],coln),2)*1)*(Table1[Name]=Table5[[#This Row],[Name]])*Table1[Bnk]))),\"\")","v":""},{"$f":"IFERROR(INDEX(Table1[Pin],1/(1/SUMPRODUCT((Table1[Reps]=RIGHT(INDEX(Table5[#Headers],coln),2)*1)*(Table1[Name]=Table5[[#This Row],[Name]])*Table1[Bnk]))),\"\")","v":""},{"$f":"IFERROR(INDEX(Table1[Pin],1/(1/SUMPRODUCT((Table1[Reps]=RIGHT(INDEX(Table5[#Headers],coln),2)*1)*(Table1[Name]=Table5[[#This Row],[Name]])*Table1[Bnk]))),\"\")","v":""},{"$f":"IFERROR(INDEX(Table1[Pin],1/(1/SUMPRODUCT((Table1[Reps]=RIGHT(INDEX(Table5[#Headers],coln),2)*1)*(Table1[Name]=Table5[[#This Row],[Name]])*Table1[Bnk]))),\"\")","v":""},{"$f":"IFERROR(INDEX(Table1[Pin],1/(1/SUMPRODUCT((Table1[Reps]=RIGHT(INDEX(Table5[#Headers],coln),2)*1)*(Table1[Name]=Table5[[#This Row],[Name]])*Table1[Bnk]))),\"\")","v":""},{"$f":"IFERROR(INDEX(Table1[Pin],1/(1/SUMPRODUCT((Table1[Reps]=RIGHT(INDEX(Table5[#Headers],coln),2)*1)*(Table1[Name]=Table5[[#This Row],[Name]])*Table1[Bnk]))),\"\")","v":""},{"$f":"IFERROR(INDEX(Table1[Pin],1/(1/SUMPRODUCT((Table1[Reps]=RIGHT(INDEX(Table5[#Headers],coln),2)*1)*(Table1[Name]=Table5[[#This Row],[Name]])*Table1[Bnk]))),\"\")","v":""},{"$f":"IFERROR(INDEX(Table1[Pin],1/(1/SUMPRODUCT((Table1[Reps]=RIGHT(INDEX(Table5[#Headers],coln),2)*1)*(Table1[Name]=Table5[[#This Row],[Name]])*Table1[Bnk]))),\"\")","v":""},{"$f":"IFERROR(INDEX(Table1[Pin],1/(1/SUMPRODUCT((Table1[Reps]=RIGHT(INDEX(Table5[#Headers],coln),2)*1)*(Table1[Name]=Table5[[#This Row],[Name]])*Table1[Bnk]))),\"\")","v":""},{"$f":"IFERROR(INDEX(Table1[Pin],1/(1/SUMPRODUCT((Table1[Reps]=RIGHT(INDEX(Table5[#Headers],coln),2)*1)*(Table1[Name]=Table5[[#This Row],[Name]])*Table1[Bnk]))),\"\")","v":""},{"$f":"IFERROR(INDEX(Table1[Pin],1/(1/SUMPRODUCT((Table1[Reps]=RIGHT(INDEX(Table5[#Headers],coln),2)*1)*(Table1[Name]=Table5[[#This Row],[Name]])*Table1[Bnk]))),\"\")","v":""},{"$f":"IFERROR(INDEX(Table1[Pin],1/(1/SUMPRODUCT((Table1[Reps]=RIGHT(INDEX(Table5[#Headers],coln),2)*1)*(Table1[Name]=Table5[[#This Row],[Name]])*Table1[Bnk]))),\"\")","v":""},{"$f":"[Pin01]","v":"M5"},{"$f":"CONCATENATE([Pin14],IF([Pin02]=\"\",\"\",\", \"&[Pin02]))","v":"M5"},{"$f":"CONCATENATE([Pin15],IF([Pin03]=\"\",\"\",\", \"&[Pin03]))","v":"M5"},{"$f":"CONCATENATE([Pin16],IF([Pin04]=\"\",\"\",\", \"&[Pin04]))","v":"M5"},{"$f":"CONCATENATE([Pin17],IF([Pin05]=\"\",\"\",\", \"&[Pin05]))","v":"M5"},{"$f":"CONCATENATE([Pin18],IF([Pin06]=\"\",\"\",\", \"&[Pin06]))","v":"M5"},{"$f":"CONCATENATE([Pin19],IF([Pin07]=\"\",\"\",\", \"&[Pin07]))","v":"M5"},{"$f":"CONCATENATE([Pin20],IF([Pin08]=\"\",\"\",\", \"&[Pin08]))","v":"M5"},{"$f":"CONCATENATE([Pin21],IF([Pin09]=\"\",\"\",\", \"&[Pin09]))","v":"M5"},{"$f":"CONCATENATE([Pin22],IF([Pin10]=\"\",\"\",\", \"&[Pin10]))","v":"M5"},{"$f":"CONCATENATE([Pin23],IF([Pin11]=\"\",\"\",\", \"&[Pin11]))","v":"M5"},{"$f":"CONCATENATE([Pin24],IF([Pin12]=\"\",\"\",\", \"&[Pin12]))","v":"M5"},{"$f":"CONCATENATE([Pin25],IF([Pin13]=\"\",\"\",\", \"&[Pin13]))","v":"M5"},{"$f":"IFERROR(INDEX(Table1[InOut],1/(1/SUMPRODUCT((Table1[Reps]=1)*(Table1[Name]=Table5[[#This Row],[Name]])*Table1[Seq]))),\"\")","v":"I/O"},{"$f":"IFERROR(INDEX(Table1[Level],1/(1/SUMPRODUCT((Table1[Reps]=1)*(Table1[Name]=Table5[[#This Row],[Name]])*Table1[Seq]))),\"\")","v":"TTL"},{"$f":"IFERROR(INDEX(Table1[Func],1/(1/SUMPRODUCT((Table1[Reps]=1)*(Table1[Name]=Table5[[#This Row],[Name]])*Table1[Seq]))),\"\")","v":"GPIOportAbit5."}]
[null,null,"C5","GND","-","Power","GroundreferenceforlogicandI/Opins.",{"$f":"COUNTIF(INDEX([Name],1):Table1[[#This Row],[Name]],[Name])","v":3},{"$f":"IF(ISTEXT([Pin]),[Seq],INDEX([Bnk],[Seq]-1))","v":44},44,null,null,"PA6",{"$f":"IFERROR(INDEX(Table1[Pin],1/(1/SUMPRODUCT((Table1[Reps]=RIGHT(INDEX(Table5[#Headers],coln),2)*1)*(Table1[Name]=Table5[[#This Row],[Name]])*Table1[Bnk]))),\"\")","v":"L6"},{"$f":"IFERROR(INDEX(Table1[Pin],1/(1/SUMPRODUCT((Table1[Reps]=RIGHT(INDEX(Table5[#Headers],coln),2)*1)*(Table1[Name]=Table5[[#This Row],[Name]])*Table1[Bnk]))),\"\")","v":""},{"$f":"IFERROR(INDEX(Table1[Pin],1/(1/SUMPRODUCT((Table1[Reps]=RIGHT(INDEX(Table5[#Headers],coln),2)*1)*(Table1[Name]=Table5[[#This Row],[Name]])*Table1[Bnk]))),\"\")","v":""},{"$f":"IFERROR(INDEX(Table1[Pin],1/(1/SUMPRODUCT((Table1[Reps]=RIGHT(INDEX(Table5[#Headers],coln),2)*1)*(Table1[Name]=Table5[[#This Row],[Name]])*Table1[Bnk]))),\"\")","v":""},{"$f":"IFERROR(INDEX(Table1[Pin],1/(1/SUMPRODUCT((Table1[Reps]=RIGHT(INDEX(Table5[#Headers],coln),2)*1)*(Table1[Name]=Table5[[#This Row],[Name]])*Table1[Bnk]))),\"\")","v":""},{"$f":"IFERROR(INDEX(Table1[Pin],1/(1/SUMPRODUCT((Table1[Reps]=RIGHT(INDEX(Table5[#Headers],coln),2)*1)*(Table1[Name]=Table5[[#This Row],[Name]])*Table1[Bnk]))),\"\")","v":""},{"$f":"IFERROR(INDEX(Table1[Pin],1/(1/SUMPRODUCT((Table1[Reps]=RIGHT(INDEX(Table5[#Headers],coln),2)*1)*(Table1[Name]=Table5[[#This Row],[Name]])*Table1[Bnk]))),\"\")","v":""},{"$f":"IFERROR(INDEX(Table1[Pin],1/(1/SUMPRODUCT((Table1[Reps]=RIGHT(INDEX(Table5[#Headers],coln),2)*1)*(Table1[Name]=Table5[[#This Row],[Name]])*Table1[Bnk]))),\"\")","v":""},{"$f":"IFERROR(INDEX(Table1[Pin],1/(1/SUMPRODUCT((Table1[Reps]=RIGHT(INDEX(Table5[#Headers],coln),2)*1)*(Table1[Name]=Table5[[#This Row],[Name]])*Table1[Bnk]))),\"\")","v":""},{"$f":"IFERROR(INDEX(Table1[Pin],1/(1/SUMPRODUCT((Table1[Reps]=RIGHT(INDEX(Table5[#Headers],coln),2)*1)*(Table1[Name]=Table5[[#This Row],[Name]])*Table1[Bnk]))),\"\")","v":""},{"$f":"IFERROR(INDEX(Table1[Pin],1/(1/SUMPRODUCT((Table1[Reps]=RIGHT(INDEX(Table5[#Headers],coln),2)*1)*(Table1[Name]=Table5[[#This Row],[Name]])*Table1[Bnk]))),\"\")","v":""},{"$f":"IFERROR(INDEX(Table1[Pin],1/(1/SUMPRODUCT((Table1[Reps]=RIGHT(INDEX(Table5[#Headers],coln),2)*1)*(Table1[Name]=Table5[[#This Row],[Name]])*Table1[Bnk]))),\"\")","v":""},{"$f":"IFERROR(INDEX(Table1[Pin],1/(1/SUMPRODUCT((Table1[Reps]=RIGHT(INDEX(Table5[#Headers],coln),2)*1)*(Table1[Name]=Table5[[#This Row],[Name]])*Table1[Bnk]))),\"\")","v":""},{"$f":"[Pin01]","v":"L6"},{"$f":"CONCATENATE([Pin14],IF([Pin02]=\"\",\"\",\", \"&[Pin02]))","v":"L6"},{"$f":"CONCATENATE([Pin15],IF([Pin03]=\"\",\"\",\", \"&[Pin03]))","v":"L6"},{"$f":"CONCATENATE([Pin16],IF([Pin04]=\"\",\"\",\", \"&[Pin04]))","v":"L6"},{"$f":"CONCATENATE([Pin17],IF([Pin05]=\"\",\"\",\", \"&[Pin05]))","v":"L6"},{"$f":"CONCATENATE([Pin18],IF([Pin06]=\"\",\"\",\", \"&[Pin06]))","v":"L6"},{"$f":"CONCATENATE([Pin19],IF([Pin07]=\"\",\"\",\", \"&[Pin07]))","v":"L6"},{"$f":"CONCATENATE([Pin20],IF([Pin08]=\"\",\"\",\", \"&[Pin08]))","v":"L6"},{"$f":"CONCATENATE([Pin21],IF([Pin09]=\"\",\"\",\", \"&[Pin09]))","v":"L6"},{"$f":"CONCATENATE([Pin22],IF([Pin10]=\"\",\"\",\", \"&[Pin10]))","v":"L6"},{"$f":"CONCATENATE([Pin23],IF([Pin11]=\"\",\"\",\", \"&[Pin11]))","v":"L6"},{"$f":"CONCATENATE([Pin24],IF([Pin12]=\"\",\"\",\", \"&[Pin12]))","v":"L6"},{"$f":"CONCATENATE([Pin25],IF([Pin13]=\"\",\"\",\", \"&[Pin13]))","v":"L6"},{"$f":"IFERROR(INDEX(Table1[InOut],1/(1/SUMPRODUCT((Table1[Reps]=1)*(Table1[Name]=Table5[[#This Row],[Name]])*Table1[Seq]))),\"\")","v":"I/O"},{"$f":"IFERROR(INDEX(Table1[Level],1/(1/SUMPRODUCT((Table1[Reps]=1)*(Table1[Name]=Table5[[#This Row],[Name]])*Table1[Seq]))),\"\")","v":"TTL"},{"$f":"IFERROR(INDEX(Table1[Func],1/(1/SUMPRODUCT((Table1[Reps]=1)*(Table1[Name]=Table5[[#This Row],[Name]])*Table1[Seq]))),\"\")","v":"GPIOportAbit6."}]
[null,null,"C6","VDDA","-","Power","Thepositivesupply(3.3V)fortheanalogcircuits(ADC,Analog",{"$f":"COUNTIF(INDEX([Name],1):Table1[[#This Row],[Name]],[Name])","v":1},{"$f":"IF(ISTEXT([Pin]),[Seq],INDEX([Bnk],[Seq]-1))","v":45},45,null,null,"PA7",{"$f":"IFERROR(INDEX(Table1[Pin],1/(1/SUMPRODUCT((Table1[Reps]=RIGHT(INDEX(Table5[#Headers],coln),2)*1)*(Table1[Name]=Table5[[#This Row],[Name]])*Table1[Bnk]))),\"\")","v":"M6"},{"$f":"IFERROR(INDEX(Table1[Pin],1/(1/SUMPRODUCT((Table1[Reps]=RIGHT(INDEX(Table5[#Headers],coln),2)*1)*(Table1[Name]=Table5[[#This Row],[Name]])*Table1[Bnk]))),\"\")","v":""},{"$f":"IFERROR(INDEX(Table1[Pin],1/(1/SUMPRODUCT((Table1[Reps]=RIGHT(INDEX(Table5[#Headers],coln),2)*1)*(Table1[Name]=Table5[[#This Row],[Name]])*Table1[Bnk]))),\"\")","v":""},{"$f":"IFERROR(INDEX(Table1[Pin],1/(1/SUMPRODUCT((Table1[Reps]=RIGHT(INDEX(Table5[#Headers],coln),2)*1)*(Table1[Name]=Table5[[#This Row],[Name]])*Table1[Bnk]))),\"\")","v":""},{"$f":"IFERROR(INDEX(Table1[Pin],1/(1/SUMPRODUCT((Table1[Reps]=RIGHT(INDEX(Table5[#Headers],coln),2)*1)*(Table1[Name]=Table5[[#This Row],[Name]])*Table1[Bnk]))),\"\")","v":""},{"$f":"IFERROR(INDEX(Table1[Pin],1/(1/SUMPRODUCT((Table1[Reps]=RIGHT(INDEX(Table5[#Headers],coln),2)*1)*(Table1[Name]=Table5[[#This Row],[Name]])*Table1[Bnk]))),\"\")","v":""},{"$f":"IFERROR(INDEX(Table1[Pin],1/(1/SUMPRODUCT((Table1[Reps]=RIGHT(INDEX(Table5[#Headers],coln),2)*1)*(Table1[Name]=Table5[[#This Row],[Name]])*Table1[Bnk]))),\"\")","v":""},{"$f":"IFERROR(INDEX(Table1[Pin],1/(1/SUMPRODUCT((Table1[Reps]=RIGHT(INDEX(Table5[#Headers],coln),2)*1)*(Table1[Name]=Table5[[#This Row],[Name]])*Table1[Bnk]))),\"\")","v":""},{"$f":"IFERROR(INDEX(Table1[Pin],1/(1/SUMPRODUCT((Table1[Reps]=RIGHT(INDEX(Table5[#Headers],coln),2)*1)*(Table1[Name]=Table5[[#This Row],[Name]])*Table1[Bnk]))),\"\")","v":""},{"$f":"IFERROR(INDEX(Table1[Pin],1/(1/SUMPRODUCT((Table1[Reps]=RIGHT(INDEX(Table5[#Headers],coln),2)*1)*(Table1[Name]=Table5[[#This Row],[Name]])*Table1[Bnk]))),\"\")","v":""},{"$f":"IFERROR(INDEX(Table1[Pin],1/(1/SUMPRODUCT((Table1[Reps]=RIGHT(INDEX(Table5[#Headers],coln),2)*1)*(Table1[Name]=Table5[[#This Row],[Name]])*Table1[Bnk]))),\"\")","v":""},{"$f":"IFERROR(INDEX(Table1[Pin],1/(1/SUMPRODUCT((Table1[Reps]=RIGHT(INDEX(Table5[#Headers],coln),2)*1)*(Table1[Name]=Table5[[#This Row],[Name]])*Table1[Bnk]))),\"\")","v":""},{"$f":"IFERROR(INDEX(Table1[Pin],1/(1/SUMPRODUCT((Table1[Reps]=RIGHT(INDEX(Table5[#Headers],coln),2)*1)*(Table1[Name]=Table5[[#This Row],[Name]])*Table1[Bnk]))),\"\")","v":""},{"$f":"[Pin01]","v":"M6"},{"$f":"CONCATENATE([Pin14],IF([Pin02]=\"\",\"\",\", \"&[Pin02]))","v":"M6"},{"$f":"CONCATENATE([Pin15],IF([Pin03]=\"\",\"\",\", \"&[Pin03]))","v":"M6"},{"$f":"CONCATENATE([Pin16],IF([Pin04]=\"\",\"\",\", \"&[Pin04]))","v":"M6"},{"$f":"CONCATENATE([Pin17],IF([Pin05]=\"\",\"\",\", \"&[Pin05]))","v":"M6"},{"$f":"CONCATENATE([Pin18],IF([Pin06]=\"\",\"\",\", \"&[Pin06]))","v":"M6"},{"$f":"CONCATENATE([Pin19],IF([Pin07]=\"\",\"\",\", \"&[Pin07]))","v":"M6"},{"$f":"CONCATENATE([Pin20],IF([Pin08]=\"\",\"\",\", \"&[Pin08]))","v":"M6"},{"$f":"CONCATENATE([Pin21],IF([Pin09]=\"\",\"\",\", \"&[Pin09]))","v":"M6"},{"$f":"CONCATENATE([Pin22],IF([Pin10]=\"\",\"\",\", \"&[Pin10]))","v":"M6"},{"$f":"CONCATENATE([Pin23],IF([Pin11]=\"\",\"\",\", \"&[Pin11]))","v":"M6"},{"$f":"CONCATENATE([Pin24],IF([Pin12]=\"\",\"\",\", \"&[Pin12]))","v":"M6"},{"$f":"CONCATENATE([Pin25],IF([Pin13]=\"\",\"\",\", \"&[Pin13]))","v":"M6"},{"$f":"IFERROR(INDEX(Table1[InOut],1/(1/SUMPRODUCT((Table1[Reps]=1)*(Table1[Name]=Table5[[#This Row],[Name]])*Table1[Seq]))),\"\")","v":"I/O"},{"$f":"IFERROR(INDEX(Table1[Level],1/(1/SUMPRODUCT((Table1[Reps]=1)*(Table1[Name]=Table5[[#This Row],[Name]])*Table1[Seq]))),\"\")","v":"TTL"},{"$f":"IFERROR(INDEX(Table1[Func],1/(1/SUMPRODUCT((Table1[Reps]=1)*(Table1[Name]=Table5[[#This Row],[Name]])*Table1[Seq]))),\"\")","v":"GPIOportAbit7."}]
[null,null,"C7","VDDA","-","Power","Thepositivesupply(3.3V)fortheanalogcircuits(ADC,Analog",{"$f":"COUNTIF(INDEX([Name],1):Table1[[#This Row],[Name]],[Name])","v":2},{"$f":"IF(ISTEXT([Pin]),[Seq],INDEX([Bnk],[Seq]-1))","v":46},46,null,null,"PB0",{"$f":"IFERROR(INDEX(Table1[Pin],1/(1/SUMPRODUCT((Table1[Reps]=RIGHT(INDEX(Table5[#Headers],coln),2)*1)*(Table1[Name]=Table5[[#This Row],[Name]])*Table1[Bnk]))),\"\")","v":"E12"},{"$f":"IFERROR(INDEX(Table1[Pin],1/(1/SUMPRODUCT((Table1[Reps]=RIGHT(INDEX(Table5[#Headers],coln),2)*1)*(Table1[Name]=Table5[[#This Row],[Name]])*Table1[Bnk]))),\"\")","v":""},{"$f":"IFERROR(INDEX(Table1[Pin],1/(1/SUMPRODUCT((Table1[Reps]=RIGHT(INDEX(Table5[#Headers],coln),2)*1)*(Table1[Name]=Table5[[#This Row],[Name]])*Table1[Bnk]))),\"\")","v":""},{"$f":"IFERROR(INDEX(Table1[Pin],1/(1/SUMPRODUCT((Table1[Reps]=RIGHT(INDEX(Table5[#Headers],coln),2)*1)*(Table1[Name]=Table5[[#This Row],[Name]])*Table1[Bnk]))),\"\")","v":""},{"$f":"IFERROR(INDEX(Table1[Pin],1/(1/SUMPRODUCT((Table1[Reps]=RIGHT(INDEX(Table5[#Headers],coln),2)*1)*(Table1[Name]=Table5[[#This Row],[Name]])*Table1[Bnk]))),\"\")","v":""},{"$f":"IFERROR(INDEX(Table1[Pin],1/(1/SUMPRODUCT((Table1[Reps]=RIGHT(INDEX(Table5[#Headers],coln),2)*1)*(Table1[Name]=Table5[[#This Row],[Name]])*Table1[Bnk]))),\"\")","v":""},{"$f":"IFERROR(INDEX(Table1[Pin],1/(1/SUMPRODUCT((Table1[Reps]=RIGHT(INDEX(Table5[#Headers],coln),2)*1)*(Table1[Name]=Table5[[#This Row],[Name]])*Table1[Bnk]))),\"\")","v":""},{"$f":"IFERROR(INDEX(Table1[Pin],1/(1/SUMPRODUCT((Table1[Reps]=RIGHT(INDEX(Table5[#Headers],coln),2)*1)*(Table1[Name]=Table5[[#This Row],[Name]])*Table1[Bnk]))),\"\")","v":""},{"$f":"IFERROR(INDEX(Table1[Pin],1/(1/SUMPRODUCT((Table1[Reps]=RIGHT(INDEX(Table5[#Headers],coln),2)*1)*(Table1[Name]=Table5[[#This Row],[Name]])*Table1[Bnk]))),\"\")","v":""},{"$f":"IFERROR(INDEX(Table1[Pin],1/(1/SUMPRODUCT((Table1[Reps]=RIGHT(INDEX(Table5[#Headers],coln),2)*1)*(Table1[Name]=Table5[[#This Row],[Name]])*Table1[Bnk]))),\"\")","v":""},{"$f":"IFERROR(INDEX(Table1[Pin],1/(1/SUMPRODUCT((Table1[Reps]=RIGHT(INDEX(Table5[#Headers],coln),2)*1)*(Table1[Name]=Table5[[#This Row],[Name]])*Table1[Bnk]))),\"\")","v":""},{"$f":"IFERROR(INDEX(Table1[Pin],1/(1/SUMPRODUCT((Table1[Reps]=RIGHT(INDEX(Table5[#Headers],coln),2)*1)*(Table1[Name]=Table5[[#This Row],[Name]])*Table1[Bnk]))),\"\")","v":""},{"$f":"IFERROR(INDEX(Table1[Pin],1/(1/SUMPRODUCT((Table1[Reps]=RIGHT(INDEX(Table5[#Headers],coln),2)*1)*(Table1[Name]=Table5[[#This Row],[Name]])*Table1[Bnk]))),\"\")","v":""},{"$f":"[Pin01]","v":"E12"},{"$f":"CONCATENATE([Pin14],IF([Pin02]=\"\",\"\",\", \"&[Pin02]))","v":"E12"},{"$f":"CONCATENATE([Pin15],IF([Pin03]=\"\",\"\",\", \"&[Pin03]))","v":"E12"},{"$f":"CONCATENATE([Pin16],IF([Pin04]=\"\",\"\",\", \"&[Pin04]))","v":"E12"},{"$f":"CONCATENATE([Pin17],IF([Pin05]=\"\",\"\",\", \"&[Pin05]))","v":"E12"},{"$f":"CONCATENATE([Pin18],IF([Pin06]=\"\",\"\",\", \"&[Pin06]))","v":"E12"},{"$f":"CONCATENATE([Pin19],IF([Pin07]=\"\",\"\",\", \"&[Pin07]))","v":"E12"},{"$f":"CONCATENATE([Pin20],IF([Pin08]=\"\",\"\",\", \"&[Pin08]))","v":"E12"},{"$f":"CONCATENATE([Pin21],IF([Pin09]=\"\",\"\",\", \"&[Pin09]))","v":"E12"},{"$f":"CONCATENATE([Pin22],IF([Pin10]=\"\",\"\",\", \"&[Pin10]))","v":"E12"},{"$f":"CONCATENATE([Pin23],IF([Pin11]=\"\",\"\",\", \"&[Pin11]))","v":"E12"},{"$f":"CONCATENATE([Pin24],IF([Pin12]=\"\",\"\",\", \"&[Pin12]))","v":"E12"},{"$f":"CONCATENATE([Pin25],IF([Pin13]=\"\",\"\",\", \"&[Pin13]))","v":"E12"},{"$f":"IFERROR(INDEX(Table1[InOut],1/(1/SUMPRODUCT((Table1[Reps]=1)*(Table1[Name]=Table5[[#This Row],[Name]])*Table1[Seq]))),\"\")","v":"I/O"},{"$f":"IFERROR(INDEX(Table1[Level],1/(1/SUMPRODUCT((Table1[Reps]=1)*(Table1[Name]=Table5[[#This Row],[Name]])*Table1[Seq]))),\"\")","v":"TTL"},{"$f":"IFERROR(INDEX(Table1[Func],1/(1/SUMPRODUCT((Table1[Reps]=1)*(Table1[Name]=Table5[[#This Row],[Name]])*Table1[Seq]))),\"\")","v":"GPIOportBbit0."}]
[null,null,"C8","GNDPHY","-","Power","GNDoftheEthernetPHY.",{"$f":"COUNTIF(INDEX([Name],1):Table1[[#This Row],[Name]],[Name])","v":1},{"$f":"IF(ISTEXT([Pin]),[Seq],INDEX([Bnk],[Seq]-1))","v":47},47,null,null,"PB1",{"$f":"IFERROR(INDEX(Table1[Pin],1/(1/SUMPRODUCT((Table1[Reps]=RIGHT(INDEX(Table5[#Headers],coln),2)*1)*(Table1[Name]=Table5[[#This Row],[Name]])*Table1[Bnk]))),\"\")","v":"D12"},{"$f":"IFERROR(INDEX(Table1[Pin],1/(1/SUMPRODUCT((Table1[Reps]=RIGHT(INDEX(Table5[#Headers],coln),2)*1)*(Table1[Name]=Table5[[#This Row],[Name]])*Table1[Bnk]))),\"\")","v":""},{"$f":"IFERROR(INDEX(Table1[Pin],1/(1/SUMPRODUCT((Table1[Reps]=RIGHT(INDEX(Table5[#Headers],coln),2)*1)*(Table1[Name]=Table5[[#This Row],[Name]])*Table1[Bnk]))),\"\")","v":""},{"$f":"IFERROR(INDEX(Table1[Pin],1/(1/SUMPRODUCT((Table1[Reps]=RIGHT(INDEX(Table5[#Headers],coln),2)*1)*(Table1[Name]=Table5[[#This Row],[Name]])*Table1[Bnk]))),\"\")","v":""},{"$f":"IFERROR(INDEX(Table1[Pin],1/(1/SUMPRODUCT((Table1[Reps]=RIGHT(INDEX(Table5[#Headers],coln),2)*1)*(Table1[Name]=Table5[[#This Row],[Name]])*Table1[Bnk]))),\"\")","v":""},{"$f":"IFERROR(INDEX(Table1[Pin],1/(1/SUMPRODUCT((Table1[Reps]=RIGHT(INDEX(Table5[#Headers],coln),2)*1)*(Table1[Name]=Table5[[#This Row],[Name]])*Table1[Bnk]))),\"\")","v":""},{"$f":"IFERROR(INDEX(Table1[Pin],1/(1/SUMPRODUCT((Table1[Reps]=RIGHT(INDEX(Table5[#Headers],coln),2)*1)*(Table1[Name]=Table5[[#This Row],[Name]])*Table1[Bnk]))),\"\")","v":""},{"$f":"IFERROR(INDEX(Table1[Pin],1/(1/SUMPRODUCT((Table1[Reps]=RIGHT(INDEX(Table5[#Headers],coln),2)*1)*(Table1[Name]=Table5[[#This Row],[Name]])*Table1[Bnk]))),\"\")","v":""},{"$f":"IFERROR(INDEX(Table1[Pin],1/(1/SUMPRODUCT((Table1[Reps]=RIGHT(INDEX(Table5[#Headers],coln),2)*1)*(Table1[Name]=Table5[[#This Row],[Name]])*Table1[Bnk]))),\"\")","v":""},{"$f":"IFERROR(INDEX(Table1[Pin],1/(1/SUMPRODUCT((Table1[Reps]=RIGHT(INDEX(Table5[#Headers],coln),2)*1)*(Table1[Name]=Table5[[#This Row],[Name]])*Table1[Bnk]))),\"\")","v":""},{"$f":"IFERROR(INDEX(Table1[Pin],1/(1/SUMPRODUCT((Table1[Reps]=RIGHT(INDEX(Table5[#Headers],coln),2)*1)*(Table1[Name]=Table5[[#This Row],[Name]])*Table1[Bnk]))),\"\")","v":""},{"$f":"IFERROR(INDEX(Table1[Pin],1/(1/SUMPRODUCT((Table1[Reps]=RIGHT(INDEX(Table5[#Headers],coln),2)*1)*(Table1[Name]=Table5[[#This Row],[Name]])*Table1[Bnk]))),\"\")","v":""},{"$f":"IFERROR(INDEX(Table1[Pin],1/(1/SUMPRODUCT((Table1[Reps]=RIGHT(INDEX(Table5[#Headers],coln),2)*1)*(Table1[Name]=Table5[[#This Row],[Name]])*Table1[Bnk]))),\"\")","v":""},{"$f":"[Pin01]","v":"D12"},{"$f":"CONCATENATE([Pin14],IF([Pin02]=\"\",\"\",\", \"&[Pin02]))","v":"D12"},{"$f":"CONCATENATE([Pin15],IF([Pin03]=\"\",\"\",\", \"&[Pin03]))","v":"D12"},{"$f":"CONCATENATE([Pin16],IF([Pin04]=\"\",\"\",\", \"&[Pin04]))","v":"D12"},{"$f":"CONCATENATE([Pin17],IF([Pin05]=\"\",\"\",\", \"&[Pin05]))","v":"D12"},{"$f":"CONCATENATE([Pin18],IF([Pin06]=\"\",\"\",\", \"&[Pin06]))","v":"D12"},{"$f":"CONCATENATE([Pin19],IF([Pin07]=\"\",\"\",\", \"&[Pin07]))","v":"D12"},{"$f":"CONCATENATE([Pin20],IF([Pin08]=\"\",\"\",\", \"&[Pin08]))","v":"D12"},{"$f":"CONCATENATE([Pin21],IF([Pin09]=\"\",\"\",\", \"&[Pin09]))","v":"D12"},{"$f":"CONCATENATE([Pin22],IF([Pin10]=\"\",\"\",\", \"&[Pin10]))","v":"D12"},{"$f":"CONCATENATE([Pin23],IF([Pin11]=\"\",\"\",\", \"&[Pin11]))","v":"D12"},{"$f":"CONCATENATE([Pin24],IF([Pin12]=\"\",\"\",\", \"&[Pin12]))","v":"D12"},{"$f":"CONCATENATE([Pin25],IF([Pin13]=\"\",\"\",\", \"&[Pin13]))","v":"D12"},{"$f":"IFERROR(INDEX(Table1[InOut],1/(1/SUMPRODUCT((Table1[Reps]=1)*(Table1[Name]=Table5[[#This Row],[Name]])*Table1[Seq]))),\"\")","v":"I/O"},{"$f":"IFERROR(INDEX(Table1[Level],1/(1/SUMPRODUCT((Table1[Reps]=1)*(Table1[Name]=Table5[[#This Row],[Name]])*Table1[Seq]))),\"\")","v":"TTL"},{"$f":"IFERROR(INDEX(Table1[Func],1/(1/SUMPRODUCT((Table1[Reps]=1)*(Table1[Name]=Table5[[#This Row],[Name]])*Table1[Seq]))),\"\")","v":"GPIOportBbit1."}]
[null,null,"C9","GNDPHY","-","Power","GNDoftheEthernetPHY.",{"$f":"COUNTIF(INDEX([Name],1):Table1[[#This Row],[Name]],[Name])","v":2},{"$f":"IF(ISTEXT([Pin]),[Seq],INDEX([Bnk],[Seq]-1))","v":48},48,null,null,"PB2",{"$f":"IFERROR(INDEX(Table1[Pin],1/(1/SUMPRODUCT((Table1[Reps]=RIGHT(INDEX(Table5[#Headers],coln),2)*1)*(Table1[Name]=Table5[[#This Row],[Name]])*Table1[Bnk]))),\"\")","v":"C11"},{"$f":"IFERROR(INDEX(Table1[Pin],1/(1/SUMPRODUCT((Table1[Reps]=RIGHT(INDEX(Table5[#Headers],coln),2)*1)*(Table1[Name]=Table5[[#This Row],[Name]])*Table1[Bnk]))),\"\")","v":""},{"$f":"IFERROR(INDEX(Table1[Pin],1/(1/SUMPRODUCT((Table1[Reps]=RIGHT(INDEX(Table5[#Headers],coln),2)*1)*(Table1[Name]=Table5[[#This Row],[Name]])*Table1[Bnk]))),\"\")","v":""},{"$f":"IFERROR(INDEX(Table1[Pin],1/(1/SUMPRODUCT((Table1[Reps]=RIGHT(INDEX(Table5[#Headers],coln),2)*1)*(Table1[Name]=Table5[[#This Row],[Name]])*Table1[Bnk]))),\"\")","v":""},{"$f":"IFERROR(INDEX(Table1[Pin],1/(1/SUMPRODUCT((Table1[Reps]=RIGHT(INDEX(Table5[#Headers],coln),2)*1)*(Table1[Name]=Table5[[#This Row],[Name]])*Table1[Bnk]))),\"\")","v":""},{"$f":"IFERROR(INDEX(Table1[Pin],1/(1/SUMPRODUCT((Table1[Reps]=RIGHT(INDEX(Table5[#Headers],coln),2)*1)*(Table1[Name]=Table5[[#This Row],[Name]])*Table1[Bnk]))),\"\")","v":""},{"$f":"IFERROR(INDEX(Table1[Pin],1/(1/SUMPRODUCT((Table1[Reps]=RIGHT(INDEX(Table5[#Headers],coln),2)*1)*(Table1[Name]=Table5[[#This Row],[Name]])*Table1[Bnk]))),\"\")","v":""},{"$f":"IFERROR(INDEX(Table1[Pin],1/(1/SUMPRODUCT((Table1[Reps]=RIGHT(INDEX(Table5[#Headers],coln),2)*1)*(Table1[Name]=Table5[[#This Row],[Name]])*Table1[Bnk]))),\"\")","v":""},{"$f":"IFERROR(INDEX(Table1[Pin],1/(1/SUMPRODUCT((Table1[Reps]=RIGHT(INDEX(Table5[#Headers],coln),2)*1)*(Table1[Name]=Table5[[#This Row],[Name]])*Table1[Bnk]))),\"\")","v":""},{"$f":"IFERROR(INDEX(Table1[Pin],1/(1/SUMPRODUCT((Table1[Reps]=RIGHT(INDEX(Table5[#Headers],coln),2)*1)*(Table1[Name]=Table5[[#This Row],[Name]])*Table1[Bnk]))),\"\")","v":""},{"$f":"IFERROR(INDEX(Table1[Pin],1/(1/SUMPRODUCT((Table1[Reps]=RIGHT(INDEX(Table5[#Headers],coln),2)*1)*(Table1[Name]=Table5[[#This Row],[Name]])*Table1[Bnk]))),\"\")","v":""},{"$f":"IFERROR(INDEX(Table1[Pin],1/(1/SUMPRODUCT((Table1[Reps]=RIGHT(INDEX(Table5[#Headers],coln),2)*1)*(Table1[Name]=Table5[[#This Row],[Name]])*Table1[Bnk]))),\"\")","v":""},{"$f":"IFERROR(INDEX(Table1[Pin],1/(1/SUMPRODUCT((Table1[Reps]=RIGHT(INDEX(Table5[#Headers],coln),2)*1)*(Table1[Name]=Table5[[#This Row],[Name]])*Table1[Bnk]))),\"\")","v":""},{"$f":"[Pin01]","v":"C11"},{"$f":"CONCATENATE([Pin14],IF([Pin02]=\"\",\"\",\", \"&[Pin02]))","v":"C11"},{"$f":"CONCATENATE([Pin15],IF([Pin03]=\"\",\"\",\", \"&[Pin03]))","v":"C11"},{"$f":"CONCATENATE([Pin16],IF([Pin04]=\"\",\"\",\", \"&[Pin04]))","v":"C11"},{"$f":"CONCATENATE([Pin17],IF([Pin05]=\"\",\"\",\", \"&[Pin05]))","v":"C11"},{"$f":"CONCATENATE([Pin18],IF([Pin06]=\"\",\"\",\", \"&[Pin06]))","v":"C11"},{"$f":"CONCATENATE([Pin19],IF([Pin07]=\"\",\"\",\", \"&[Pin07]))","v":"C11"},{"$f":"CONCATENATE([Pin20],IF([Pin08]=\"\",\"\",\", \"&[Pin08]))","v":"C11"},{"$f":"CONCATENATE([Pin21],IF([Pin09]=\"\",\"\",\", \"&[Pin09]))","v":"C11"},{"$f":"CONCATENATE([Pin22],IF([Pin10]=\"\",\"\",\", \"&[Pin10]))","v":"C11"},{"$f":"CONCATENATE([Pin23],IF([Pin11]=\"\",\"\",\", \"&[Pin11]))","v":"C11"},{"$f":"CONCATENATE([Pin24],IF([Pin12]=\"\",\"\",\", \"&[Pin12]))","v":"C11"},{"$f":"CONCATENATE([Pin25],IF([Pin13]=\"\",\"\",\", \"&[Pin13]))","v":"C11"},{"$f":"IFERROR(INDEX(Table1[InOut],1/(1/SUMPRODUCT((Table1[Reps]=1)*(Table1[Name]=Table5[[#This Row],[Name]])*Table1[Seq]))),\"\")","v":"I/O"},{"$f":"IFERROR(INDEX(Table1[Level],1/(1/SUMPRODUCT((Table1[Reps]=1)*(Table1[Name]=Table5[[#This Row],[Name]])*Table1[Seq]))),\"\")","v":"TTL"},{"$f":"IFERROR(INDEX(Table1[Func],1/(1/SUMPRODUCT((Table1[Reps]=1)*(Table1[Name]=Table5[[#This Row],[Name]])*Table1[Seq]))),\"\")","v":"GPIOportBbit2."}]
[null,null,"C10","VCCPHY","-","Power","VCCoftheEthernetPHY.",{"$f":"COUNTIF(INDEX([Name],1):Table1[[#This Row],[Name]],[Name])","v":1},{"$f":"IF(ISTEXT([Pin]),[Seq],INDEX([Bnk],[Seq]-1))","v":49},49,null,null,"PB3",{"$f":"IFERROR(INDEX(Table1[Pin],1/(1/SUMPRODUCT((Table1[Reps]=RIGHT(INDEX(Table5[#Headers],coln),2)*1)*(Table1[Name]=Table5[[#This Row],[Name]])*Table1[Bnk]))),\"\")","v":"C12"},{"$f":"IFERROR(INDEX(Table1[Pin],1/(1/SUMPRODUCT((Table1[Reps]=RIGHT(INDEX(Table5[#Headers],coln),2)*1)*(Table1[Name]=Table5[[#This Row],[Name]])*Table1[Bnk]))),\"\")","v":""},{"$f":"IFERROR(INDEX(Table1[Pin],1/(1/SUMPRODUCT((Table1[Reps]=RIGHT(INDEX(Table5[#Headers],coln),2)*1)*(Table1[Name]=Table5[[#This Row],[Name]])*Table1[Bnk]))),\"\")","v":""},{"$f":"IFERROR(INDEX(Table1[Pin],1/(1/SUMPRODUCT((Table1[Reps]=RIGHT(INDEX(Table5[#Headers],coln),2)*1)*(Table1[Name]=Table5[[#This Row],[Name]])*Table1[Bnk]))),\"\")","v":""},{"$f":"IFERROR(INDEX(Table1[Pin],1/(1/SUMPRODUCT((Table1[Reps]=RIGHT(INDEX(Table5[#Headers],coln),2)*1)*(Table1[Name]=Table5[[#This Row],[Name]])*Table1[Bnk]))),\"\")","v":""},{"$f":"IFERROR(INDEX(Table1[Pin],1/(1/SUMPRODUCT((Table1[Reps]=RIGHT(INDEX(Table5[#Headers],coln),2)*1)*(Table1[Name]=Table5[[#This Row],[Name]])*Table1[Bnk]))),\"\")","v":""},{"$f":"IFERROR(INDEX(Table1[Pin],1/(1/SUMPRODUCT((Table1[Reps]=RIGHT(INDEX(Table5[#Headers],coln),2)*1)*(Table1[Name]=Table5[[#This Row],[Name]])*Table1[Bnk]))),\"\")","v":""},{"$f":"IFERROR(INDEX(Table1[Pin],1/(1/SUMPRODUCT((Table1[Reps]=RIGHT(INDEX(Table5[#Headers],coln),2)*1)*(Table1[Name]=Table5[[#This Row],[Name]])*Table1[Bnk]))),\"\")","v":""},{"$f":"IFERROR(INDEX(Table1[Pin],1/(1/SUMPRODUCT((Table1[Reps]=RIGHT(INDEX(Table5[#Headers],coln),2)*1)*(Table1[Name]=Table5[[#This Row],[Name]])*Table1[Bnk]))),\"\")","v":""},{"$f":"IFERROR(INDEX(Table1[Pin],1/(1/SUMPRODUCT((Table1[Reps]=RIGHT(INDEX(Table5[#Headers],coln),2)*1)*(Table1[Name]=Table5[[#This Row],[Name]])*Table1[Bnk]))),\"\")","v":""},{"$f":"IFERROR(INDEX(Table1[Pin],1/(1/SUMPRODUCT((Table1[Reps]=RIGHT(INDEX(Table5[#Headers],coln),2)*1)*(Table1[Name]=Table5[[#This Row],[Name]])*Table1[Bnk]))),\"\")","v":""},{"$f":"IFERROR(INDEX(Table1[Pin],1/(1/SUMPRODUCT((Table1[Reps]=RIGHT(INDEX(Table5[#Headers],coln),2)*1)*(Table1[Name]=Table5[[#This Row],[Name]])*Table1[Bnk]))),\"\")","v":""},{"$f":"IFERROR(INDEX(Table1[Pin],1/(1/SUMPRODUCT((Table1[Reps]=RIGHT(INDEX(Table5[#Headers],coln),2)*1)*(Table1[Name]=Table5[[#This Row],[Name]])*Table1[Bnk]))),\"\")","v":""},{"$f":"[Pin01]","v":"C12"},{"$f":"CONCATENATE([Pin14],IF([Pin02]=\"\",\"\",\", \"&[Pin02]))","v":"C12"},{"$f":"CONCATENATE([Pin15],IF([Pin03]=\"\",\"\",\", \"&[Pin03]))","v":"C12"},{"$f":"CONCATENATE([Pin16],IF([Pin04]=\"\",\"\",\", \"&[Pin04]))","v":"C12"},{"$f":"CONCATENATE([Pin17],IF([Pin05]=\"\",\"\",\", \"&[Pin05]))","v":"C12"},{"$f":"CONCATENATE([Pin18],IF([Pin06]=\"\",\"\",\", \"&[Pin06]))","v":"C12"},{"$f":"CONCATENATE([Pin19],IF([Pin07]=\"\",\"\",\", \"&[Pin07]))","v":"C12"},{"$f":"CONCATENATE([Pin20],IF([Pin08]=\"\",\"\",\", \"&[Pin08]))","v":"C12"},{"$f":"CONCATENATE([Pin21],IF([Pin09]=\"\",\"\",\", \"&[Pin09]))","v":"C12"},{"$f":"CONCATENATE([Pin22],IF([Pin10]=\"\",\"\",\", \"&[Pin10]))","v":"C12"},{"$f":"CONCATENATE([Pin23],IF([Pin11]=\"\",\"\",\", \"&[Pin11]))","v":"C12"},{"$f":"CONCATENATE([Pin24],IF([Pin12]=\"\",\"\",\", \"&[Pin12]))","v":"C12"},{"$f":"CONCATENATE([Pin25],IF([Pin13]=\"\",\"\",\", \"&[Pin13]))","v":"C12"},{"$f":"IFERROR(INDEX(Table1[InOut],1/(1/SUMPRODUCT((Table1[Reps]=1)*(Table1[Name]=Table5[[#This Row],[Name]])*Table1[Seq]))),\"\")","v":"I/O"},{"$f":"IFERROR(INDEX(Table1[Level],1/(1/SUMPRODUCT((Table1[Reps]=1)*(Table1[Name]=Table5[[#This Row],[Name]])*Table1[Seq]))),\"\")","v":"TTL"},{"$f":"IFERROR(INDEX(Table1[Func],1/(1/SUMPRODUCT((Table1[Reps]=1)*(Table1[Name]=Table5[[#This Row],[Name]])*Table1[Seq]))),\"\")","v":"GPIOportBbit3."}]
[null,null,"C11","PB2","I/O","TTL","GPIOportBbit2.",{"$f":"COUNTIF(INDEX([Name],1):Table1[[#This Row],[Name]],[Name])","v":1},{"$f":"IF(ISTEXT([Pin]),[Seq],INDEX([Bnk],[Seq]-1))","v":50},50,null,null,"PB4",{"$f":"IFERROR(INDEX(Table1[Pin],1/(1/SUMPRODUCT((Table1[Reps]=RIGHT(INDEX(Table5[#Headers],coln),2)*1)*(Table1[Name]=Table5[[#This Row],[Name]])*Table1[Bnk]))),\"\")","v":"A6"},{"$f":"IFERROR(INDEX(Table1[Pin],1/(1/SUMPRODUCT((Table1[Reps]=RIGHT(INDEX(Table5[#Headers],coln),2)*1)*(Table1[Name]=Table5[[#This Row],[Name]])*Table1[Bnk]))),\"\")","v":""},{"$f":"IFERROR(INDEX(Table1[Pin],1/(1/SUMPRODUCT((Table1[Reps]=RIGHT(INDEX(Table5[#Headers],coln),2)*1)*(Table1[Name]=Table5[[#This Row],[Name]])*Table1[Bnk]))),\"\")","v":""},{"$f":"IFERROR(INDEX(Table1[Pin],1/(1/SUMPRODUCT((Table1[Reps]=RIGHT(INDEX(Table5[#Headers],coln),2)*1)*(Table1[Name]=Table5[[#This Row],[Name]])*Table1[Bnk]))),\"\")","v":""},{"$f":"IFERROR(INDEX(Table1[Pin],1/(1/SUMPRODUCT((Table1[Reps]=RIGHT(INDEX(Table5[#Headers],coln),2)*1)*(Table1[Name]=Table5[[#This Row],[Name]])*Table1[Bnk]))),\"\")","v":""},{"$f":"IFERROR(INDEX(Table1[Pin],1/(1/SUMPRODUCT((Table1[Reps]=RIGHT(INDEX(Table5[#Headers],coln),2)*1)*(Table1[Name]=Table5[[#This Row],[Name]])*Table1[Bnk]))),\"\")","v":""},{"$f":"IFERROR(INDEX(Table1[Pin],1/(1/SUMPRODUCT((Table1[Reps]=RIGHT(INDEX(Table5[#Headers],coln),2)*1)*(Table1[Name]=Table5[[#This Row],[Name]])*Table1[Bnk]))),\"\")","v":""},{"$f":"IFERROR(INDEX(Table1[Pin],1/(1/SUMPRODUCT((Table1[Reps]=RIGHT(INDEX(Table5[#Headers],coln),2)*1)*(Table1[Name]=Table5[[#This Row],[Name]])*Table1[Bnk]))),\"\")","v":""},{"$f":"IFERROR(INDEX(Table1[Pin],1/(1/SUMPRODUCT((Table1[Reps]=RIGHT(INDEX(Table5[#Headers],coln),2)*1)*(Table1[Name]=Table5[[#This Row],[Name]])*Table1[Bnk]))),\"\")","v":""},{"$f":"IFERROR(INDEX(Table1[Pin],1/(1/SUMPRODUCT((Table1[Reps]=RIGHT(INDEX(Table5[#Headers],coln),2)*1)*(Table1[Name]=Table5[[#This Row],[Name]])*Table1[Bnk]))),\"\")","v":""},{"$f":"IFERROR(INDEX(Table1[Pin],1/(1/SUMPRODUCT((Table1[Reps]=RIGHT(INDEX(Table5[#Headers],coln),2)*1)*(Table1[Name]=Table5[[#This Row],[Name]])*Table1[Bnk]))),\"\")","v":""},{"$f":"IFERROR(INDEX(Table1[Pin],1/(1/SUMPRODUCT((Table1[Reps]=RIGHT(INDEX(Table5[#Headers],coln),2)*1)*(Table1[Name]=Table5[[#This Row],[Name]])*Table1[Bnk]))),\"\")","v":""},{"$f":"IFERROR(INDEX(Table1[Pin],1/(1/SUMPRODUCT((Table1[Reps]=RIGHT(INDEX(Table5[#Headers],coln),2)*1)*(Table1[Name]=Table5[[#This Row],[Name]])*Table1[Bnk]))),\"\")","v":""},{"$f":"[Pin01]","v":"A6"},{"$f":"CONCATENATE([Pin14],IF([Pin02]=\"\",\"\",\", \"&[Pin02]))","v":"A6"},{"$f":"CONCATENATE([Pin15],IF([Pin03]=\"\",\"\",\", \"&[Pin03]))","v":"A6"},{"$f":"CONCATENATE([Pin16],IF([Pin04]=\"\",\"\",\", \"&[Pin04]))","v":"A6"},{"$f":"CONCATENATE([Pin17],IF([Pin05]=\"\",\"\",\", \"&[Pin05]))","v":"A6"},{"$f":"CONCATENATE([Pin18],IF([Pin06]=\"\",\"\",\", \"&[Pin06]))","v":"A6"},{"$f":"CONCATENATE([Pin19],IF([Pin07]=\"\",\"\",\", \"&[Pin07]))","v":"A6"},{"$f":"CONCATENATE([Pin20],IF([Pin08]=\"\",\"\",\", \"&[Pin08]))","v":"A6"},{"$f":"CONCATENATE([Pin21],IF([Pin09]=\"\",\"\",\", \"&[Pin09]))","v":"A6"},{"$f":"CONCATENATE([Pin22],IF([Pin10]=\"\",\"\",\", \"&[Pin10]))","v":"A6"},{"$f":"CONCATENATE([Pin23],IF([Pin11]=\"\",\"\",\", \"&[Pin11]))","v":"A6"},{"$f":"CONCATENATE([Pin24],IF([Pin12]=\"\",\"\",\", \"&[Pin12]))","v":"A6"},{"$f":"CONCATENATE([Pin25],IF([Pin13]=\"\",\"\",\", \"&[Pin13]))","v":"A6"},{"$f":"IFERROR(INDEX(Table1[InOut],1/(1/SUMPRODUCT((Table1[Reps]=1)*(Table1[Name]=Table5[[#This Row],[Name]])*Table1[Seq]))),\"\")","v":"I/O"},{"$f":"IFERROR(INDEX(Table1[Level],1/(1/SUMPRODUCT((Table1[Reps]=1)*(Table1[Name]=Table5[[#This Row],[Name]])*Table1[Seq]))),\"\")","v":"TTL"},{"$f":"IFERROR(INDEX(Table1[Func],1/(1/SUMPRODUCT((Table1[Reps]=1)*(Table1[Name]=Table5[[#This Row],[Name]])*Table1[Seq]))),\"\")","v":"GPIOportBbit4."}]
[null,null,null,"I2C0SCL","I/O","OD","2Cmodule0clock.",{"$f":"COUNTIF(INDEX([Name],1):Table1[[#This Row],[Name]],[Name])","v":1},{"$f":"IF(ISTEXT([Pin]),[Seq],INDEX([Bnk],[Seq]-1))","v":50},51,null,null,"PB5",{"$f":"IFERROR(INDEX(Table1[Pin],1/(1/SUMPRODUCT((Table1[Reps]=RIGHT(INDEX(Table5[#Headers],coln),2)*1)*(Table1[Name]=Table5[[#This Row],[Name]])*Table1[Bnk]))),\"\")","v":"B7"},{"$f":"IFERROR(INDEX(Table1[Pin],1/(1/SUMPRODUCT((Table1[Reps]=RIGHT(INDEX(Table5[#Headers],coln),2)*1)*(Table1[Name]=Table5[[#This Row],[Name]])*Table1[Bnk]))),\"\")","v":""},{"$f":"IFERROR(INDEX(Table1[Pin],1/(1/SUMPRODUCT((Table1[Reps]=RIGHT(INDEX(Table5[#Headers],coln),2)*1)*(Table1[Name]=Table5[[#This Row],[Name]])*Table1[Bnk]))),\"\")","v":""},{"$f":"IFERROR(INDEX(Table1[Pin],1/(1/SUMPRODUCT((Table1[Reps]=RIGHT(INDEX(Table5[#Headers],coln),2)*1)*(Table1[Name]=Table5[[#This Row],[Name]])*Table1[Bnk]))),\"\")","v":""},{"$f":"IFERROR(INDEX(Table1[Pin],1/(1/SUMPRODUCT((Table1[Reps]=RIGHT(INDEX(Table5[#Headers],coln),2)*1)*(Table1[Name]=Table5[[#This Row],[Name]])*Table1[Bnk]))),\"\")","v":""},{"$f":"IFERROR(INDEX(Table1[Pin],1/(1/SUMPRODUCT((Table1[Reps]=RIGHT(INDEX(Table5[#Headers],coln),2)*1)*(Table1[Name]=Table5[[#This Row],[Name]])*Table1[Bnk]))),\"\")","v":""},{"$f":"IFERROR(INDEX(Table1[Pin],1/(1/SUMPRODUCT((Table1[Reps]=RIGHT(INDEX(Table5[#Headers],coln),2)*1)*(Table1[Name]=Table5[[#This Row],[Name]])*Table1[Bnk]))),\"\")","v":""},{"$f":"IFERROR(INDEX(Table1[Pin],1/(1/SUMPRODUCT((Table1[Reps]=RIGHT(INDEX(Table5[#Headers],coln),2)*1)*(Table1[Name]=Table5[[#This Row],[Name]])*Table1[Bnk]))),\"\")","v":""},{"$f":"IFERROR(INDEX(Table1[Pin],1/(1/SUMPRODUCT((Table1[Reps]=RIGHT(INDEX(Table5[#Headers],coln),2)*1)*(Table1[Name]=Table5[[#This Row],[Name]])*Table1[Bnk]))),\"\")","v":""},{"$f":"IFERROR(INDEX(Table1[Pin],1/(1/SUMPRODUCT((Table1[Reps]=RIGHT(INDEX(Table5[#Headers],coln),2)*1)*(Table1[Name]=Table5[[#This Row],[Name]])*Table1[Bnk]))),\"\")","v":""},{"$f":"IFERROR(INDEX(Table1[Pin],1/(1/SUMPRODUCT((Table1[Reps]=RIGHT(INDEX(Table5[#Headers],coln),2)*1)*(Table1[Name]=Table5[[#This Row],[Name]])*Table1[Bnk]))),\"\")","v":""},{"$f":"IFERROR(INDEX(Table1[Pin],1/(1/SUMPRODUCT((Table1[Reps]=RIGHT(INDEX(Table5[#Headers],coln),2)*1)*(Table1[Name]=Table5[[#This Row],[Name]])*Table1[Bnk]))),\"\")","v":""},{"$f":"IFERROR(INDEX(Table1[Pin],1/(1/SUMPRODUCT((Table1[Reps]=RIGHT(INDEX(Table5[#Headers],coln),2)*1)*(Table1[Name]=Table5[[#This Row],[Name]])*Table1[Bnk]))),\"\")","v":""},{"$f":"[Pin01]","v":"B7"},{"$f":"CONCATENATE([Pin14],IF([Pin02]=\"\",\"\",\", \"&[Pin02]))","v":"B7"},{"$f":"CONCATENATE([Pin15],IF([Pin03]=\"\",\"\",\", \"&[Pin03]))","v":"B7"},{"$f":"CONCATENATE([Pin16],IF([Pin04]=\"\",\"\",\", \"&[Pin04]))","v":"B7"},{"$f":"CONCATENATE([Pin17],IF([Pin05]=\"\",\"\",\", \"&[Pin05]))","v":"B7"},{"$f":"CONCATENATE([Pin18],IF([Pin06]=\"\",\"\",\", \"&[Pin06]))","v":"B7"},{"$f":"CONCATENATE([Pin19],IF([Pin07]=\"\",\"\",\", \"&[Pin07]))","v":"B7"},{"$f":"CONCATENATE([Pin20],IF([Pin08]=\"\",\"\",\", \"&[Pin08]))","v":"B7"},{"$f":"CONCATENATE([Pin21],IF([Pin09]=\"\",\"\",\", \"&[Pin09]))","v":"B7"},{"$f":"CONCATENATE([Pin22],IF([Pin10]=\"\",\"\",\", \"&[Pin10]))","v":"B7"},{"$f":"CONCATENATE([Pin23],IF([Pin11]=\"\",\"\",\", \"&[Pin11]))","v":"B7"},{"$f":"CONCATENATE([Pin24],IF([Pin12]=\"\",\"\",\", \"&[Pin12]))","v":"B7"},{"$f":"CONCATENATE([Pin25],IF([Pin13]=\"\",\"\",\", \"&[Pin13]))","v":"B7"},{"$f":"IFERROR(INDEX(Table1[InOut],1/(1/SUMPRODUCT((Table1[Reps]=1)*(Table1[Name]=Table5[[#This Row],[Name]])*Table1[Seq]))),\"\")","v":"I/O"},{"$f":"IFERROR(INDEX(Table1[Level],1/(1/SUMPRODUCT((Table1[Reps]=1)*(Table1[Name]=Table5[[#This Row],[Name]])*Table1[Seq]))),\"\")","v":"TTL"},{"$f":"IFERROR(INDEX(Table1[Func],1/(1/SUMPRODUCT((Table1[Reps]=1)*(Table1[Name]=Table5[[#This Row],[Name]])*Table1[Seq]))),\"\")","v":"GPIOportBbit5."}]
[null,null,"C12","PB3","I/O","TTL","GPIOportBbit3.",{"$f":"COUNTIF(INDEX([Name],1):Table1[[#This Row],[Name]],[Name])","v":1},{"$f":"IF(ISTEXT([Pin]),[Seq],INDEX([Bnk],[Seq]-1))","v":52},52,null,null,"PB6",{"$f":"IFERROR(INDEX(Table1[Pin],1/(1/SUMPRODUCT((Table1[Reps]=RIGHT(INDEX(Table5[#Headers],coln),2)*1)*(Table1[Name]=Table5[[#This Row],[Name]])*Table1[Bnk]))),\"\")","v":"A7"},{"$f":"IFERROR(INDEX(Table1[Pin],1/(1/SUMPRODUCT((Table1[Reps]=RIGHT(INDEX(Table5[#Headers],coln),2)*1)*(Table1[Name]=Table5[[#This Row],[Name]])*Table1[Bnk]))),\"\")","v":""},{"$f":"IFERROR(INDEX(Table1[Pin],1/(1/SUMPRODUCT((Table1[Reps]=RIGHT(INDEX(Table5[#Headers],coln),2)*1)*(Table1[Name]=Table5[[#This Row],[Name]])*Table1[Bnk]))),\"\")","v":""},{"$f":"IFERROR(INDEX(Table1[Pin],1/(1/SUMPRODUCT((Table1[Reps]=RIGHT(INDEX(Table5[#Headers],coln),2)*1)*(Table1[Name]=Table5[[#This Row],[Name]])*Table1[Bnk]))),\"\")","v":""},{"$f":"IFERROR(INDEX(Table1[Pin],1/(1/SUMPRODUCT((Table1[Reps]=RIGHT(INDEX(Table5[#Headers],coln),2)*1)*(Table1[Name]=Table5[[#This Row],[Name]])*Table1[Bnk]))),\"\")","v":""},{"$f":"IFERROR(INDEX(Table1[Pin],1/(1/SUMPRODUCT((Table1[Reps]=RIGHT(INDEX(Table5[#Headers],coln),2)*1)*(Table1[Name]=Table5[[#This Row],[Name]])*Table1[Bnk]))),\"\")","v":""},{"$f":"IFERROR(INDEX(Table1[Pin],1/(1/SUMPRODUCT((Table1[Reps]=RIGHT(INDEX(Table5[#Headers],coln),2)*1)*(Table1[Name]=Table5[[#This Row],[Name]])*Table1[Bnk]))),\"\")","v":""},{"$f":"IFERROR(INDEX(Table1[Pin],1/(1/SUMPRODUCT((Table1[Reps]=RIGHT(INDEX(Table5[#Headers],coln),2)*1)*(Table1[Name]=Table5[[#This Row],[Name]])*Table1[Bnk]))),\"\")","v":""},{"$f":"IFERROR(INDEX(Table1[Pin],1/(1/SUMPRODUCT((Table1[Reps]=RIGHT(INDEX(Table5[#Headers],coln),2)*1)*(Table1[Name]=Table5[[#This Row],[Name]])*Table1[Bnk]))),\"\")","v":""},{"$f":"IFERROR(INDEX(Table1[Pin],1/(1/SUMPRODUCT((Table1[Reps]=RIGHT(INDEX(Table5[#Headers],coln),2)*1)*(Table1[Name]=Table5[[#This Row],[Name]])*Table1[Bnk]))),\"\")","v":""},{"$f":"IFERROR(INDEX(Table1[Pin],1/(1/SUMPRODUCT((Table1[Reps]=RIGHT(INDEX(Table5[#Headers],coln),2)*1)*(Table1[Name]=Table5[[#This Row],[Name]])*Table1[Bnk]))),\"\")","v":""},{"$f":"IFERROR(INDEX(Table1[Pin],1/(1/SUMPRODUCT((Table1[Reps]=RIGHT(INDEX(Table5[#Headers],coln),2)*1)*(Table1[Name]=Table5[[#This Row],[Name]])*Table1[Bnk]))),\"\")","v":""},{"$f":"IFERROR(INDEX(Table1[Pin],1/(1/SUMPRODUCT((Table1[Reps]=RIGHT(INDEX(Table5[#Headers],coln),2)*1)*(Table1[Name]=Table5[[#This Row],[Name]])*Table1[Bnk]))),\"\")","v":""},{"$f":"[Pin01]","v":"A7"},{"$f":"CONCATENATE([Pin14],IF([Pin02]=\"\",\"\",\", \"&[Pin02]))","v":"A7"},{"$f":"CONCATENATE([Pin15],IF([Pin03]=\"\",\"\",\", \"&[Pin03]))","v":"A7"},{"$f":"CONCATENATE([Pin16],IF([Pin04]=\"\",\"\",\", \"&[Pin04]))","v":"A7"},{"$f":"CONCATENATE([Pin17],IF([Pin05]=\"\",\"\",\", \"&[Pin05]))","v":"A7"},{"$f":"CONCATENATE([Pin18],IF([Pin06]=\"\",\"\",\", \"&[Pin06]))","v":"A7"},{"$f":"CONCATENATE([Pin19],IF([Pin07]=\"\",\"\",\", \"&[Pin07]))","v":"A7"},{"$f":"CONCATENATE([Pin20],IF([Pin08]=\"\",\"\",\", \"&[Pin08]))","v":"A7"},{"$f":"CONCATENATE([Pin21],IF([Pin09]=\"\",\"\",\", \"&[Pin09]))","v":"A7"},{"$f":"CONCATENATE([Pin22],IF([Pin10]=\"\",\"\",\", \"&[Pin10]))","v":"A7"},{"$f":"CONCATENATE([Pin23],IF([Pin11]=\"\",\"\",\", \"&[Pin11]))","v":"A7"},{"$f":"CONCATENATE([Pin24],IF([Pin12]=\"\",\"\",\", \"&[Pin12]))","v":"A7"},{"$f":"CONCATENATE([Pin25],IF([Pin13]=\"\",\"\",\", \"&[Pin13]))","v":"A7"},{"$f":"IFERROR(INDEX(Table1[InOut],1/(1/SUMPRODUCT((Table1[Reps]=1)*(Table1[Name]=Table5[[#This Row],[Name]])*Table1[Seq]))),\"\")","v":"I/O"},{"$f":"IFERROR(INDEX(Table1[Level],1/(1/SUMPRODUCT((Table1[Reps]=1)*(Table1[Name]=Table5[[#This Row],[Name]])*Table1[Seq]))),\"\")","v":"TTL"},{"$f":"IFERROR(INDEX(Table1[Func],1/(1/SUMPRODUCT((Table1[Reps]=1)*(Table1[Name]=Table5[[#This Row],[Name]])*Table1[Seq]))),\"\")","v":"GPIOportBbit6."}]
[null,null,null,"I2C0SDA","I/O","OD","2Cmodule0data.",{"$f":"COUNTIF(INDEX([Name],1):Table1[[#This Row],[Name]],[Name])","v":1},{"$f":"IF(ISTEXT([Pin]),[Seq],INDEX([Bnk],[Seq]-1))","v":52},53,null,null,"PB7",{"$f":"IFERROR(INDEX(Table1[Pin],1/(1/SUMPRODUCT((Table1[Reps]=RIGHT(INDEX(Table5[#Headers],coln),2)*1)*(Table1[Name]=Table5[[#This Row],[Name]])*Table1[Bnk]))),\"\")","v":"A8"},{"$f":"IFERROR(INDEX(Table1[Pin],1/(1/SUMPRODUCT((Table1[Reps]=RIGHT(INDEX(Table5[#Headers],coln),2)*1)*(Table1[Name]=Table5[[#This Row],[Name]])*Table1[Bnk]))),\"\")","v":""},{"$f":"IFERROR(INDEX(Table1[Pin],1/(1/SUMPRODUCT((Table1[Reps]=RIGHT(INDEX(Table5[#Headers],coln),2)*1)*(Table1[Name]=Table5[[#This Row],[Name]])*Table1[Bnk]))),\"\")","v":""},{"$f":"IFERROR(INDEX(Table1[Pin],1/(1/SUMPRODUCT((Table1[Reps]=RIGHT(INDEX(Table5[#Headers],coln),2)*1)*(Table1[Name]=Table5[[#This Row],[Name]])*Table1[Bnk]))),\"\")","v":""},{"$f":"IFERROR(INDEX(Table1[Pin],1/(1/SUMPRODUCT((Table1[Reps]=RIGHT(INDEX(Table5[#Headers],coln),2)*1)*(Table1[Name]=Table5[[#This Row],[Name]])*Table1[Bnk]))),\"\")","v":""},{"$f":"IFERROR(INDEX(Table1[Pin],1/(1/SUMPRODUCT((Table1[Reps]=RIGHT(INDEX(Table5[#Headers],coln),2)*1)*(Table1[Name]=Table5[[#This Row],[Name]])*Table1[Bnk]))),\"\")","v":""},{"$f":"IFERROR(INDEX(Table1[Pin],1/(1/SUMPRODUCT((Table1[Reps]=RIGHT(INDEX(Table5[#Headers],coln),2)*1)*(Table1[Name]=Table5[[#This Row],[Name]])*Table1[Bnk]))),\"\")","v":""},{"$f":"IFERROR(INDEX(Table1[Pin],1/(1/SUMPRODUCT((Table1[Reps]=RIGHT(INDEX(Table5[#Headers],coln),2)*1)*(Table1[Name]=Table5[[#This Row],[Name]])*Table1[Bnk]))),\"\")","v":""},{"$f":"IFERROR(INDEX(Table1[Pin],1/(1/SUMPRODUCT((Table1[Reps]=RIGHT(INDEX(Table5[#Headers],coln),2)*1)*(Table1[Name]=Table5[[#This Row],[Name]])*Table1[Bnk]))),\"\")","v":""},{"$f":"IFERROR(INDEX(Table1[Pin],1/(1/SUMPRODUCT((Table1[Reps]=RIGHT(INDEX(Table5[#Headers],coln),2)*1)*(Table1[Name]=Table5[[#This Row],[Name]])*Table1[Bnk]))),\"\")","v":""},{"$f":"IFERROR(INDEX(Table1[Pin],1/(1/SUMPRODUCT((Table1[Reps]=RIGHT(INDEX(Table5[#Headers],coln),2)*1)*(Table1[Name]=Table5[[#This Row],[Name]])*Table1[Bnk]))),\"\")","v":""},{"$f":"IFERROR(INDEX(Table1[Pin],1/(1/SUMPRODUCT((Table1[Reps]=RIGHT(INDEX(Table5[#Headers],coln),2)*1)*(Table1[Name]=Table5[[#This Row],[Name]])*Table1[Bnk]))),\"\")","v":""},{"$f":"IFERROR(INDEX(Table1[Pin],1/(1/SUMPRODUCT((Table1[Reps]=RIGHT(INDEX(Table5[#Headers],coln),2)*1)*(Table1[Name]=Table5[[#This Row],[Name]])*Table1[Bnk]))),\"\")","v":""},{"$f":"[Pin01]","v":"A8"},{"$f":"CONCATENATE([Pin14],IF([Pin02]=\"\",\"\",\", \"&[Pin02]))","v":"A8"},{"$f":"CONCATENATE([Pin15],IF([Pin03]=\"\",\"\",\", \"&[Pin03]))","v":"A8"},{"$f":"CONCATENATE([Pin16],IF([Pin04]=\"\",\"\",\", \"&[Pin04]))","v":"A8"},{"$f":"CONCATENATE([Pin17],IF([Pin05]=\"\",\"\",\", \"&[Pin05]))","v":"A8"},{"$f":"CONCATENATE([Pin18],IF([Pin06]=\"\",\"\",\", \"&[Pin06]))","v":"A8"},{"$f":"CONCATENATE([Pin19],IF([Pin07]=\"\",\"\",\", \"&[Pin07]))","v":"A8"},{"$f":"CONCATENATE([Pin20],IF([Pin08]=\"\",\"\",\", \"&[Pin08]))","v":"A8"},{"$f":"CONCATENATE([Pin21],IF([Pin09]=\"\",\"\",\", \"&[Pin09]))","v":"A8"},{"$f":"CONCATENATE([Pin22],IF([Pin10]=\"\",\"\",\", \"&[Pin10]))","v":"A8"},{"$f":"CONCATENATE([Pin23],IF([Pin11]=\"\",\"\",\", \"&[Pin11]))","v":"A8"},{"$f":"CONCATENATE([Pin24],IF([Pin12]=\"\",\"\",\", \"&[Pin12]))","v":"A8"},{"$f":"CONCATENATE([Pin25],IF([Pin13]=\"\",\"\",\", \"&[Pin13]))","v":"A8"},{"$f":"IFERROR(INDEX(Table1[InOut],1/(1/SUMPRODUCT((Table1[Reps]=1)*(Table1[Name]=Table5[[#This Row],[Name]])*Table1[Seq]))),\"\")","v":"I/O"},{"$f":"IFERROR(INDEX(Table1[Level],1/(1/SUMPRODUCT((Table1[Reps]=1)*(Table1[Name]=Table5[[#This Row],[Name]])*Table1[Seq]))),\"\")","v":"TTL"},{"$f":"IFERROR(INDEX(Table1[Func],1/(1/SUMPRODUCT((Table1[Reps]=1)*(Table1[Name]=Table5[[#This Row],[Name]])*Table1[Seq]))),\"\")","v":"GPIOportBbit7."}]
[null,null,"D1","NC","-","-","Noconnect.Leavethepinelectricallyunconnected/isolated",{"$f":"COUNTIF(INDEX([Name],1):Table1[[#This Row],[Name]],[Name])","v":3},{"$f":"IF(ISTEXT([Pin]),[Seq],INDEX([Bnk],[Seq]-1))","v":54},54,null,null,"PC0",{"$f":"IFERROR(INDEX(Table1[Pin],1/(1/SUMPRODUCT((Table1[Reps]=RIGHT(INDEX(Table5[#Headers],coln),2)*1)*(Table1[Name]=Table5[[#This Row],[Name]])*Table1[Bnk]))),\"\")","v":"A9"},{"$f":"IFERROR(INDEX(Table1[Pin],1/(1/SUMPRODUCT((Table1[Reps]=RIGHT(INDEX(Table5[#Headers],coln),2)*1)*(Table1[Name]=Table5[[#This Row],[Name]])*Table1[Bnk]))),\"\")","v":""},{"$f":"IFERROR(INDEX(Table1[Pin],1/(1/SUMPRODUCT((Table1[Reps]=RIGHT(INDEX(Table5[#Headers],coln),2)*1)*(Table1[Name]=Table5[[#This Row],[Name]])*Table1[Bnk]))),\"\")","v":""},{"$f":"IFERROR(INDEX(Table1[Pin],1/(1/SUMPRODUCT((Table1[Reps]=RIGHT(INDEX(Table5[#Headers],coln),2)*1)*(Table1[Name]=Table5[[#This Row],[Name]])*Table1[Bnk]))),\"\")","v":""},{"$f":"IFERROR(INDEX(Table1[Pin],1/(1/SUMPRODUCT((Table1[Reps]=RIGHT(INDEX(Table5[#Headers],coln),2)*1)*(Table1[Name]=Table5[[#This Row],[Name]])*Table1[Bnk]))),\"\")","v":""},{"$f":"IFERROR(INDEX(Table1[Pin],1/(1/SUMPRODUCT((Table1[Reps]=RIGHT(INDEX(Table5[#Headers],coln),2)*1)*(Table1[Name]=Table5[[#This Row],[Name]])*Table1[Bnk]))),\"\")","v":""},{"$f":"IFERROR(INDEX(Table1[Pin],1/(1/SUMPRODUCT((Table1[Reps]=RIGHT(INDEX(Table5[#Headers],coln),2)*1)*(Table1[Name]=Table5[[#This Row],[Name]])*Table1[Bnk]))),\"\")","v":""},{"$f":"IFERROR(INDEX(Table1[Pin],1/(1/SUMPRODUCT((Table1[Reps]=RIGHT(INDEX(Table5[#Headers],coln),2)*1)*(Table1[Name]=Table5[[#This Row],[Name]])*Table1[Bnk]))),\"\")","v":""},{"$f":"IFERROR(INDEX(Table1[Pin],1/(1/SUMPRODUCT((Table1[Reps]=RIGHT(INDEX(Table5[#Headers],coln),2)*1)*(Table1[Name]=Table5[[#This Row],[Name]])*Table1[Bnk]))),\"\")","v":""},{"$f":"IFERROR(INDEX(Table1[Pin],1/(1/SUMPRODUCT((Table1[Reps]=RIGHT(INDEX(Table5[#Headers],coln),2)*1)*(Table1[Name]=Table5[[#This Row],[Name]])*Table1[Bnk]))),\"\")","v":""},{"$f":"IFERROR(INDEX(Table1[Pin],1/(1/SUMPRODUCT((Table1[Reps]=RIGHT(INDEX(Table5[#Headers],coln),2)*1)*(Table1[Name]=Table5[[#This Row],[Name]])*Table1[Bnk]))),\"\")","v":""},{"$f":"IFERROR(INDEX(Table1[Pin],1/(1/SUMPRODUCT((Table1[Reps]=RIGHT(INDEX(Table5[#Headers],coln),2)*1)*(Table1[Name]=Table5[[#This Row],[Name]])*Table1[Bnk]))),\"\")","v":""},{"$f":"IFERROR(INDEX(Table1[Pin],1/(1/SUMPRODUCT((Table1[Reps]=RIGHT(INDEX(Table5[#Headers],coln),2)*1)*(Table1[Name]=Table5[[#This Row],[Name]])*Table1[Bnk]))),\"\")","v":""},{"$f":"[Pin01]","v":"A9"},{"$f":"CONCATENATE([Pin14],IF([Pin02]=\"\",\"\",\", \"&[Pin02]))","v":"A9"},{"$f":"CONCATENATE([Pin15],IF([Pin03]=\"\",\"\",\", \"&[Pin03]))","v":"A9"},{"$f":"CONCATENATE([Pin16],IF([Pin04]=\"\",\"\",\", \"&[Pin04]))","v":"A9"},{"$f":"CONCATENATE([Pin17],IF([Pin05]=\"\",\"\",\", \"&[Pin05]))","v":"A9"},{"$f":"CONCATENATE([Pin18],IF([Pin06]=\"\",\"\",\", \"&[Pin06]))","v":"A9"},{"$f":"CONCATENATE([Pin19],IF([Pin07]=\"\",\"\",\", \"&[Pin07]))","v":"A9"},{"$f":"CONCATENATE([Pin20],IF([Pin08]=\"\",\"\",\", \"&[Pin08]))","v":"A9"},{"$f":"CONCATENATE([Pin21],IF([Pin09]=\"\",\"\",\", \"&[Pin09]))","v":"A9"},{"$f":"CONCATENATE([Pin22],IF([Pin10]=\"\",\"\",\", \"&[Pin10]))","v":"A9"},{"$f":"CONCATENATE([Pin23],IF([Pin11]=\"\",\"\",\", \"&[Pin11]))","v":"A9"},{"$f":"CONCATENATE([Pin24],IF([Pin12]=\"\",\"\",\", \"&[Pin12]))","v":"A9"},{"$f":"CONCATENATE([Pin25],IF([Pin13]=\"\",\"\",\", \"&[Pin13]))","v":"A9"},{"$f":"IFERROR(INDEX(Table1[InOut],1/(1/SUMPRODUCT((Table1[Reps]=1)*(Table1[Name]=Table5[[#This Row],[Name]])*Table1[Seq]))),\"\")","v":"I/O"},{"$f":"IFERROR(INDEX(Table1[Level],1/(1/SUMPRODUCT((Table1[Reps]=1)*(Table1[Name]=Table5[[#This Row],[Name]])*Table1[Seq]))),\"\")","v":"TTL"},{"$f":"IFERROR(INDEX(Table1[Func],1/(1/SUMPRODUCT((Table1[Reps]=1)*(Table1[Name]=Table5[[#This Row],[Name]])*Table1[Seq]))),\"\")","v":"GPIOportCbit0."}]
[null,null,"D2","NC","-","-","Noconnect.Leavethepinelectricallyunconnected/isolated",{"$f":"COUNTIF(INDEX([Name],1):Table1[[#This Row],[Name]],[Name])","v":4},{"$f":"IF(ISTEXT([Pin]),[Seq],INDEX([Bnk],[Seq]-1))","v":55},55,null,null,"PC1",{"$f":"IFERROR(INDEX(Table1[Pin],1/(1/SUMPRODUCT((Table1[Reps]=RIGHT(INDEX(Table5[#Headers],coln),2)*1)*(Table1[Name]=Table5[[#This Row],[Name]])*Table1[Bnk]))),\"\")","v":"B9"},{"$f":"IFERROR(INDEX(Table1[Pin],1/(1/SUMPRODUCT((Table1[Reps]=RIGHT(INDEX(Table5[#Headers],coln),2)*1)*(Table1[Name]=Table5[[#This Row],[Name]])*Table1[Bnk]))),\"\")","v":""},{"$f":"IFERROR(INDEX(Table1[Pin],1/(1/SUMPRODUCT((Table1[Reps]=RIGHT(INDEX(Table5[#Headers],coln),2)*1)*(Table1[Name]=Table5[[#This Row],[Name]])*Table1[Bnk]))),\"\")","v":""},{"$f":"IFERROR(INDEX(Table1[Pin],1/(1/SUMPRODUCT((Table1[Reps]=RIGHT(INDEX(Table5[#Headers],coln),2)*1)*(Table1[Name]=Table5[[#This Row],[Name]])*Table1[Bnk]))),\"\")","v":""},{"$f":"IFERROR(INDEX(Table1[Pin],1/(1/SUMPRODUCT((Table1[Reps]=RIGHT(INDEX(Table5[#Headers],coln),2)*1)*(Table1[Name]=Table5[[#This Row],[Name]])*Table1[Bnk]))),\"\")","v":""},{"$f":"IFERROR(INDEX(Table1[Pin],1/(1/SUMPRODUCT((Table1[Reps]=RIGHT(INDEX(Table5[#Headers],coln),2)*1)*(Table1[Name]=Table5[[#This Row],[Name]])*Table1[Bnk]))),\"\")","v":""},{"$f":"IFERROR(INDEX(Table1[Pin],1/(1/SUMPRODUCT((Table1[Reps]=RIGHT(INDEX(Table5[#Headers],coln),2)*1)*(Table1[Name]=Table5[[#This Row],[Name]])*Table1[Bnk]))),\"\")","v":""},{"$f":"IFERROR(INDEX(Table1[Pin],1/(1/SUMPRODUCT((Table1[Reps]=RIGHT(INDEX(Table5[#Headers],coln),2)*1)*(Table1[Name]=Table5[[#This Row],[Name]])*Table1[Bnk]))),\"\")","v":""},{"$f":"IFERROR(INDEX(Table1[Pin],1/(1/SUMPRODUCT((Table1[Reps]=RIGHT(INDEX(Table5[#Headers],coln),2)*1)*(Table1[Name]=Table5[[#This Row],[Name]])*Table1[Bnk]))),\"\")","v":""},{"$f":"IFERROR(INDEX(Table1[Pin],1/(1/SUMPRODUCT((Table1[Reps]=RIGHT(INDEX(Table5[#Headers],coln),2)*1)*(Table1[Name]=Table5[[#This Row],[Name]])*Table1[Bnk]))),\"\")","v":""},{"$f":"IFERROR(INDEX(Table1[Pin],1/(1/SUMPRODUCT((Table1[Reps]=RIGHT(INDEX(Table5[#Headers],coln),2)*1)*(Table1[Name]=Table5[[#This Row],[Name]])*Table1[Bnk]))),\"\")","v":""},{"$f":"IFERROR(INDEX(Table1[Pin],1/(1/SUMPRODUCT((Table1[Reps]=RIGHT(INDEX(Table5[#Headers],coln),2)*1)*(Table1[Name]=Table5[[#This Row],[Name]])*Table1[Bnk]))),\"\")","v":""},{"$f":"IFERROR(INDEX(Table1[Pin],1/(1/SUMPRODUCT((Table1[Reps]=RIGHT(INDEX(Table5[#Headers],coln),2)*1)*(Table1[Name]=Table5[[#This Row],[Name]])*Table1[Bnk]))),\"\")","v":""},{"$f":"[Pin01]","v":"B9"},{"$f":"CONCATENATE([Pin14],IF([Pin02]=\"\",\"\",\", \"&[Pin02]))","v":"B9"},{"$f":"CONCATENATE([Pin15],IF([Pin03]=\"\",\"\",\", \"&[Pin03]))","v":"B9"},{"$f":"CONCATENATE([Pin16],IF([Pin04]=\"\",\"\",\", \"&[Pin04]))","v":"B9"},{"$f":"CONCATENATE([Pin17],IF([Pin05]=\"\",\"\",\", \"&[Pin05]))","v":"B9"},{"$f":"CONCATENATE([Pin18],IF([Pin06]=\"\",\"\",\", \"&[Pin06]))","v":"B9"},{"$f":"CONCATENATE([Pin19],IF([Pin07]=\"\",\"\",\", \"&[Pin07]))","v":"B9"},{"$f":"CONCATENATE([Pin20],IF([Pin08]=\"\",\"\",\", \"&[Pin08]))","v":"B9"},{"$f":"CONCATENATE([Pin21],IF([Pin09]=\"\",\"\",\", \"&[Pin09]))","v":"B9"},{"$f":"CONCATENATE([Pin22],IF([Pin10]=\"\",\"\",\", \"&[Pin10]))","v":"B9"},{"$f":"CONCATENATE([Pin23],IF([Pin11]=\"\",\"\",\", \"&[Pin11]))","v":"B9"},{"$f":"CONCATENATE([Pin24],IF([Pin12]=\"\",\"\",\", \"&[Pin12]))","v":"B9"},{"$f":"CONCATENATE([Pin25],IF([Pin13]=\"\",\"\",\", \"&[Pin13]))","v":"B9"},{"$f":"IFERROR(INDEX(Table1[InOut],1/(1/SUMPRODUCT((Table1[Reps]=1)*(Table1[Name]=Table5[[#This Row],[Name]])*Table1[Seq]))),\"\")","v":"I/O"},{"$f":"IFERROR(INDEX(Table1[Level],1/(1/SUMPRODUCT((Table1[Reps]=1)*(Table1[Name]=Table5[[#This Row],[Name]])*Table1[Seq]))),\"\")","v":"TTL"},{"$f":"IFERROR(INDEX(Table1[Func],1/(1/SUMPRODUCT((Table1[Reps]=1)*(Table1[Name]=Table5[[#This Row],[Name]])*Table1[Seq]))),\"\")","v":"GPIOportCbit1."}]
[null,null,"D3","VDD25","-","Power",null,{"$f":"COUNTIF(INDEX([Name],1):Table1[[#This Row],[Name]],[Name])","v":2},{"$f":"IF(ISTEXT([Pin]),[Seq],INDEX([Bnk],[Seq]-1))","v":56},56,null,null,"PC2",{"$f":"IFERROR(INDEX(Table1[Pin],1/(1/SUMPRODUCT((Table1[Reps]=RIGHT(INDEX(Table5[#Headers],coln),2)*1)*(Table1[Name]=Table5[[#This Row],[Name]])*Table1[Bnk]))),\"\")","v":"B8"},{"$f":"IFERROR(INDEX(Table1[Pin],1/(1/SUMPRODUCT((Table1[Reps]=RIGHT(INDEX(Table5[#Headers],coln),2)*1)*(Table1[Name]=Table5[[#This Row],[Name]])*Table1[Bnk]))),\"\")","v":""},{"$f":"IFERROR(INDEX(Table1[Pin],1/(1/SUMPRODUCT((Table1[Reps]=RIGHT(INDEX(Table5[#Headers],coln),2)*1)*(Table1[Name]=Table5[[#This Row],[Name]])*Table1[Bnk]))),\"\")","v":""},{"$f":"IFERROR(INDEX(Table1[Pin],1/(1/SUMPRODUCT((Table1[Reps]=RIGHT(INDEX(Table5[#Headers],coln),2)*1)*(Table1[Name]=Table5[[#This Row],[Name]])*Table1[Bnk]))),\"\")","v":""},{"$f":"IFERROR(INDEX(Table1[Pin],1/(1/SUMPRODUCT((Table1[Reps]=RIGHT(INDEX(Table5[#Headers],coln),2)*1)*(Table1[Name]=Table5[[#This Row],[Name]])*Table1[Bnk]))),\"\")","v":""},{"$f":"IFERROR(INDEX(Table1[Pin],1/(1/SUMPRODUCT((Table1[Reps]=RIGHT(INDEX(Table5[#Headers],coln),2)*1)*(Table1[Name]=Table5[[#This Row],[Name]])*Table1[Bnk]))),\"\")","v":""},{"$f":"IFERROR(INDEX(Table1[Pin],1/(1/SUMPRODUCT((Table1[Reps]=RIGHT(INDEX(Table5[#Headers],coln),2)*1)*(Table1[Name]=Table5[[#This Row],[Name]])*Table1[Bnk]))),\"\")","v":""},{"$f":"IFERROR(INDEX(Table1[Pin],1/(1/SUMPRODUCT((Table1[Reps]=RIGHT(INDEX(Table5[#Headers],coln),2)*1)*(Table1[Name]=Table5[[#This Row],[Name]])*Table1[Bnk]))),\"\")","v":""},{"$f":"IFERROR(INDEX(Table1[Pin],1/(1/SUMPRODUCT((Table1[Reps]=RIGHT(INDEX(Table5[#Headers],coln),2)*1)*(Table1[Name]=Table5[[#This Row],[Name]])*Table1[Bnk]))),\"\")","v":""},{"$f":"IFERROR(INDEX(Table1[Pin],1/(1/SUMPRODUCT((Table1[Reps]=RIGHT(INDEX(Table5[#Headers],coln),2)*1)*(Table1[Name]=Table5[[#This Row],[Name]])*Table1[Bnk]))),\"\")","v":""},{"$f":"IFERROR(INDEX(Table1[Pin],1/(1/SUMPRODUCT((Table1[Reps]=RIGHT(INDEX(Table5[#Headers],coln),2)*1)*(Table1[Name]=Table5[[#This Row],[Name]])*Table1[Bnk]))),\"\")","v":""},{"$f":"IFERROR(INDEX(Table1[Pin],1/(1/SUMPRODUCT((Table1[Reps]=RIGHT(INDEX(Table5[#Headers],coln),2)*1)*(Table1[Name]=Table5[[#This Row],[Name]])*Table1[Bnk]))),\"\")","v":""},{"$f":"IFERROR(INDEX(Table1[Pin],1/(1/SUMPRODUCT((Table1[Reps]=RIGHT(INDEX(Table5[#Headers],coln),2)*1)*(Table1[Name]=Table5[[#This Row],[Name]])*Table1[Bnk]))),\"\")","v":""},{"$f":"[Pin01]","v":"B8"},{"$f":"CONCATENATE([Pin14],IF([Pin02]=\"\",\"\",\", \"&[Pin02]))","v":"B8"},{"$f":"CONCATENATE([Pin15],IF([Pin03]=\"\",\"\",\", \"&[Pin03]))","v":"B8"},{"$f":"CONCATENATE([Pin16],IF([Pin04]=\"\",\"\",\", \"&[Pin04]))","v":"B8"},{"$f":"CONCATENATE([Pin17],IF([Pin05]=\"\",\"\",\", \"&[Pin05]))","v":"B8"},{"$f":"CONCATENATE([Pin18],IF([Pin06]=\"\",\"\",\", \"&[Pin06]))","v":"B8"},{"$f":"CONCATENATE([Pin19],IF([Pin07]=\"\",\"\",\", \"&[Pin07]))","v":"B8"},{"$f":"CONCATENATE([Pin20],IF([Pin08]=\"\",\"\",\", \"&[Pin08]))","v":"B8"},{"$f":"CONCATENATE([Pin21],IF([Pin09]=\"\",\"\",\", \"&[Pin09]))","v":"B8"},{"$f":"CONCATENATE([Pin22],IF([Pin10]=\"\",\"\",\", \"&[Pin10]))","v":"B8"},{"$f":"CONCATENATE([Pin23],IF([Pin11]=\"\",\"\",\", \"&[Pin11]))","v":"B8"},{"$f":"CONCATENATE([Pin24],IF([Pin12]=\"\",\"\",\", \"&[Pin12]))","v":"B8"},{"$f":"CONCATENATE([Pin25],IF([Pin13]=\"\",\"\",\", \"&[Pin13]))","v":"B8"},{"$f":"IFERROR(INDEX(Table1[InOut],1/(1/SUMPRODUCT((Table1[Reps]=1)*(Table1[Name]=Table5[[#This Row],[Name]])*Table1[Seq]))),\"\")","v":"I/O"},{"$f":"IFERROR(INDEX(Table1[Level],1/(1/SUMPRODUCT((Table1[Reps]=1)*(Table1[Name]=Table5[[#This Row],[Name]])*Table1[Seq]))),\"\")","v":"TTL"},{"$f":"IFERROR(INDEX(Table1[Func],1/(1/SUMPRODUCT((Table1[Reps]=1)*(Table1[Name]=Table5[[#This Row],[Name]])*Table1[Seq]))),\"\")","v":"GPIOportCbit2."}]
[null,null,"D10","VCCPHY","-","Power","VCCoftheEthernetPHY.",{"$f":"COUNTIF(INDEX([Name],1):Table1[[#This Row],[Name]],[Name])","v":2},{"$f":"IF(ISTEXT([Pin]),[Seq],INDEX([Bnk],[Seq]-1))","v":57},57,null,null,"PC3",{"$f":"IFERROR(INDEX(Table1[Pin],1/(1/SUMPRODUCT((Table1[Reps]=RIGHT(INDEX(Table5[#Headers],coln),2)*1)*(Table1[Name]=Table5[[#This Row],[Name]])*Table1[Bnk]))),\"\")","v":"A10"},{"$f":"IFERROR(INDEX(Table1[Pin],1/(1/SUMPRODUCT((Table1[Reps]=RIGHT(INDEX(Table5[#Headers],coln),2)*1)*(Table1[Name]=Table5[[#This Row],[Name]])*Table1[Bnk]))),\"\")","v":""},{"$f":"IFERROR(INDEX(Table1[Pin],1/(1/SUMPRODUCT((Table1[Reps]=RIGHT(INDEX(Table5[#Headers],coln),2)*1)*(Table1[Name]=Table5[[#This Row],[Name]])*Table1[Bnk]))),\"\")","v":""},{"$f":"IFERROR(INDEX(Table1[Pin],1/(1/SUMPRODUCT((Table1[Reps]=RIGHT(INDEX(Table5[#Headers],coln),2)*1)*(Table1[Name]=Table5[[#This Row],[Name]])*Table1[Bnk]))),\"\")","v":""},{"$f":"IFERROR(INDEX(Table1[Pin],1/(1/SUMPRODUCT((Table1[Reps]=RIGHT(INDEX(Table5[#Headers],coln),2)*1)*(Table1[Name]=Table5[[#This Row],[Name]])*Table1[Bnk]))),\"\")","v":""},{"$f":"IFERROR(INDEX(Table1[Pin],1/(1/SUMPRODUCT((Table1[Reps]=RIGHT(INDEX(Table5[#Headers],coln),2)*1)*(Table1[Name]=Table5[[#This Row],[Name]])*Table1[Bnk]))),\"\")","v":""},{"$f":"IFERROR(INDEX(Table1[Pin],1/(1/SUMPRODUCT((Table1[Reps]=RIGHT(INDEX(Table5[#Headers],coln),2)*1)*(Table1[Name]=Table5[[#This Row],[Name]])*Table1[Bnk]))),\"\")","v":""},{"$f":"IFERROR(INDEX(Table1[Pin],1/(1/SUMPRODUCT((Table1[Reps]=RIGHT(INDEX(Table5[#Headers],coln),2)*1)*(Table1[Name]=Table5[[#This Row],[Name]])*Table1[Bnk]))),\"\")","v":""},{"$f":"IFERROR(INDEX(Table1[Pin],1/(1/SUMPRODUCT((Table1[Reps]=RIGHT(INDEX(Table5[#Headers],coln),2)*1)*(Table1[Name]=Table5[[#This Row],[Name]])*Table1[Bnk]))),\"\")","v":""},{"$f":"IFERROR(INDEX(Table1[Pin],1/(1/SUMPRODUCT((Table1[Reps]=RIGHT(INDEX(Table5[#Headers],coln),2)*1)*(Table1[Name]=Table5[[#This Row],[Name]])*Table1[Bnk]))),\"\")","v":""},{"$f":"IFERROR(INDEX(Table1[Pin],1/(1/SUMPRODUCT((Table1[Reps]=RIGHT(INDEX(Table5[#Headers],coln),2)*1)*(Table1[Name]=Table5[[#This Row],[Name]])*Table1[Bnk]))),\"\")","v":""},{"$f":"IFERROR(INDEX(Table1[Pin],1/(1/SUMPRODUCT((Table1[Reps]=RIGHT(INDEX(Table5[#Headers],coln),2)*1)*(Table1[Name]=Table5[[#This Row],[Name]])*Table1[Bnk]))),\"\")","v":""},{"$f":"IFERROR(INDEX(Table1[Pin],1/(1/SUMPRODUCT((Table1[Reps]=RIGHT(INDEX(Table5[#Headers],coln),2)*1)*(Table1[Name]=Table5[[#This Row],[Name]])*Table1[Bnk]))),\"\")","v":""},{"$f":"[Pin01]","v":"A10"},{"$f":"CONCATENATE([Pin14],IF([Pin02]=\"\",\"\",\", \"&[Pin02]))","v":"A10"},{"$f":"CONCATENATE([Pin15],IF([Pin03]=\"\",\"\",\", \"&[Pin03]))","v":"A10"},{"$f":"CONCATENATE([Pin16],IF([Pin04]=\"\",\"\",\", \"&[Pin04]))","v":"A10"},{"$f":"CONCATENATE([Pin17],IF([Pin05]=\"\",\"\",\", \"&[Pin05]))","v":"A10"},{"$f":"CONCATENATE([Pin18],IF([Pin06]=\"\",\"\",\", \"&[Pin06]))","v":"A10"},{"$f":"CONCATENATE([Pin19],IF([Pin07]=\"\",\"\",\", \"&[Pin07]))","v":"A10"},{"$f":"CONCATENATE([Pin20],IF([Pin08]=\"\",\"\",\", \"&[Pin08]))","v":"A10"},{"$f":"CONCATENATE([Pin21],IF([Pin09]=\"\",\"\",\", \"&[Pin09]))","v":"A10"},{"$f":"CONCATENATE([Pin22],IF([Pin10]=\"\",\"\",\", \"&[Pin10]))","v":"A10"},{"$f":"CONCATENATE([Pin23],IF([Pin11]=\"\",\"\",\", \"&[Pin11]))","v":"A10"},{"$f":"CONCATENATE([Pin24],IF([Pin12]=\"\",\"\",\", \"&[Pin12]))","v":"A10"},{"$f":"CONCATENATE([Pin25],IF([Pin13]=\"\",\"\",\", \"&[Pin13]))","v":"A10"},{"$f":"IFERROR(INDEX(Table1[InOut],1/(1/SUMPRODUCT((Table1[Reps]=1)*(Table1[Name]=Table5[[#This Row],[Name]])*Table1[Seq]))),\"\")","v":"I/O"},{"$f":"IFERROR(INDEX(Table1[Level],1/(1/SUMPRODUCT((Table1[Reps]=1)*(Table1[Name]=Table5[[#This Row],[Name]])*Table1[Seq]))),\"\")","v":"TTL"},{"$f":"IFERROR(INDEX(Table1[Func],1/(1/SUMPRODUCT((Table1[Reps]=1)*(Table1[Name]=Table5[[#This Row],[Name]])*Table1[Seq]))),\"\")","v":"GPIOportCbit3."}]
[null,null,"D11","VCCPHY","-","Power","VCCoftheEthernetPHY.",{"$f":"COUNTIF(INDEX([Name],1):Table1[[#This Row],[Name]],[Name])","v":3},{"$f":"IF(ISTEXT([Pin]),[Seq],INDEX([Bnk],[Seq]-1))","v":58},58,null,null,"PC4",{"$f":"IFERROR(INDEX(Table1[Pin],1/(1/SUMPRODUCT((Table1[Reps]=RIGHT(INDEX(Table5[#Headers],coln),2)*1)*(Table1[Name]=Table5[[#This Row],[Name]])*Table1[Bnk]))),\"\")","v":"L1"},{"$f":"IFERROR(INDEX(Table1[Pin],1/(1/SUMPRODUCT((Table1[Reps]=RIGHT(INDEX(Table5[#Headers],coln),2)*1)*(Table1[Name]=Table5[[#This Row],[Name]])*Table1[Bnk]))),\"\")","v":""},{"$f":"IFERROR(INDEX(Table1[Pin],1/(1/SUMPRODUCT((Table1[Reps]=RIGHT(INDEX(Table5[#Headers],coln),2)*1)*(Table1[Name]=Table5[[#This Row],[Name]])*Table1[Bnk]))),\"\")","v":""},{"$f":"IFERROR(INDEX(Table1[Pin],1/(1/SUMPRODUCT((Table1[Reps]=RIGHT(INDEX(Table5[#Headers],coln),2)*1)*(Table1[Name]=Table5[[#This Row],[Name]])*Table1[Bnk]))),\"\")","v":""},{"$f":"IFERROR(INDEX(Table1[Pin],1/(1/SUMPRODUCT((Table1[Reps]=RIGHT(INDEX(Table5[#Headers],coln),2)*1)*(Table1[Name]=Table5[[#This Row],[Name]])*Table1[Bnk]))),\"\")","v":""},{"$f":"IFERROR(INDEX(Table1[Pin],1/(1/SUMPRODUCT((Table1[Reps]=RIGHT(INDEX(Table5[#Headers],coln),2)*1)*(Table1[Name]=Table5[[#This Row],[Name]])*Table1[Bnk]))),\"\")","v":""},{"$f":"IFERROR(INDEX(Table1[Pin],1/(1/SUMPRODUCT((Table1[Reps]=RIGHT(INDEX(Table5[#Headers],coln),2)*1)*(Table1[Name]=Table5[[#This Row],[Name]])*Table1[Bnk]))),\"\")","v":""},{"$f":"IFERROR(INDEX(Table1[Pin],1/(1/SUMPRODUCT((Table1[Reps]=RIGHT(INDEX(Table5[#Headers],coln),2)*1)*(Table1[Name]=Table5[[#This Row],[Name]])*Table1[Bnk]))),\"\")","v":""},{"$f":"IFERROR(INDEX(Table1[Pin],1/(1/SUMPRODUCT((Table1[Reps]=RIGHT(INDEX(Table5[#Headers],coln),2)*1)*(Table1[Name]=Table5[[#This Row],[Name]])*Table1[Bnk]))),\"\")","v":""},{"$f":"IFERROR(INDEX(Table1[Pin],1/(1/SUMPRODUCT((Table1[Reps]=RIGHT(INDEX(Table5[#Headers],coln),2)*1)*(Table1[Name]=Table5[[#This Row],[Name]])*Table1[Bnk]))),\"\")","v":""},{"$f":"IFERROR(INDEX(Table1[Pin],1/(1/SUMPRODUCT((Table1[Reps]=RIGHT(INDEX(Table5[#Headers],coln),2)*1)*(Table1[Name]=Table5[[#This Row],[Name]])*Table1[Bnk]))),\"\")","v":""},{"$f":"IFERROR(INDEX(Table1[Pin],1/(1/SUMPRODUCT((Table1[Reps]=RIGHT(INDEX(Table5[#Headers],coln),2)*1)*(Table1[Name]=Table5[[#This Row],[Name]])*Table1[Bnk]))),\"\")","v":""},{"$f":"IFERROR(INDEX(Table1[Pin],1/(1/SUMPRODUCT((Table1[Reps]=RIGHT(INDEX(Table5[#Headers],coln),2)*1)*(Table1[Name]=Table5[[#This Row],[Name]])*Table1[Bnk]))),\"\")","v":""},{"$f":"[Pin01]","v":"L1"},{"$f":"CONCATENATE([Pin14],IF([Pin02]=\"\",\"\",\", \"&[Pin02]))","v":"L1"},{"$f":"CONCATENATE([Pin15],IF([Pin03]=\"\",\"\",\", \"&[Pin03]))","v":"L1"},{"$f":"CONCATENATE([Pin16],IF([Pin04]=\"\",\"\",\", \"&[Pin04]))","v":"L1"},{"$f":"CONCATENATE([Pin17],IF([Pin05]=\"\",\"\",\", \"&[Pin05]))","v":"L1"},{"$f":"CONCATENATE([Pin18],IF([Pin06]=\"\",\"\",\", \"&[Pin06]))","v":"L1"},{"$f":"CONCATENATE([Pin19],IF([Pin07]=\"\",\"\",\", \"&[Pin07]))","v":"L1"},{"$f":"CONCATENATE([Pin20],IF([Pin08]=\"\",\"\",\", \"&[Pin08]))","v":"L1"},{"$f":"CONCATENATE([Pin21],IF([Pin09]=\"\",\"\",\", \"&[Pin09]))","v":"L1"},{"$f":"CONCATENATE([Pin22],IF([Pin10]=\"\",\"\",\", \"&[Pin10]))","v":"L1"},{"$f":"CONCATENATE([Pin23],IF([Pin11]=\"\",\"\",\", \"&[Pin11]))","v":"L1"},{"$f":"CONCATENATE([Pin24],IF([Pin12]=\"\",\"\",\", \"&[Pin12]))","v":"L1"},{"$f":"CONCATENATE([Pin25],IF([Pin13]=\"\",\"\",\", \"&[Pin13]))","v":"L1"},{"$f":"IFERROR(INDEX(Table1[InOut],1/(1/SUMPRODUCT((Table1[Reps]=1)*(Table1[Name]=Table5[[#This Row],[Name]])*Table1[Seq]))),\"\")","v":"I/O"},{"$f":"IFERROR(INDEX(Table1[Level],1/(1/SUMPRODUCT((Table1[Reps]=1)*(Table1[Name]=Table5[[#This Row],[Name]])*Table1[Seq]))),\"\")","v":"TTL"},{"$f":"IFERROR(INDEX(Table1[Func],1/(1/SUMPRODUCT((Table1[Reps]=1)*(Table1[Name]=Table5[[#This Row],[Name]])*Table1[Seq]))),\"\")","v":"GPIOportCbit4."}]
[null,null,"D12","PB1","I/O","TTL","GPIOportBbit1.",{"$f":"COUNTIF(INDEX([Name],1):Table1[[#This Row],[Name]],[Name])","v":1},{"$f":"IF(ISTEXT([Pin]),[Seq],INDEX([Bnk],[Seq]-1))","v":59},59,null,null,"PC5",{"$f":"IFERROR(INDEX(Table1[Pin],1/(1/SUMPRODUCT((Table1[Reps]=RIGHT(INDEX(Table5[#Headers],coln),2)*1)*(Table1[Name]=Table5[[#This Row],[Name]])*Table1[Bnk]))),\"\")","v":"M1"},{"$f":"IFERROR(INDEX(Table1[Pin],1/(1/SUMPRODUCT((Table1[Reps]=RIGHT(INDEX(Table5[#Headers],coln),2)*1)*(Table1[Name]=Table5[[#This Row],[Name]])*Table1[Bnk]))),\"\")","v":""},{"$f":"IFERROR(INDEX(Table1[Pin],1/(1/SUMPRODUCT((Table1[Reps]=RIGHT(INDEX(Table5[#Headers],coln),2)*1)*(Table1[Name]=Table5[[#This Row],[Name]])*Table1[Bnk]))),\"\")","v":""},{"$f":"IFERROR(INDEX(Table1[Pin],1/(1/SUMPRODUCT((Table1[Reps]=RIGHT(INDEX(Table5[#Headers],coln),2)*1)*(Table1[Name]=Table5[[#This Row],[Name]])*Table1[Bnk]))),\"\")","v":""},{"$f":"IFERROR(INDEX(Table1[Pin],1/(1/SUMPRODUCT((Table1[Reps]=RIGHT(INDEX(Table5[#Headers],coln),2)*1)*(Table1[Name]=Table5[[#This Row],[Name]])*Table1[Bnk]))),\"\")","v":""},{"$f":"IFERROR(INDEX(Table1[Pin],1/(1/SUMPRODUCT((Table1[Reps]=RIGHT(INDEX(Table5[#Headers],coln),2)*1)*(Table1[Name]=Table5[[#This Row],[Name]])*Table1[Bnk]))),\"\")","v":""},{"$f":"IFERROR(INDEX(Table1[Pin],1/(1/SUMPRODUCT((Table1[Reps]=RIGHT(INDEX(Table5[#Headers],coln),2)*1)*(Table1[Name]=Table5[[#This Row],[Name]])*Table1[Bnk]))),\"\")","v":""},{"$f":"IFERROR(INDEX(Table1[Pin],1/(1/SUMPRODUCT((Table1[Reps]=RIGHT(INDEX(Table5[#Headers],coln),2)*1)*(Table1[Name]=Table5[[#This Row],[Name]])*Table1[Bnk]))),\"\")","v":""},{"$f":"IFERROR(INDEX(Table1[Pin],1/(1/SUMPRODUCT((Table1[Reps]=RIGHT(INDEX(Table5[#Headers],coln),2)*1)*(Table1[Name]=Table5[[#This Row],[Name]])*Table1[Bnk]))),\"\")","v":""},{"$f":"IFERROR(INDEX(Table1[Pin],1/(1/SUMPRODUCT((Table1[Reps]=RIGHT(INDEX(Table5[#Headers],coln),2)*1)*(Table1[Name]=Table5[[#This Row],[Name]])*Table1[Bnk]))),\"\")","v":""},{"$f":"IFERROR(INDEX(Table1[Pin],1/(1/SUMPRODUCT((Table1[Reps]=RIGHT(INDEX(Table5[#Headers],coln),2)*1)*(Table1[Name]=Table5[[#This Row],[Name]])*Table1[Bnk]))),\"\")","v":""},{"$f":"IFERROR(INDEX(Table1[Pin],1/(1/SUMPRODUCT((Table1[Reps]=RIGHT(INDEX(Table5[#Headers],coln),2)*1)*(Table1[Name]=Table5[[#This Row],[Name]])*Table1[Bnk]))),\"\")","v":""},{"$f":"IFERROR(INDEX(Table1[Pin],1/(1/SUMPRODUCT((Table1[Reps]=RIGHT(INDEX(Table5[#Headers],coln),2)*1)*(Table1[Name]=Table5[[#This Row],[Name]])*Table1[Bnk]))),\"\")","v":""},{"$f":"[Pin01]","v":"M1"},{"$f":"CONCATENATE([Pin14],IF([Pin02]=\"\",\"\",\", \"&[Pin02]))","v":"M1"},{"$f":"CONCATENATE([Pin15],IF([Pin03]=\"\",\"\",\", \"&[Pin03]))","v":"M1"},{"$f":"CONCATENATE([Pin16],IF([Pin04]=\"\",\"\",\", \"&[Pin04]))","v":"M1"},{"$f":"CONCATENATE([Pin17],IF([Pin05]=\"\",\"\",\", \"&[Pin05]))","v":"M1"},{"$f":"CONCATENATE([Pin18],IF([Pin06]=\"\",\"\",\", \"&[Pin06]))","v":"M1"},{"$f":"CONCATENATE([Pin19],IF([Pin07]=\"\",\"\",\", \"&[Pin07]))","v":"M1"},{"$f":"CONCATENATE([Pin20],IF([Pin08]=\"\",\"\",\", \"&[Pin08]))","v":"M1"},{"$f":"CONCATENATE([Pin21],IF([Pin09]=\"\",\"\",\", \"&[Pin09]))","v":"M1"},{"$f":"CONCATENATE([Pin22],IF([Pin10]=\"\",\"\",\", \"&[Pin10]))","v":"M1"},{"$f":"CONCATENATE([Pin23],IF([Pin11]=\"\",\"\",\", \"&[Pin11]))","v":"M1"},{"$f":"CONCATENATE([Pin24],IF([Pin12]=\"\",\"\",\", \"&[Pin12]))","v":"M1"},{"$f":"CONCATENATE([Pin25],IF([Pin13]=\"\",\"\",\", \"&[Pin13]))","v":"M1"},{"$f":"IFERROR(INDEX(Table1[InOut],1/(1/SUMPRODUCT((Table1[Reps]=1)*(Table1[Name]=Table5[[#This Row],[Name]])*Table1[Seq]))),\"\")","v":"I/O"},{"$f":"IFERROR(INDEX(Table1[Level],1/(1/SUMPRODUCT((Table1[Reps]=1)*(Table1[Name]=Table5[[#This Row],[Name]])*Table1[Seq]))),\"\")","v":"TTL"},{"$f":"IFERROR(INDEX(Table1[Func],1/(1/SUMPRODUCT((Table1[Reps]=1)*(Table1[Name]=Table5[[#This Row],[Name]])*Table1[Seq]))),\"\")","v":"GPIOportCbit5."}]
[null,null,null,"CCP2","I/O","TTL","Capture/Compare/PWM2.",{"$f":"COUNTIF(INDEX([Name],1):Table1[[#This Row],[Name]],[Name])","v":1},{"$f":"IF(ISTEXT([Pin]),[Seq],INDEX([Bnk],[Seq]-1))","v":59},60,null,null,"PC6",{"$f":"IFERROR(INDEX(Table1[Pin],1/(1/SUMPRODUCT((Table1[Reps]=RIGHT(INDEX(Table5[#Headers],coln),2)*1)*(Table1[Name]=Table5[[#This Row],[Name]])*Table1[Bnk]))),\"\")","v":"M2"},{"$f":"IFERROR(INDEX(Table1[Pin],1/(1/SUMPRODUCT((Table1[Reps]=RIGHT(INDEX(Table5[#Headers],coln),2)*1)*(Table1[Name]=Table5[[#This Row],[Name]])*Table1[Bnk]))),\"\")","v":""},{"$f":"IFERROR(INDEX(Table1[Pin],1/(1/SUMPRODUCT((Table1[Reps]=RIGHT(INDEX(Table5[#Headers],coln),2)*1)*(Table1[Name]=Table5[[#This Row],[Name]])*Table1[Bnk]))),\"\")","v":""},{"$f":"IFERROR(INDEX(Table1[Pin],1/(1/SUMPRODUCT((Table1[Reps]=RIGHT(INDEX(Table5[#Headers],coln),2)*1)*(Table1[Name]=Table5[[#This Row],[Name]])*Table1[Bnk]))),\"\")","v":""},{"$f":"IFERROR(INDEX(Table1[Pin],1/(1/SUMPRODUCT((Table1[Reps]=RIGHT(INDEX(Table5[#Headers],coln),2)*1)*(Table1[Name]=Table5[[#This Row],[Name]])*Table1[Bnk]))),\"\")","v":""},{"$f":"IFERROR(INDEX(Table1[Pin],1/(1/SUMPRODUCT((Table1[Reps]=RIGHT(INDEX(Table5[#Headers],coln),2)*1)*(Table1[Name]=Table5[[#This Row],[Name]])*Table1[Bnk]))),\"\")","v":""},{"$f":"IFERROR(INDEX(Table1[Pin],1/(1/SUMPRODUCT((Table1[Reps]=RIGHT(INDEX(Table5[#Headers],coln),2)*1)*(Table1[Name]=Table5[[#This Row],[Name]])*Table1[Bnk]))),\"\")","v":""},{"$f":"IFERROR(INDEX(Table1[Pin],1/(1/SUMPRODUCT((Table1[Reps]=RIGHT(INDEX(Table5[#Headers],coln),2)*1)*(Table1[Name]=Table5[[#This Row],[Name]])*Table1[Bnk]))),\"\")","v":""},{"$f":"IFERROR(INDEX(Table1[Pin],1/(1/SUMPRODUCT((Table1[Reps]=RIGHT(INDEX(Table5[#Headers],coln),2)*1)*(Table1[Name]=Table5[[#This Row],[Name]])*Table1[Bnk]))),\"\")","v":""},{"$f":"IFERROR(INDEX(Table1[Pin],1/(1/SUMPRODUCT((Table1[Reps]=RIGHT(INDEX(Table5[#Headers],coln),2)*1)*(Table1[Name]=Table5[[#This Row],[Name]])*Table1[Bnk]))),\"\")","v":""},{"$f":"IFERROR(INDEX(Table1[Pin],1/(1/SUMPRODUCT((Table1[Reps]=RIGHT(INDEX(Table5[#Headers],coln),2)*1)*(Table1[Name]=Table5[[#This Row],[Name]])*Table1[Bnk]))),\"\")","v":""},{"$f":"IFERROR(INDEX(Table1[Pin],1/(1/SUMPRODUCT((Table1[Reps]=RIGHT(INDEX(Table5[#Headers],coln),2)*1)*(Table1[Name]=Table5[[#This Row],[Name]])*Table1[Bnk]))),\"\")","v":""},{"$f":"IFERROR(INDEX(Table1[Pin],1/(1/SUMPRODUCT((Table1[Reps]=RIGHT(INDEX(Table5[#Headers],coln),2)*1)*(Table1[Name]=Table5[[#This Row],[Name]])*Table1[Bnk]))),\"\")","v":""},{"$f":"[Pin01]","v":"M2"},{"$f":"CONCATENATE([Pin14],IF([Pin02]=\"\",\"\",\", \"&[Pin02]))","v":"M2"},{"$f":"CONCATENATE([Pin15],IF([Pin03]=\"\",\"\",\", \"&[Pin03]))","v":"M2"},{"$f":"CONCATENATE([Pin16],IF([Pin04]=\"\",\"\",\", \"&[Pin04]))","v":"M2"},{"$f":"CONCATENATE([Pin17],IF([Pin05]=\"\",\"\",\", \"&[Pin05]))","v":"M2"},{"$f":"CONCATENATE([Pin18],IF([Pin06]=\"\",\"\",\", \"&[Pin06]))","v":"M2"},{"$f":"CONCATENATE([Pin19],IF([Pin07]=\"\",\"\",\", \"&[Pin07]))","v":"M2"},{"$f":"CONCATENATE([Pin20],IF([Pin08]=\"\",\"\",\", \"&[Pin08]))","v":"M2"},{"$f":"CONCATENATE([Pin21],IF([Pin09]=\"\",\"\",\", \"&[Pin09]))","v":"M2"},{"$f":"CONCATENATE([Pin22],IF([Pin10]=\"\",\"\",\", \"&[Pin10]))","v":"M2"},{"$f":"CONCATENATE([Pin23],IF([Pin11]=\"\",\"\",\", \"&[Pin11]))","v":"M2"},{"$f":"CONCATENATE([Pin24],IF([Pin12]=\"\",\"\",\", \"&[Pin12]))","v":"M2"},{"$f":"CONCATENATE([Pin25],IF([Pin13]=\"\",\"\",\", \"&[Pin13]))","v":"M2"},{"$f":"IFERROR(INDEX(Table1[InOut],1/(1/SUMPRODUCT((Table1[Reps]=1)*(Table1[Name]=Table5[[#This Row],[Name]])*Table1[Seq]))),\"\")","v":"I/O"},{"$f":"IFERROR(INDEX(Table1[Level],1/(1/SUMPRODUCT((Table1[Reps]=1)*(Table1[Name]=Table5[[#This Row],[Name]])*Table1[Seq]))),\"\")","v":"TTL"},{"$f":"IFERROR(INDEX(Table1[Func],1/(1/SUMPRODUCT((Table1[Reps]=1)*(Table1[Name]=Table5[[#This Row],[Name]])*Table1[Seq]))),\"\")","v":"GPIOportCbit6."}]
[null,null,"E1","NC","-","-","Noconnect.Leavethepinelectricallyunconnected/isolated",{"$f":"COUNTIF(INDEX([Name],1):Table1[[#This Row],[Name]],[Name])","v":5},{"$f":"IF(ISTEXT([Pin]),[Seq],INDEX([Bnk],[Seq]-1))","v":61},61,null,null,"PC7",{"$f":"IFERROR(INDEX(Table1[Pin],1/(1/SUMPRODUCT((Table1[Reps]=RIGHT(INDEX(Table5[#Headers],coln),2)*1)*(Table1[Name]=Table5[[#This Row],[Name]])*Table1[Bnk]))),\"\")","v":"L2"},{"$f":"IFERROR(INDEX(Table1[Pin],1/(1/SUMPRODUCT((Table1[Reps]=RIGHT(INDEX(Table5[#Headers],coln),2)*1)*(Table1[Name]=Table5[[#This Row],[Name]])*Table1[Bnk]))),\"\")","v":""},{"$f":"IFERROR(INDEX(Table1[Pin],1/(1/SUMPRODUCT((Table1[Reps]=RIGHT(INDEX(Table5[#Headers],coln),2)*1)*(Table1[Name]=Table5[[#This Row],[Name]])*Table1[Bnk]))),\"\")","v":""},{"$f":"IFERROR(INDEX(Table1[Pin],1/(1/SUMPRODUCT((Table1[Reps]=RIGHT(INDEX(Table5[#Headers],coln),2)*1)*(Table1[Name]=Table5[[#This Row],[Name]])*Table1[Bnk]))),\"\")","v":""},{"$f":"IFERROR(INDEX(Table1[Pin],1/(1/SUMPRODUCT((Table1[Reps]=RIGHT(INDEX(Table5[#Headers],coln),2)*1)*(Table1[Name]=Table5[[#This Row],[Name]])*Table1[Bnk]))),\"\")","v":""},{"$f":"IFERROR(INDEX(Table1[Pin],1/(1/SUMPRODUCT((Table1[Reps]=RIGHT(INDEX(Table5[#Headers],coln),2)*1)*(Table1[Name]=Table5[[#This Row],[Name]])*Table1[Bnk]))),\"\")","v":""},{"$f":"IFERROR(INDEX(Table1[Pin],1/(1/SUMPRODUCT((Table1[Reps]=RIGHT(INDEX(Table5[#Headers],coln),2)*1)*(Table1[Name]=Table5[[#This Row],[Name]])*Table1[Bnk]))),\"\")","v":""},{"$f":"IFERROR(INDEX(Table1[Pin],1/(1/SUMPRODUCT((Table1[Reps]=RIGHT(INDEX(Table5[#Headers],coln),2)*1)*(Table1[Name]=Table5[[#This Row],[Name]])*Table1[Bnk]))),\"\")","v":""},{"$f":"IFERROR(INDEX(Table1[Pin],1/(1/SUMPRODUCT((Table1[Reps]=RIGHT(INDEX(Table5[#Headers],coln),2)*1)*(Table1[Name]=Table5[[#This Row],[Name]])*Table1[Bnk]))),\"\")","v":""},{"$f":"IFERROR(INDEX(Table1[Pin],1/(1/SUMPRODUCT((Table1[Reps]=RIGHT(INDEX(Table5[#Headers],coln),2)*1)*(Table1[Name]=Table5[[#This Row],[Name]])*Table1[Bnk]))),\"\")","v":""},{"$f":"IFERROR(INDEX(Table1[Pin],1/(1/SUMPRODUCT((Table1[Reps]=RIGHT(INDEX(Table5[#Headers],coln),2)*1)*(Table1[Name]=Table5[[#This Row],[Name]])*Table1[Bnk]))),\"\")","v":""},{"$f":"IFERROR(INDEX(Table1[Pin],1/(1/SUMPRODUCT((Table1[Reps]=RIGHT(INDEX(Table5[#Headers],coln),2)*1)*(Table1[Name]=Table5[[#This Row],[Name]])*Table1[Bnk]))),\"\")","v":""},{"$f":"IFERROR(INDEX(Table1[Pin],1/(1/SUMPRODUCT((Table1[Reps]=RIGHT(INDEX(Table5[#Headers],coln),2)*1)*(Table1[Name]=Table5[[#This Row],[Name]])*Table1[Bnk]))),\"\")","v":""},{"$f":"[Pin01]","v":"L2"},{"$f":"CONCATENATE([Pin14],IF([Pin02]=\"\",\"\",\", \"&[Pin02]))","v":"L2"},{"$f":"CONCATENATE([Pin15],IF([Pin03]=\"\",\"\",\", \"&[Pin03]))","v":"L2"},{"$f":"CONCATENATE([Pin16],IF([Pin04]=\"\",\"\",\", \"&[Pin04]))","v":"L2"},{"$f":"CONCATENATE([Pin17],IF([Pin05]=\"\",\"\",\", \"&[Pin05]))","v":"L2"},{"$f":"CONCATENATE([Pin18],IF([Pin06]=\"\",\"\",\", \"&[Pin06]))","v":"L2"},{"$f":"CONCATENATE([Pin19],IF([Pin07]=\"\",\"\",\", \"&[Pin07]))","v":"L2"},{"$f":"CONCATENATE([Pin20],IF([Pin08]=\"\",\"\",\", \"&[Pin08]))","v":"L2"},{"$f":"CONCATENATE([Pin21],IF([Pin09]=\"\",\"\",\", \"&[Pin09]))","v":"L2"},{"$f":"CONCATENATE([Pin22],IF([Pin10]=\"\",\"\",\", \"&[Pin10]))","v":"L2"},{"$f":"CONCATENATE([Pin23],IF([Pin11]=\"\",\"\",\", \"&[Pin11]))","v":"L2"},{"$f":"CONCATENATE([Pin24],IF([Pin12]=\"\",\"\",\", \"&[Pin12]))","v":"L2"},{"$f":"CONCATENATE([Pin25],IF([Pin13]=\"\",\"\",\", \"&[Pin13]))","v":"L2"},{"$f":"IFERROR(INDEX(Table1[InOut],1/(1/SUMPRODUCT((Table1[Reps]=1)*(Table1[Name]=Table5[[#This Row],[Name]])*Table1[Seq]))),\"\")","v":"I/O"},{"$f":"IFERROR(INDEX(Table1[Level],1/(1/SUMPRODUCT((Table1[Reps]=1)*(Table1[Name]=Table5[[#This Row],[Name]])*Table1[Seq]))),\"\")","v":"TTL"},{"$f":"IFERROR(INDEX(Table1[Func],1/(1/SUMPRODUCT((Table1[Reps]=1)*(Table1[Name]=Table5[[#This Row],[Name]])*Table1[Seq]))),\"\")","v":"GPIOportCbit7."}]
[null,null,"E2","NC","-","-","Noconnect.Leavethepinelectricallyunconnected/isolated",{"$f":"COUNTIF(INDEX([Name],1):Table1[[#This Row],[Name]],[Name])","v":6},{"$f":"IF(ISTEXT([Pin]),[Seq],INDEX([Bnk],[Seq]-1))","v":62},62,null,null,"PD0",{"$f":"IFERROR(INDEX(Table1[Pin],1/(1/SUMPRODUCT((Table1[Reps]=RIGHT(INDEX(Table5[#Headers],coln),2)*1)*(Table1[Name]=Table5[[#This Row],[Name]])*Table1[Bnk]))),\"\")","v":"G1"},{"$f":"IFERROR(INDEX(Table1[Pin],1/(1/SUMPRODUCT((Table1[Reps]=RIGHT(INDEX(Table5[#Headers],coln),2)*1)*(Table1[Name]=Table5[[#This Row],[Name]])*Table1[Bnk]))),\"\")","v":""},{"$f":"IFERROR(INDEX(Table1[Pin],1/(1/SUMPRODUCT((Table1[Reps]=RIGHT(INDEX(Table5[#Headers],coln),2)*1)*(Table1[Name]=Table5[[#This Row],[Name]])*Table1[Bnk]))),\"\")","v":""},{"$f":"IFERROR(INDEX(Table1[Pin],1/(1/SUMPRODUCT((Table1[Reps]=RIGHT(INDEX(Table5[#Headers],coln),2)*1)*(Table1[Name]=Table5[[#This Row],[Name]])*Table1[Bnk]))),\"\")","v":""},{"$f":"IFERROR(INDEX(Table1[Pin],1/(1/SUMPRODUCT((Table1[Reps]=RIGHT(INDEX(Table5[#Headers],coln),2)*1)*(Table1[Name]=Table5[[#This Row],[Name]])*Table1[Bnk]))),\"\")","v":""},{"$f":"IFERROR(INDEX(Table1[Pin],1/(1/SUMPRODUCT((Table1[Reps]=RIGHT(INDEX(Table5[#Headers],coln),2)*1)*(Table1[Name]=Table5[[#This Row],[Name]])*Table1[Bnk]))),\"\")","v":""},{"$f":"IFERROR(INDEX(Table1[Pin],1/(1/SUMPRODUCT((Table1[Reps]=RIGHT(INDEX(Table5[#Headers],coln),2)*1)*(Table1[Name]=Table5[[#This Row],[Name]])*Table1[Bnk]))),\"\")","v":""},{"$f":"IFERROR(INDEX(Table1[Pin],1/(1/SUMPRODUCT((Table1[Reps]=RIGHT(INDEX(Table5[#Headers],coln),2)*1)*(Table1[Name]=Table5[[#This Row],[Name]])*Table1[Bnk]))),\"\")","v":""},{"$f":"IFERROR(INDEX(Table1[Pin],1/(1/SUMPRODUCT((Table1[Reps]=RIGHT(INDEX(Table5[#Headers],coln),2)*1)*(Table1[Name]=Table5[[#This Row],[Name]])*Table1[Bnk]))),\"\")","v":""},{"$f":"IFERROR(INDEX(Table1[Pin],1/(1/SUMPRODUCT((Table1[Reps]=RIGHT(INDEX(Table5[#Headers],coln),2)*1)*(Table1[Name]=Table5[[#This Row],[Name]])*Table1[Bnk]))),\"\")","v":""},{"$f":"IFERROR(INDEX(Table1[Pin],1/(1/SUMPRODUCT((Table1[Reps]=RIGHT(INDEX(Table5[#Headers],coln),2)*1)*(Table1[Name]=Table5[[#This Row],[Name]])*Table1[Bnk]))),\"\")","v":""},{"$f":"IFERROR(INDEX(Table1[Pin],1/(1/SUMPRODUCT((Table1[Reps]=RIGHT(INDEX(Table5[#Headers],coln),2)*1)*(Table1[Name]=Table5[[#This Row],[Name]])*Table1[Bnk]))),\"\")","v":""},{"$f":"IFERROR(INDEX(Table1[Pin],1/(1/SUMPRODUCT((Table1[Reps]=RIGHT(INDEX(Table5[#Headers],coln),2)*1)*(Table1[Name]=Table5[[#This Row],[Name]])*Table1[Bnk]))),\"\")","v":""},{"$f":"[Pin01]","v":"G1"},{"$f":"CONCATENATE([Pin14],IF([Pin02]=\"\",\"\",\", \"&[Pin02]))","v":"G1"},{"$f":"CONCATENATE([Pin15],IF([Pin03]=\"\",\"\",\", \"&[Pin03]))","v":"G1"},{"$f":"CONCATENATE([Pin16],IF([Pin04]=\"\",\"\",\", \"&[Pin04]))","v":"G1"},{"$f":"CONCATENATE([Pin17],IF([Pin05]=\"\",\"\",\", \"&[Pin05]))","v":"G1"},{"$f":"CONCATENATE([Pin18],IF([Pin06]=\"\",\"\",\", \"&[Pin06]))","v":"G1"},{"$f":"CONCATENATE([Pin19],IF([Pin07]=\"\",\"\",\", \"&[Pin07]))","v":"G1"},{"$f":"CONCATENATE([Pin20],IF([Pin08]=\"\",\"\",\", \"&[Pin08]))","v":"G1"},{"$f":"CONCATENATE([Pin21],IF([Pin09]=\"\",\"\",\", \"&[Pin09]))","v":"G1"},{"$f":"CONCATENATE([Pin22],IF([Pin10]=\"\",\"\",\", \"&[Pin10]))","v":"G1"},{"$f":"CONCATENATE([Pin23],IF([Pin11]=\"\",\"\",\", \"&[Pin11]))","v":"G1"},{"$f":"CONCATENATE([Pin24],IF([Pin12]=\"\",\"\",\", \"&[Pin12]))","v":"G1"},{"$f":"CONCATENATE([Pin25],IF([Pin13]=\"\",\"\",\", \"&[Pin13]))","v":"G1"},{"$f":"IFERROR(INDEX(Table1[InOut],1/(1/SUMPRODUCT((Table1[Reps]=1)*(Table1[Name]=Table5[[#This Row],[Name]])*Table1[Seq]))),\"\")","v":"I/O"},{"$f":"IFERROR(INDEX(Table1[Level],1/(1/SUMPRODUCT((Table1[Reps]=1)*(Table1[Name]=Table5[[#This Row],[Name]])*Table1[Seq]))),\"\")","v":"TTL"},{"$f":"IFERROR(INDEX(Table1[Func],1/(1/SUMPRODUCT((Table1[Reps]=1)*(Table1[Name]=Table5[[#This Row],[Name]])*Table1[Seq]))),\"\")","v":"GPIOportDbit0."}]
[null,null,"E3","LDO","-","Power","Lowdrop-outregulatoroutputvoltage.Thispinrequiresanexternal",{"$f":"COUNTIF(INDEX([Name],1):Table1[[#This Row],[Name]],[Name])","v":1},{"$f":"IF(ISTEXT([Pin]),[Seq],INDEX([Bnk],[Seq]-1))","v":63},63,null,null,"PD1",{"$f":"IFERROR(INDEX(Table1[Pin],1/(1/SUMPRODUCT((Table1[Reps]=RIGHT(INDEX(Table5[#Headers],coln),2)*1)*(Table1[Name]=Table5[[#This Row],[Name]])*Table1[Bnk]))),\"\")","v":"G2"},{"$f":"IFERROR(INDEX(Table1[Pin],1/(1/SUMPRODUCT((Table1[Reps]=RIGHT(INDEX(Table5[#Headers],coln),2)*1)*(Table1[Name]=Table5[[#This Row],[Name]])*Table1[Bnk]))),\"\")","v":""},{"$f":"IFERROR(INDEX(Table1[Pin],1/(1/SUMPRODUCT((Table1[Reps]=RIGHT(INDEX(Table5[#Headers],coln),2)*1)*(Table1[Name]=Table5[[#This Row],[Name]])*Table1[Bnk]))),\"\")","v":""},{"$f":"IFERROR(INDEX(Table1[Pin],1/(1/SUMPRODUCT((Table1[Reps]=RIGHT(INDEX(Table5[#Headers],coln),2)*1)*(Table1[Name]=Table5[[#This Row],[Name]])*Table1[Bnk]))),\"\")","v":""},{"$f":"IFERROR(INDEX(Table1[Pin],1/(1/SUMPRODUCT((Table1[Reps]=RIGHT(INDEX(Table5[#Headers],coln),2)*1)*(Table1[Name]=Table5[[#This Row],[Name]])*Table1[Bnk]))),\"\")","v":""},{"$f":"IFERROR(INDEX(Table1[Pin],1/(1/SUMPRODUCT((Table1[Reps]=RIGHT(INDEX(Table5[#Headers],coln),2)*1)*(Table1[Name]=Table5[[#This Row],[Name]])*Table1[Bnk]))),\"\")","v":""},{"$f":"IFERROR(INDEX(Table1[Pin],1/(1/SUMPRODUCT((Table1[Reps]=RIGHT(INDEX(Table5[#Headers],coln),2)*1)*(Table1[Name]=Table5[[#This Row],[Name]])*Table1[Bnk]))),\"\")","v":""},{"$f":"IFERROR(INDEX(Table1[Pin],1/(1/SUMPRODUCT((Table1[Reps]=RIGHT(INDEX(Table5[#Headers],coln),2)*1)*(Table1[Name]=Table5[[#This Row],[Name]])*Table1[Bnk]))),\"\")","v":""},{"$f":"IFERROR(INDEX(Table1[Pin],1/(1/SUMPRODUCT((Table1[Reps]=RIGHT(INDEX(Table5[#Headers],coln),2)*1)*(Table1[Name]=Table5[[#This Row],[Name]])*Table1[Bnk]))),\"\")","v":""},{"$f":"IFERROR(INDEX(Table1[Pin],1/(1/SUMPRODUCT((Table1[Reps]=RIGHT(INDEX(Table5[#Headers],coln),2)*1)*(Table1[Name]=Table5[[#This Row],[Name]])*Table1[Bnk]))),\"\")","v":""},{"$f":"IFERROR(INDEX(Table1[Pin],1/(1/SUMPRODUCT((Table1[Reps]=RIGHT(INDEX(Table5[#Headers],coln),2)*1)*(Table1[Name]=Table5[[#This Row],[Name]])*Table1[Bnk]))),\"\")","v":""},{"$f":"IFERROR(INDEX(Table1[Pin],1/(1/SUMPRODUCT((Table1[Reps]=RIGHT(INDEX(Table5[#Headers],coln),2)*1)*(Table1[Name]=Table5[[#This Row],[Name]])*Table1[Bnk]))),\"\")","v":""},{"$f":"IFERROR(INDEX(Table1[Pin],1/(1/SUMPRODUCT((Table1[Reps]=RIGHT(INDEX(Table5[#Headers],coln),2)*1)*(Table1[Name]=Table5[[#This Row],[Name]])*Table1[Bnk]))),\"\")","v":""},{"$f":"[Pin01]","v":"G2"},{"$f":"CONCATENATE([Pin14],IF([Pin02]=\"\",\"\",\", \"&[Pin02]))","v":"G2"},{"$f":"CONCATENATE([Pin15],IF([Pin03]=\"\",\"\",\", \"&[Pin03]))","v":"G2"},{"$f":"CONCATENATE([Pin16],IF([Pin04]=\"\",\"\",\", \"&[Pin04]))","v":"G2"},{"$f":"CONCATENATE([Pin17],IF([Pin05]=\"\",\"\",\", \"&[Pin05]))","v":"G2"},{"$f":"CONCATENATE([Pin18],IF([Pin06]=\"\",\"\",\", \"&[Pin06]))","v":"G2"},{"$f":"CONCATENATE([Pin19],IF([Pin07]=\"\",\"\",\", \"&[Pin07]))","v":"G2"},{"$f":"CONCATENATE([Pin20],IF([Pin08]=\"\",\"\",\", \"&[Pin08]))","v":"G2"},{"$f":"CONCATENATE([Pin21],IF([Pin09]=\"\",\"\",\", \"&[Pin09]))","v":"G2"},{"$f":"CONCATENATE([Pin22],IF([Pin10]=\"\",\"\",\", \"&[Pin10]))","v":"G2"},{"$f":"CONCATENATE([Pin23],IF([Pin11]=\"\",\"\",\", \"&[Pin11]))","v":"G2"},{"$f":"CONCATENATE([Pin24],IF([Pin12]=\"\",\"\",\", \"&[Pin12]))","v":"G2"},{"$f":"CONCATENATE([Pin25],IF([Pin13]=\"\",\"\",\", \"&[Pin13]))","v":"G2"},{"$f":"IFERROR(INDEX(Table1[InOut],1/(1/SUMPRODUCT((Table1[Reps]=1)*(Table1[Name]=Table5[[#This Row],[Name]])*Table1[Seq]))),\"\")","v":"I/O"},{"$f":"IFERROR(INDEX(Table1[Level],1/(1/SUMPRODUCT((Table1[Reps]=1)*(Table1[Name]=Table5[[#This Row],[Name]])*Table1[Seq]))),\"\")","v":"TTL"},{"$f":"IFERROR(INDEX(Table1[Func],1/(1/SUMPRODUCT((Table1[Reps]=1)*(Table1[Name]=Table5[[#This Row],[Name]])*Table1[Seq]))),\"\")","v":"GPIOportDbit1."}]
[null,null,"E10","VDD33","-","Power","PositivesupplyforI/Oandsomelogic.",{"$f":"COUNTIF(INDEX([Name],1):Table1[[#This Row],[Name]],[Name])","v":1},{"$f":"IF(ISTEXT([Pin]),[Seq],INDEX([Bnk],[Seq]-1))","v":64},64,null,null,"PD2",{"$f":"IFERROR(INDEX(Table1[Pin],1/(1/SUMPRODUCT((Table1[Reps]=RIGHT(INDEX(Table5[#Headers],coln),2)*1)*(Table1[Name]=Table5[[#This Row],[Name]])*Table1[Bnk]))),\"\")","v":"H2"},{"$f":"IFERROR(INDEX(Table1[Pin],1/(1/SUMPRODUCT((Table1[Reps]=RIGHT(INDEX(Table5[#Headers],coln),2)*1)*(Table1[Name]=Table5[[#This Row],[Name]])*Table1[Bnk]))),\"\")","v":""},{"$f":"IFERROR(INDEX(Table1[Pin],1/(1/SUMPRODUCT((Table1[Reps]=RIGHT(INDEX(Table5[#Headers],coln),2)*1)*(Table1[Name]=Table5[[#This Row],[Name]])*Table1[Bnk]))),\"\")","v":""},{"$f":"IFERROR(INDEX(Table1[Pin],1/(1/SUMPRODUCT((Table1[Reps]=RIGHT(INDEX(Table5[#Headers],coln),2)*1)*(Table1[Name]=Table5[[#This Row],[Name]])*Table1[Bnk]))),\"\")","v":""},{"$f":"IFERROR(INDEX(Table1[Pin],1/(1/SUMPRODUCT((Table1[Reps]=RIGHT(INDEX(Table5[#Headers],coln),2)*1)*(Table1[Name]=Table5[[#This Row],[Name]])*Table1[Bnk]))),\"\")","v":""},{"$f":"IFERROR(INDEX(Table1[Pin],1/(1/SUMPRODUCT((Table1[Reps]=RIGHT(INDEX(Table5[#Headers],coln),2)*1)*(Table1[Name]=Table5[[#This Row],[Name]])*Table1[Bnk]))),\"\")","v":""},{"$f":"IFERROR(INDEX(Table1[Pin],1/(1/SUMPRODUCT((Table1[Reps]=RIGHT(INDEX(Table5[#Headers],coln),2)*1)*(Table1[Name]=Table5[[#This Row],[Name]])*Table1[Bnk]))),\"\")","v":""},{"$f":"IFERROR(INDEX(Table1[Pin],1/(1/SUMPRODUCT((Table1[Reps]=RIGHT(INDEX(Table5[#Headers],coln),2)*1)*(Table1[Name]=Table5[[#This Row],[Name]])*Table1[Bnk]))),\"\")","v":""},{"$f":"IFERROR(INDEX(Table1[Pin],1/(1/SUMPRODUCT((Table1[Reps]=RIGHT(INDEX(Table5[#Headers],coln),2)*1)*(Table1[Name]=Table5[[#This Row],[Name]])*Table1[Bnk]))),\"\")","v":""},{"$f":"IFERROR(INDEX(Table1[Pin],1/(1/SUMPRODUCT((Table1[Reps]=RIGHT(INDEX(Table5[#Headers],coln),2)*1)*(Table1[Name]=Table5[[#This Row],[Name]])*Table1[Bnk]))),\"\")","v":""},{"$f":"IFERROR(INDEX(Table1[Pin],1/(1/SUMPRODUCT((Table1[Reps]=RIGHT(INDEX(Table5[#Headers],coln),2)*1)*(Table1[Name]=Table5[[#This Row],[Name]])*Table1[Bnk]))),\"\")","v":""},{"$f":"IFERROR(INDEX(Table1[Pin],1/(1/SUMPRODUCT((Table1[Reps]=RIGHT(INDEX(Table5[#Headers],coln),2)*1)*(Table1[Name]=Table5[[#This Row],[Name]])*Table1[Bnk]))),\"\")","v":""},{"$f":"IFERROR(INDEX(Table1[Pin],1/(1/SUMPRODUCT((Table1[Reps]=RIGHT(INDEX(Table5[#Headers],coln),2)*1)*(Table1[Name]=Table5[[#This Row],[Name]])*Table1[Bnk]))),\"\")","v":""},{"$f":"[Pin01]","v":"H2"},{"$f":"CONCATENATE([Pin14],IF([Pin02]=\"\",\"\",\", \"&[Pin02]))","v":"H2"},{"$f":"CONCATENATE([Pin15],IF([Pin03]=\"\",\"\",\", \"&[Pin03]))","v":"H2"},{"$f":"CONCATENATE([Pin16],IF([Pin04]=\"\",\"\",\", \"&[Pin04]))","v":"H2"},{"$f":"CONCATENATE([Pin17],IF([Pin05]=\"\",\"\",\", \"&[Pin05]))","v":"H2"},{"$f":"CONCATENATE([Pin18],IF([Pin06]=\"\",\"\",\", \"&[Pin06]))","v":"H2"},{"$f":"CONCATENATE([Pin19],IF([Pin07]=\"\",\"\",\", \"&[Pin07]))","v":"H2"},{"$f":"CONCATENATE([Pin20],IF([Pin08]=\"\",\"\",\", \"&[Pin08]))","v":"H2"},{"$f":"CONCATENATE([Pin21],IF([Pin09]=\"\",\"\",\", \"&[Pin09]))","v":"H2"},{"$f":"CONCATENATE([Pin22],IF([Pin10]=\"\",\"\",\", \"&[Pin10]))","v":"H2"},{"$f":"CONCATENATE([Pin23],IF([Pin11]=\"\",\"\",\", \"&[Pin11]))","v":"H2"},{"$f":"CONCATENATE([Pin24],IF([Pin12]=\"\",\"\",\", \"&[Pin12]))","v":"H2"},{"$f":"CONCATENATE([Pin25],IF([Pin13]=\"\",\"\",\", \"&[Pin13]))","v":"H2"},{"$f":"IFERROR(INDEX(Table1[InOut],1/(1/SUMPRODUCT((Table1[Reps]=1)*(Table1[Name]=Table5[[#This Row],[Name]])*Table1[Seq]))),\"\")","v":"I/O"},{"$f":"IFERROR(INDEX(Table1[Level],1/(1/SUMPRODUCT((Table1[Reps]=1)*(Table1[Name]=Table5[[#This Row],[Name]])*Table1[Seq]))),\"\")","v":"TTL"},{"$f":"IFERROR(INDEX(Table1[Func],1/(1/SUMPRODUCT((Table1[Reps]=1)*(Table1[Name]=Table5[[#This Row],[Name]])*Table1[Seq]))),\"\")","v":"GPIOportDbit2."}]
[null,null,"E11","CMOD0","I/O","TTL","CPUModebit0.Inputmustbesettologic0(grounded);other",{"$f":"COUNTIF(INDEX([Name],1):Table1[[#This Row],[Name]],[Name])","v":1},{"$f":"IF(ISTEXT([Pin]),[Seq],INDEX([Bnk],[Seq]-1))","v":65},65,null,null,"PD3",{"$f":"IFERROR(INDEX(Table1[Pin],1/(1/SUMPRODUCT((Table1[Reps]=RIGHT(INDEX(Table5[#Headers],coln),2)*1)*(Table1[Name]=Table5[[#This Row],[Name]])*Table1[Bnk]))),\"\")","v":"H1"},{"$f":"IFERROR(INDEX(Table1[Pin],1/(1/SUMPRODUCT((Table1[Reps]=RIGHT(INDEX(Table5[#Headers],coln),2)*1)*(Table1[Name]=Table5[[#This Row],[Name]])*Table1[Bnk]))),\"\")","v":""},{"$f":"IFERROR(INDEX(Table1[Pin],1/(1/SUMPRODUCT((Table1[Reps]=RIGHT(INDEX(Table5[#Headers],coln),2)*1)*(Table1[Name]=Table5[[#This Row],[Name]])*Table1[Bnk]))),\"\")","v":""},{"$f":"IFERROR(INDEX(Table1[Pin],1/(1/SUMPRODUCT((Table1[Reps]=RIGHT(INDEX(Table5[#Headers],coln),2)*1)*(Table1[Name]=Table5[[#This Row],[Name]])*Table1[Bnk]))),\"\")","v":""},{"$f":"IFERROR(INDEX(Table1[Pin],1/(1/SUMPRODUCT((Table1[Reps]=RIGHT(INDEX(Table5[#Headers],coln),2)*1)*(Table1[Name]=Table5[[#This Row],[Name]])*Table1[Bnk]))),\"\")","v":""},{"$f":"IFERROR(INDEX(Table1[Pin],1/(1/SUMPRODUCT((Table1[Reps]=RIGHT(INDEX(Table5[#Headers],coln),2)*1)*(Table1[Name]=Table5[[#This Row],[Name]])*Table1[Bnk]))),\"\")","v":""},{"$f":"IFERROR(INDEX(Table1[Pin],1/(1/SUMPRODUCT((Table1[Reps]=RIGHT(INDEX(Table5[#Headers],coln),2)*1)*(Table1[Name]=Table5[[#This Row],[Name]])*Table1[Bnk]))),\"\")","v":""},{"$f":"IFERROR(INDEX(Table1[Pin],1/(1/SUMPRODUCT((Table1[Reps]=RIGHT(INDEX(Table5[#Headers],coln),2)*1)*(Table1[Name]=Table5[[#This Row],[Name]])*Table1[Bnk]))),\"\")","v":""},{"$f":"IFERROR(INDEX(Table1[Pin],1/(1/SUMPRODUCT((Table1[Reps]=RIGHT(INDEX(Table5[#Headers],coln),2)*1)*(Table1[Name]=Table5[[#This Row],[Name]])*Table1[Bnk]))),\"\")","v":""},{"$f":"IFERROR(INDEX(Table1[Pin],1/(1/SUMPRODUCT((Table1[Reps]=RIGHT(INDEX(Table5[#Headers],coln),2)*1)*(Table1[Name]=Table5[[#This Row],[Name]])*Table1[Bnk]))),\"\")","v":""},{"$f":"IFERROR(INDEX(Table1[Pin],1/(1/SUMPRODUCT((Table1[Reps]=RIGHT(INDEX(Table5[#Headers],coln),2)*1)*(Table1[Name]=Table5[[#This Row],[Name]])*Table1[Bnk]))),\"\")","v":""},{"$f":"IFERROR(INDEX(Table1[Pin],1/(1/SUMPRODUCT((Table1[Reps]=RIGHT(INDEX(Table5[#Headers],coln),2)*1)*(Table1[Name]=Table5[[#This Row],[Name]])*Table1[Bnk]))),\"\")","v":""},{"$f":"IFERROR(INDEX(Table1[Pin],1/(1/SUMPRODUCT((Table1[Reps]=RIGHT(INDEX(Table5[#Headers],coln),2)*1)*(Table1[Name]=Table5[[#This Row],[Name]])*Table1[Bnk]))),\"\")","v":""},{"$f":"[Pin01]","v":"H1"},{"$f":"CONCATENATE([Pin14],IF([Pin02]=\"\",\"\",\", \"&[Pin02]))","v":"H1"},{"$f":"CONCATENATE([Pin15],IF([Pin03]=\"\",\"\",\", \"&[Pin03]))","v":"H1"},{"$f":"CONCATENATE([Pin16],IF([Pin04]=\"\",\"\",\", \"&[Pin04]))","v":"H1"},{"$f":"CONCATENATE([Pin17],IF([Pin05]=\"\",\"\",\", \"&[Pin05]))","v":"H1"},{"$f":"CONCATENATE([Pin18],IF([Pin06]=\"\",\"\",\", \"&[Pin06]))","v":"H1"},{"$f":"CONCATENATE([Pin19],IF([Pin07]=\"\",\"\",\", \"&[Pin07]))","v":"H1"},{"$f":"CONCATENATE([Pin20],IF([Pin08]=\"\",\"\",\", \"&[Pin08]))","v":"H1"},{"$f":"CONCATENATE([Pin21],IF([Pin09]=\"\",\"\",\", \"&[Pin09]))","v":"H1"},{"$f":"CONCATENATE([Pin22],IF([Pin10]=\"\",\"\",\", \"&[Pin10]))","v":"H1"},{"$f":"CONCATENATE([Pin23],IF([Pin11]=\"\",\"\",\", \"&[Pin11]))","v":"H1"},{"$f":"CONCATENATE([Pin24],IF([Pin12]=\"\",\"\",\", \"&[Pin12]))","v":"H1"},{"$f":"CONCATENATE([Pin25],IF([Pin13]=\"\",\"\",\", \"&[Pin13]))","v":"H1"},{"$f":"IFERROR(INDEX(Table1[InOut],1/(1/SUMPRODUCT((Table1[Reps]=1)*(Table1[Name]=Table5[[#This Row],[Name]])*Table1[Seq]))),\"\")","v":"I/O"},{"$f":"IFERROR(INDEX(Table1[Level],1/(1/SUMPRODUCT((Table1[Reps]=1)*(Table1[Name]=Table5[[#This Row],[Name]])*Table1[Seq]))),\"\")","v":"TTL"},{"$f":"IFERROR(INDEX(Table1[Func],1/(1/SUMPRODUCT((Table1[Reps]=1)*(Table1[Name]=Table5[[#This Row],[Name]])*Table1[Seq]))),\"\")","v":"GPIOportDbit3."}]
[null,null,"E12","PB0","I/O","TTL","GPIOportBbit0.",{"$f":"COUNTIF(INDEX([Name],1):Table1[[#This Row],[Name]],[Name])","v":1},{"$f":"IF(ISTEXT([Pin]),[Seq],INDEX([Bnk],[Seq]-1))","v":66},66,null,null,"PE0",{"$f":"IFERROR(INDEX(Table1[Pin],1/(1/SUMPRODUCT((Table1[Reps]=RIGHT(INDEX(Table5[#Headers],coln),2)*1)*(Table1[Name]=Table5[[#This Row],[Name]])*Table1[Bnk]))),\"\")","v":"A11"},{"$f":"IFERROR(INDEX(Table1[Pin],1/(1/SUMPRODUCT((Table1[Reps]=RIGHT(INDEX(Table5[#Headers],coln),2)*1)*(Table1[Name]=Table5[[#This Row],[Name]])*Table1[Bnk]))),\"\")","v":""},{"$f":"IFERROR(INDEX(Table1[Pin],1/(1/SUMPRODUCT((Table1[Reps]=RIGHT(INDEX(Table5[#Headers],coln),2)*1)*(Table1[Name]=Table5[[#This Row],[Name]])*Table1[Bnk]))),\"\")","v":""},{"$f":"IFERROR(INDEX(Table1[Pin],1/(1/SUMPRODUCT((Table1[Reps]=RIGHT(INDEX(Table5[#Headers],coln),2)*1)*(Table1[Name]=Table5[[#This Row],[Name]])*Table1[Bnk]))),\"\")","v":""},{"$f":"IFERROR(INDEX(Table1[Pin],1/(1/SUMPRODUCT((Table1[Reps]=RIGHT(INDEX(Table5[#Headers],coln),2)*1)*(Table1[Name]=Table5[[#This Row],[Name]])*Table1[Bnk]))),\"\")","v":""},{"$f":"IFERROR(INDEX(Table1[Pin],1/(1/SUMPRODUCT((Table1[Reps]=RIGHT(INDEX(Table5[#Headers],coln),2)*1)*(Table1[Name]=Table5[[#This Row],[Name]])*Table1[Bnk]))),\"\")","v":""},{"$f":"IFERROR(INDEX(Table1[Pin],1/(1/SUMPRODUCT((Table1[Reps]=RIGHT(INDEX(Table5[#Headers],coln),2)*1)*(Table1[Name]=Table5[[#This Row],[Name]])*Table1[Bnk]))),\"\")","v":""},{"$f":"IFERROR(INDEX(Table1[Pin],1/(1/SUMPRODUCT((Table1[Reps]=RIGHT(INDEX(Table5[#Headers],coln),2)*1)*(Table1[Name]=Table5[[#This Row],[Name]])*Table1[Bnk]))),\"\")","v":""},{"$f":"IFERROR(INDEX(Table1[Pin],1/(1/SUMPRODUCT((Table1[Reps]=RIGHT(INDEX(Table5[#Headers],coln),2)*1)*(Table1[Name]=Table5[[#This Row],[Name]])*Table1[Bnk]))),\"\")","v":""},{"$f":"IFERROR(INDEX(Table1[Pin],1/(1/SUMPRODUCT((Table1[Reps]=RIGHT(INDEX(Table5[#Headers],coln),2)*1)*(Table1[Name]=Table5[[#This Row],[Name]])*Table1[Bnk]))),\"\")","v":""},{"$f":"IFERROR(INDEX(Table1[Pin],1/(1/SUMPRODUCT((Table1[Reps]=RIGHT(INDEX(Table5[#Headers],coln),2)*1)*(Table1[Name]=Table5[[#This Row],[Name]])*Table1[Bnk]))),\"\")","v":""},{"$f":"IFERROR(INDEX(Table1[Pin],1/(1/SUMPRODUCT((Table1[Reps]=RIGHT(INDEX(Table5[#Headers],coln),2)*1)*(Table1[Name]=Table5[[#This Row],[Name]])*Table1[Bnk]))),\"\")","v":""},{"$f":"IFERROR(INDEX(Table1[Pin],1/(1/SUMPRODUCT((Table1[Reps]=RIGHT(INDEX(Table5[#Headers],coln),2)*1)*(Table1[Name]=Table5[[#This Row],[Name]])*Table1[Bnk]))),\"\")","v":""},{"$f":"[Pin01]","v":"A11"},{"$f":"CONCATENATE([Pin14],IF([Pin02]=\"\",\"\",\", \"&[Pin02]))","v":"A11"},{"$f":"CONCATENATE([Pin15],IF([Pin03]=\"\",\"\",\", \"&[Pin03]))","v":"A11"},{"$f":"CONCATENATE([Pin16],IF([Pin04]=\"\",\"\",\", \"&[Pin04]))","v":"A11"},{"$f":"CONCATENATE([Pin17],IF([Pin05]=\"\",\"\",\", \"&[Pin05]))","v":"A11"},{"$f":"CONCATENATE([Pin18],IF([Pin06]=\"\",\"\",\", \"&[Pin06]))","v":"A11"},{"$f":"CONCATENATE([Pin19],IF([Pin07]=\"\",\"\",\", \"&[Pin07]))","v":"A11"},{"$f":"CONCATENATE([Pin20],IF([Pin08]=\"\",\"\",\", \"&[Pin08]))","v":"A11"},{"$f":"CONCATENATE([Pin21],IF([Pin09]=\"\",\"\",\", \"&[Pin09]))","v":"A11"},{"$f":"CONCATENATE([Pin22],IF([Pin10]=\"\",\"\",\", \"&[Pin10]))","v":"A11"},{"$f":"CONCATENATE([Pin23],IF([Pin11]=\"\",\"\",\", \"&[Pin11]))","v":"A11"},{"$f":"CONCATENATE([Pin24],IF([Pin12]=\"\",\"\",\", \"&[Pin12]))","v":"A11"},{"$f":"CONCATENATE([Pin25],IF([Pin13]=\"\",\"\",\", \"&[Pin13]))","v":"A11"},{"$f":"IFERROR(INDEX(Table1[InOut],1/(1/SUMPRODUCT((Table1[Reps]=1)*(Table1[Name]=Table5[[#This Row],[Name]])*Table1[Seq]))),\"\")","v":"I/O"},{"$f":"IFERROR(INDEX(Table1[Level],1/(1/SUMPRODUCT((Table1[Reps]=1)*(Table1[Name]=Table5[[#This Row],[Name]])*Table1[Seq]))),\"\")","v":"TTL"},{"$f":"IFERROR(INDEX(Table1[Func],1/(1/SUMPRODUCT((Table1[Reps]=1)*(Table1[Name]=Table5[[#This Row],[Name]])*Table1[Seq]))),\"\")","v":"GPIOportEbit0."}]
[null,null,null,"CCP0","I/O","TTL","Capture/Compare/PWM0.",{"$f":"COUNTIF(INDEX([Name],1):Table1[[#This Row],[Name]],[Name])","v":1},{"$f":"IF(ISTEXT([Pin]),[Seq],INDEX([Bnk],[Seq]-1))","v":66},67,null,null,"PE1",{"$f":"IFERROR(INDEX(Table1[Pin],1/(1/SUMPRODUCT((Table1[Reps]=RIGHT(INDEX(Table5[#Headers],coln),2)*1)*(Table1[Name]=Table5[[#This Row],[Name]])*Table1[Bnk]))),\"\")","v":"B12"},{"$f":"IFERROR(INDEX(Table1[Pin],1/(1/SUMPRODUCT((Table1[Reps]=RIGHT(INDEX(Table5[#Headers],coln),2)*1)*(Table1[Name]=Table5[[#This Row],[Name]])*Table1[Bnk]))),\"\")","v":""},{"$f":"IFERROR(INDEX(Table1[Pin],1/(1/SUMPRODUCT((Table1[Reps]=RIGHT(INDEX(Table5[#Headers],coln),2)*1)*(Table1[Name]=Table5[[#This Row],[Name]])*Table1[Bnk]))),\"\")","v":""},{"$f":"IFERROR(INDEX(Table1[Pin],1/(1/SUMPRODUCT((Table1[Reps]=RIGHT(INDEX(Table5[#Headers],coln),2)*1)*(Table1[Name]=Table5[[#This Row],[Name]])*Table1[Bnk]))),\"\")","v":""},{"$f":"IFERROR(INDEX(Table1[Pin],1/(1/SUMPRODUCT((Table1[Reps]=RIGHT(INDEX(Table5[#Headers],coln),2)*1)*(Table1[Name]=Table5[[#This Row],[Name]])*Table1[Bnk]))),\"\")","v":""},{"$f":"IFERROR(INDEX(Table1[Pin],1/(1/SUMPRODUCT((Table1[Reps]=RIGHT(INDEX(Table5[#Headers],coln),2)*1)*(Table1[Name]=Table5[[#This Row],[Name]])*Table1[Bnk]))),\"\")","v":""},{"$f":"IFERROR(INDEX(Table1[Pin],1/(1/SUMPRODUCT((Table1[Reps]=RIGHT(INDEX(Table5[#Headers],coln),2)*1)*(Table1[Name]=Table5[[#This Row],[Name]])*Table1[Bnk]))),\"\")","v":""},{"$f":"IFERROR(INDEX(Table1[Pin],1/(1/SUMPRODUCT((Table1[Reps]=RIGHT(INDEX(Table5[#Headers],coln),2)*1)*(Table1[Name]=Table5[[#This Row],[Name]])*Table1[Bnk]))),\"\")","v":""},{"$f":"IFERROR(INDEX(Table1[Pin],1/(1/SUMPRODUCT((Table1[Reps]=RIGHT(INDEX(Table5[#Headers],coln),2)*1)*(Table1[Name]=Table5[[#This Row],[Name]])*Table1[Bnk]))),\"\")","v":""},{"$f":"IFERROR(INDEX(Table1[Pin],1/(1/SUMPRODUCT((Table1[Reps]=RIGHT(INDEX(Table5[#Headers],coln),2)*1)*(Table1[Name]=Table5[[#This Row],[Name]])*Table1[Bnk]))),\"\")","v":""},{"$f":"IFERROR(INDEX(Table1[Pin],1/(1/SUMPRODUCT((Table1[Reps]=RIGHT(INDEX(Table5[#Headers],coln),2)*1)*(Table1[Name]=Table5[[#This Row],[Name]])*Table1[Bnk]))),\"\")","v":""},{"$f":"IFERROR(INDEX(Table1[Pin],1/(1/SUMPRODUCT((Table1[Reps]=RIGHT(INDEX(Table5[#Headers],coln),2)*1)*(Table1[Name]=Table5[[#This Row],[Name]])*Table1[Bnk]))),\"\")","v":""},{"$f":"IFERROR(INDEX(Table1[Pin],1/(1/SUMPRODUCT((Table1[Reps]=RIGHT(INDEX(Table5[#Headers],coln),2)*1)*(Table1[Name]=Table5[[#This Row],[Name]])*Table1[Bnk]))),\"\")","v":""},{"$f":"[Pin01]","v":"B12"},{"$f":"CONCATENATE([Pin14],IF([Pin02]=\"\",\"\",\", \"&[Pin02]))","v":"B12"},{"$f":"CONCATENATE([Pin15],IF([Pin03]=\"\",\"\",\", \"&[Pin03]))","v":"B12"},{"$f":"CONCATENATE([Pin16],IF([Pin04]=\"\",\"\",\", \"&[Pin04]))","v":"B12"},{"$f":"CONCATENATE([Pin17],IF([Pin05]=\"\",\"\",\", \"&[Pin05]))","v":"B12"},{"$f":"CONCATENATE([Pin18],IF([Pin06]=\"\",\"\",\", \"&[Pin06]))","v":"B12"},{"$f":"CONCATENATE([Pin19],IF([Pin07]=\"\",\"\",\", \"&[Pin07]))","v":"B12"},{"$f":"CONCATENATE([Pin20],IF([Pin08]=\"\",\"\",\", \"&[Pin08]))","v":"B12"},{"$f":"CONCATENATE([Pin21],IF([Pin09]=\"\",\"\",\", \"&[Pin09]))","v":"B12"},{"$f":"CONCATENATE([Pin22],IF([Pin10]=\"\",\"\",\", \"&[Pin10]))","v":"B12"},{"$f":"CONCATENATE([Pin23],IF([Pin11]=\"\",\"\",\", \"&[Pin11]))","v":"B12"},{"$f":"CONCATENATE([Pin24],IF([Pin12]=\"\",\"\",\", \"&[Pin12]))","v":"B12"},{"$f":"CONCATENATE([Pin25],IF([Pin13]=\"\",\"\",\", \"&[Pin13]))","v":"B12"},{"$f":"IFERROR(INDEX(Table1[InOut],1/(1/SUMPRODUCT((Table1[Reps]=1)*(Table1[Name]=Table5[[#This Row],[Name]])*Table1[Seq]))),\"\")","v":"I/O"},{"$f":"IFERROR(INDEX(Table1[Level],1/(1/SUMPRODUCT((Table1[Reps]=1)*(Table1[Name]=Table5[[#This Row],[Name]])*Table1[Seq]))),\"\")","v":"TTL"},{"$f":"IFERROR(INDEX(Table1[Func],1/(1/SUMPRODUCT((Table1[Reps]=1)*(Table1[Name]=Table5[[#This Row],[Name]])*Table1[Seq]))),\"\")","v":"GPIOportEbit1."}]
[null,null,"F1","NC","-","-","Noconnect.Leavethepinelectricallyunconnected/isolated",{"$f":"COUNTIF(INDEX([Name],1):Table1[[#This Row],[Name]],[Name])","v":7},{"$f":"IF(ISTEXT([Pin]),[Seq],INDEX([Bnk],[Seq]-1))","v":68},68,null,null,"PE2",{"$f":"IFERROR(INDEX(Table1[Pin],1/(1/SUMPRODUCT((Table1[Reps]=RIGHT(INDEX(Table5[#Headers],coln),2)*1)*(Table1[Name]=Table5[[#This Row],[Name]])*Table1[Bnk]))),\"\")","v":"B11"},{"$f":"IFERROR(INDEX(Table1[Pin],1/(1/SUMPRODUCT((Table1[Reps]=RIGHT(INDEX(Table5[#Headers],coln),2)*1)*(Table1[Name]=Table5[[#This Row],[Name]])*Table1[Bnk]))),\"\")","v":""},{"$f":"IFERROR(INDEX(Table1[Pin],1/(1/SUMPRODUCT((Table1[Reps]=RIGHT(INDEX(Table5[#Headers],coln),2)*1)*(Table1[Name]=Table5[[#This Row],[Name]])*Table1[Bnk]))),\"\")","v":""},{"$f":"IFERROR(INDEX(Table1[Pin],1/(1/SUMPRODUCT((Table1[Reps]=RIGHT(INDEX(Table5[#Headers],coln),2)*1)*(Table1[Name]=Table5[[#This Row],[Name]])*Table1[Bnk]))),\"\")","v":""},{"$f":"IFERROR(INDEX(Table1[Pin],1/(1/SUMPRODUCT((Table1[Reps]=RIGHT(INDEX(Table5[#Headers],coln),2)*1)*(Table1[Name]=Table5[[#This Row],[Name]])*Table1[Bnk]))),\"\")","v":""},{"$f":"IFERROR(INDEX(Table1[Pin],1/(1/SUMPRODUCT((Table1[Reps]=RIGHT(INDEX(Table5[#Headers],coln),2)*1)*(Table1[Name]=Table5[[#This Row],[Name]])*Table1[Bnk]))),\"\")","v":""},{"$f":"IFERROR(INDEX(Table1[Pin],1/(1/SUMPRODUCT((Table1[Reps]=RIGHT(INDEX(Table5[#Headers],coln),2)*1)*(Table1[Name]=Table5[[#This Row],[Name]])*Table1[Bnk]))),\"\")","v":""},{"$f":"IFERROR(INDEX(Table1[Pin],1/(1/SUMPRODUCT((Table1[Reps]=RIGHT(INDEX(Table5[#Headers],coln),2)*1)*(Table1[Name]=Table5[[#This Row],[Name]])*Table1[Bnk]))),\"\")","v":""},{"$f":"IFERROR(INDEX(Table1[Pin],1/(1/SUMPRODUCT((Table1[Reps]=RIGHT(INDEX(Table5[#Headers],coln),2)*1)*(Table1[Name]=Table5[[#This Row],[Name]])*Table1[Bnk]))),\"\")","v":""},{"$f":"IFERROR(INDEX(Table1[Pin],1/(1/SUMPRODUCT((Table1[Reps]=RIGHT(INDEX(Table5[#Headers],coln),2)*1)*(Table1[Name]=Table5[[#This Row],[Name]])*Table1[Bnk]))),\"\")","v":""},{"$f":"IFERROR(INDEX(Table1[Pin],1/(1/SUMPRODUCT((Table1[Reps]=RIGHT(INDEX(Table5[#Headers],coln),2)*1)*(Table1[Name]=Table5[[#This Row],[Name]])*Table1[Bnk]))),\"\")","v":""},{"$f":"IFERROR(INDEX(Table1[Pin],1/(1/SUMPRODUCT((Table1[Reps]=RIGHT(INDEX(Table5[#Headers],coln),2)*1)*(Table1[Name]=Table5[[#This Row],[Name]])*Table1[Bnk]))),\"\")","v":""},{"$f":"IFERROR(INDEX(Table1[Pin],1/(1/SUMPRODUCT((Table1[Reps]=RIGHT(INDEX(Table5[#Headers],coln),2)*1)*(Table1[Name]=Table5[[#This Row],[Name]])*Table1[Bnk]))),\"\")","v":""},{"$f":"[Pin01]","v":"B11"},{"$f":"CONCATENATE([Pin14],IF([Pin02]=\"\",\"\",\", \"&[Pin02]))","v":"B11"},{"$f":"CONCATENATE([Pin15],IF([Pin03]=\"\",\"\",\", \"&[Pin03]))","v":"B11"},{"$f":"CONCATENATE([Pin16],IF([Pin04]=\"\",\"\",\", \"&[Pin04]))","v":"B11"},{"$f":"CONCATENATE([Pin17],IF([Pin05]=\"\",\"\",\", \"&[Pin05]))","v":"B11"},{"$f":"CONCATENATE([Pin18],IF([Pin06]=\"\",\"\",\", \"&[Pin06]))","v":"B11"},{"$f":"CONCATENATE([Pin19],IF([Pin07]=\"\",\"\",\", \"&[Pin07]))","v":"B11"},{"$f":"CONCATENATE([Pin20],IF([Pin08]=\"\",\"\",\", \"&[Pin08]))","v":"B11"},{"$f":"CONCATENATE([Pin21],IF([Pin09]=\"\",\"\",\", \"&[Pin09]))","v":"B11"},{"$f":"CONCATENATE([Pin22],IF([Pin10]=\"\",\"\",\", \"&[Pin10]))","v":"B11"},{"$f":"CONCATENATE([Pin23],IF([Pin11]=\"\",\"\",\", \"&[Pin11]))","v":"B11"},{"$f":"CONCATENATE([Pin24],IF([Pin12]=\"\",\"\",\", \"&[Pin12]))","v":"B11"},{"$f":"CONCATENATE([Pin25],IF([Pin13]=\"\",\"\",\", \"&[Pin13]))","v":"B11"},{"$f":"IFERROR(INDEX(Table1[InOut],1/(1/SUMPRODUCT((Table1[Reps]=1)*(Table1[Name]=Table5[[#This Row],[Name]])*Table1[Seq]))),\"\")","v":"I/O"},{"$f":"IFERROR(INDEX(Table1[Level],1/(1/SUMPRODUCT((Table1[Reps]=1)*(Table1[Name]=Table5[[#This Row],[Name]])*Table1[Seq]))),\"\")","v":"TTL"},{"$f":"IFERROR(INDEX(Table1[Func],1/(1/SUMPRODUCT((Table1[Reps]=1)*(Table1[Name]=Table5[[#This Row],[Name]])*Table1[Seq]))),\"\")","v":"GPIOportEbit2."}]
[null,null,"F2","NC","-","-","Noconnect.Leavethepinelectricallyunconnected/isolated",{"$f":"COUNTIF(INDEX([Name],1):Table1[[#This Row],[Name]],[Name])","v":8},{"$f":"IF(ISTEXT([Pin]),[Seq],INDEX([Bnk],[Seq]-1))","v":69},69,null,null,"PE3",{"$f":"IFERROR(INDEX(Table1[Pin],1/(1/SUMPRODUCT((Table1[Reps]=RIGHT(INDEX(Table5[#Headers],coln),2)*1)*(Table1[Name]=Table5[[#This Row],[Name]])*Table1[Bnk]))),\"\")","v":"A12"},{"$f":"IFERROR(INDEX(Table1[Pin],1/(1/SUMPRODUCT((Table1[Reps]=RIGHT(INDEX(Table5[#Headers],coln),2)*1)*(Table1[Name]=Table5[[#This Row],[Name]])*Table1[Bnk]))),\"\")","v":""},{"$f":"IFERROR(INDEX(Table1[Pin],1/(1/SUMPRODUCT((Table1[Reps]=RIGHT(INDEX(Table5[#Headers],coln),2)*1)*(Table1[Name]=Table5[[#This Row],[Name]])*Table1[Bnk]))),\"\")","v":""},{"$f":"IFERROR(INDEX(Table1[Pin],1/(1/SUMPRODUCT((Table1[Reps]=RIGHT(INDEX(Table5[#Headers],coln),2)*1)*(Table1[Name]=Table5[[#This Row],[Name]])*Table1[Bnk]))),\"\")","v":""},{"$f":"IFERROR(INDEX(Table1[Pin],1/(1/SUMPRODUCT((Table1[Reps]=RIGHT(INDEX(Table5[#Headers],coln),2)*1)*(Table1[Name]=Table5[[#This Row],[Name]])*Table1[Bnk]))),\"\")","v":""},{"$f":"IFERROR(INDEX(Table1[Pin],1/(1/SUMPRODUCT((Table1[Reps]=RIGHT(INDEX(Table5[#Headers],coln),2)*1)*(Table1[Name]=Table5[[#This Row],[Name]])*Table1[Bnk]))),\"\")","v":""},{"$f":"IFERROR(INDEX(Table1[Pin],1/(1/SUMPRODUCT((Table1[Reps]=RIGHT(INDEX(Table5[#Headers],coln),2)*1)*(Table1[Name]=Table5[[#This Row],[Name]])*Table1[Bnk]))),\"\")","v":""},{"$f":"IFERROR(INDEX(Table1[Pin],1/(1/SUMPRODUCT((Table1[Reps]=RIGHT(INDEX(Table5[#Headers],coln),2)*1)*(Table1[Name]=Table5[[#This Row],[Name]])*Table1[Bnk]))),\"\")","v":""},{"$f":"IFERROR(INDEX(Table1[Pin],1/(1/SUMPRODUCT((Table1[Reps]=RIGHT(INDEX(Table5[#Headers],coln),2)*1)*(Table1[Name]=Table5[[#This Row],[Name]])*Table1[Bnk]))),\"\")","v":""},{"$f":"IFERROR(INDEX(Table1[Pin],1/(1/SUMPRODUCT((Table1[Reps]=RIGHT(INDEX(Table5[#Headers],coln),2)*1)*(Table1[Name]=Table5[[#This Row],[Name]])*Table1[Bnk]))),\"\")","v":""},{"$f":"IFERROR(INDEX(Table1[Pin],1/(1/SUMPRODUCT((Table1[Reps]=RIGHT(INDEX(Table5[#Headers],coln),2)*1)*(Table1[Name]=Table5[[#This Row],[Name]])*Table1[Bnk]))),\"\")","v":""},{"$f":"IFERROR(INDEX(Table1[Pin],1/(1/SUMPRODUCT((Table1[Reps]=RIGHT(INDEX(Table5[#Headers],coln),2)*1)*(Table1[Name]=Table5[[#This Row],[Name]])*Table1[Bnk]))),\"\")","v":""},{"$f":"IFERROR(INDEX(Table1[Pin],1/(1/SUMPRODUCT((Table1[Reps]=RIGHT(INDEX(Table5[#Headers],coln),2)*1)*(Table1[Name]=Table5[[#This Row],[Name]])*Table1[Bnk]))),\"\")","v":""},{"$f":"[Pin01]","v":"A12"},{"$f":"CONCATENATE([Pin14],IF([Pin02]=\"\",\"\",\", \"&[Pin02]))","v":"A12"},{"$f":"CONCATENATE([Pin15],IF([Pin03]=\"\",\"\",\", \"&[Pin03]))","v":"A12"},{"$f":"CONCATENATE([Pin16],IF([Pin04]=\"\",\"\",\", \"&[Pin04]))","v":"A12"},{"$f":"CONCATENATE([Pin17],IF([Pin05]=\"\",\"\",\", \"&[Pin05]))","v":"A12"},{"$f":"CONCATENATE([Pin18],IF([Pin06]=\"\",\"\",\", \"&[Pin06]))","v":"A12"},{"$f":"CONCATENATE([Pin19],IF([Pin07]=\"\",\"\",\", \"&[Pin07]))","v":"A12"},{"$f":"CONCATENATE([Pin20],IF([Pin08]=\"\",\"\",\", \"&[Pin08]))","v":"A12"},{"$f":"CONCATENATE([Pin21],IF([Pin09]=\"\",\"\",\", \"&[Pin09]))","v":"A12"},{"$f":"CONCATENATE([Pin22],IF([Pin10]=\"\",\"\",\", \"&[Pin10]))","v":"A12"},{"$f":"CONCATENATE([Pin23],IF([Pin11]=\"\",\"\",\", \"&[Pin11]))","v":"A12"},{"$f":"CONCATENATE([Pin24],IF([Pin12]=\"\",\"\",\", \"&[Pin12]))","v":"A12"},{"$f":"CONCATENATE([Pin25],IF([Pin13]=\"\",\"\",\", \"&[Pin13]))","v":"A12"},{"$f":"IFERROR(INDEX(Table1[InOut],1/(1/SUMPRODUCT((Table1[Reps]=1)*(Table1[Name]=Table5[[#This Row],[Name]])*Table1[Seq]))),\"\")","v":"I/O"},{"$f":"IFERROR(INDEX(Table1[Level],1/(1/SUMPRODUCT((Table1[Reps]=1)*(Table1[Name]=Table5[[#This Row],[Name]])*Table1[Seq]))),\"\")","v":"TTL"},{"$f":"IFERROR(INDEX(Table1[Func],1/(1/SUMPRODUCT((Table1[Reps]=1)*(Table1[Name]=Table5[[#This Row],[Name]])*Table1[Seq]))),\"\")","v":"GPIOportEbit3."}]
[null,null,"F3","VDD25","-","Power","Positivesupplyformostofthelogicfunction,includingthe",{"$f":"COUNTIF(INDEX([Name],1):Table1[[#This Row],[Name]],[Name])","v":3},{"$f":"IF(ISTEXT([Pin]),[Seq],INDEX([Bnk],[Seq]-1))","v":70},70,null,null,"PF0",{"$f":"IFERROR(INDEX(Table1[Pin],1/(1/SUMPRODUCT((Table1[Reps]=RIGHT(INDEX(Table5[#Headers],coln),2)*1)*(Table1[Name]=Table5[[#This Row],[Name]])*Table1[Bnk]))),\"\")","v":"M9"},{"$f":"IFERROR(INDEX(Table1[Pin],1/(1/SUMPRODUCT((Table1[Reps]=RIGHT(INDEX(Table5[#Headers],coln),2)*1)*(Table1[Name]=Table5[[#This Row],[Name]])*Table1[Bnk]))),\"\")","v":""},{"$f":"IFERROR(INDEX(Table1[Pin],1/(1/SUMPRODUCT((Table1[Reps]=RIGHT(INDEX(Table5[#Headers],coln),2)*1)*(Table1[Name]=Table5[[#This Row],[Name]])*Table1[Bnk]))),\"\")","v":""},{"$f":"IFERROR(INDEX(Table1[Pin],1/(1/SUMPRODUCT((Table1[Reps]=RIGHT(INDEX(Table5[#Headers],coln),2)*1)*(Table1[Name]=Table5[[#This Row],[Name]])*Table1[Bnk]))),\"\")","v":""},{"$f":"IFERROR(INDEX(Table1[Pin],1/(1/SUMPRODUCT((Table1[Reps]=RIGHT(INDEX(Table5[#Headers],coln),2)*1)*(Table1[Name]=Table5[[#This Row],[Name]])*Table1[Bnk]))),\"\")","v":""},{"$f":"IFERROR(INDEX(Table1[Pin],1/(1/SUMPRODUCT((Table1[Reps]=RIGHT(INDEX(Table5[#Headers],coln),2)*1)*(Table1[Name]=Table5[[#This Row],[Name]])*Table1[Bnk]))),\"\")","v":""},{"$f":"IFERROR(INDEX(Table1[Pin],1/(1/SUMPRODUCT((Table1[Reps]=RIGHT(INDEX(Table5[#Headers],coln),2)*1)*(Table1[Name]=Table5[[#This Row],[Name]])*Table1[Bnk]))),\"\")","v":""},{"$f":"IFERROR(INDEX(Table1[Pin],1/(1/SUMPRODUCT((Table1[Reps]=RIGHT(INDEX(Table5[#Headers],coln),2)*1)*(Table1[Name]=Table5[[#This Row],[Name]])*Table1[Bnk]))),\"\")","v":""},{"$f":"IFERROR(INDEX(Table1[Pin],1/(1/SUMPRODUCT((Table1[Reps]=RIGHT(INDEX(Table5[#Headers],coln),2)*1)*(Table1[Name]=Table5[[#This Row],[Name]])*Table1[Bnk]))),\"\")","v":""},{"$f":"IFERROR(INDEX(Table1[Pin],1/(1/SUMPRODUCT((Table1[Reps]=RIGHT(INDEX(Table5[#Headers],coln),2)*1)*(Table1[Name]=Table5[[#This Row],[Name]])*Table1[Bnk]))),\"\")","v":""},{"$f":"IFERROR(INDEX(Table1[Pin],1/(1/SUMPRODUCT((Table1[Reps]=RIGHT(INDEX(Table5[#Headers],coln),2)*1)*(Table1[Name]=Table5[[#This Row],[Name]])*Table1[Bnk]))),\"\")","v":""},{"$f":"IFERROR(INDEX(Table1[Pin],1/(1/SUMPRODUCT((Table1[Reps]=RIGHT(INDEX(Table5[#Headers],coln),2)*1)*(Table1[Name]=Table5[[#This Row],[Name]])*Table1[Bnk]))),\"\")","v":""},{"$f":"IFERROR(INDEX(Table1[Pin],1/(1/SUMPRODUCT((Table1[Reps]=RIGHT(INDEX(Table5[#Headers],coln),2)*1)*(Table1[Name]=Table5[[#This Row],[Name]])*Table1[Bnk]))),\"\")","v":""},{"$f":"[Pin01]","v":"M9"},{"$f":"CONCATENATE([Pin14],IF([Pin02]=\"\",\"\",\", \"&[Pin02]))","v":"M9"},{"$f":"CONCATENATE([Pin15],IF([Pin03]=\"\",\"\",\", \"&[Pin03]))","v":"M9"},{"$f":"CONCATENATE([Pin16],IF([Pin04]=\"\",\"\",\", \"&[Pin04]))","v":"M9"},{"$f":"CONCATENATE([Pin17],IF([Pin05]=\"\",\"\",\", \"&[Pin05]))","v":"M9"},{"$f":"CONCATENATE([Pin18],IF([Pin06]=\"\",\"\",\", \"&[Pin06]))","v":"M9"},{"$f":"CONCATENATE([Pin19],IF([Pin07]=\"\",\"\",\", \"&[Pin07]))","v":"M9"},{"$f":"CONCATENATE([Pin20],IF([Pin08]=\"\",\"\",\", \"&[Pin08]))","v":"M9"},{"$f":"CONCATENATE([Pin21],IF([Pin09]=\"\",\"\",\", \"&[Pin09]))","v":"M9"},{"$f":"CONCATENATE([Pin22],IF([Pin10]=\"\",\"\",\", \"&[Pin10]))","v":"M9"},{"$f":"CONCATENATE([Pin23],IF([Pin11]=\"\",\"\",\", \"&[Pin11]))","v":"M9"},{"$f":"CONCATENATE([Pin24],IF([Pin12]=\"\",\"\",\", \"&[Pin12]))","v":"M9"},{"$f":"CONCATENATE([Pin25],IF([Pin13]=\"\",\"\",\", \"&[Pin13]))","v":"M9"},{"$f":"IFERROR(INDEX(Table1[InOut],1/(1/SUMPRODUCT((Table1[Reps]=1)*(Table1[Name]=Table5[[#This Row],[Name]])*Table1[Seq]))),\"\")","v":"I/O"},{"$f":"IFERROR(INDEX(Table1[Level],1/(1/SUMPRODUCT((Table1[Reps]=1)*(Table1[Name]=Table5[[#This Row],[Name]])*Table1[Seq]))),\"\")","v":"TTL"},{"$f":"IFERROR(INDEX(Table1[Func],1/(1/SUMPRODUCT((Table1[Reps]=1)*(Table1[Name]=Table5[[#This Row],[Name]])*Table1[Seq]))),\"\")","v":"GPIOportFbit0."}]
[null,null,"F10","GND","-","Power","GroundreferenceforlogicandI/Opins.",{"$f":"COUNTIF(INDEX([Name],1):Table1[[#This Row],[Name]],[Name])","v":4},{"$f":"IF(ISTEXT([Pin]),[Seq],INDEX([Bnk],[Seq]-1))","v":71},71,null,null,"PF1",{"$f":"IFERROR(INDEX(Table1[Pin],1/(1/SUMPRODUCT((Table1[Reps]=RIGHT(INDEX(Table5[#Headers],coln),2)*1)*(Table1[Name]=Table5[[#This Row],[Name]])*Table1[Bnk]))),\"\")","v":"H12"},{"$f":"IFERROR(INDEX(Table1[Pin],1/(1/SUMPRODUCT((Table1[Reps]=RIGHT(INDEX(Table5[#Headers],coln),2)*1)*(Table1[Name]=Table5[[#This Row],[Name]])*Table1[Bnk]))),\"\")","v":""},{"$f":"IFERROR(INDEX(Table1[Pin],1/(1/SUMPRODUCT((Table1[Reps]=RIGHT(INDEX(Table5[#Headers],coln),2)*1)*(Table1[Name]=Table5[[#This Row],[Name]])*Table1[Bnk]))),\"\")","v":""},{"$f":"IFERROR(INDEX(Table1[Pin],1/(1/SUMPRODUCT((Table1[Reps]=RIGHT(INDEX(Table5[#Headers],coln),2)*1)*(Table1[Name]=Table5[[#This Row],[Name]])*Table1[Bnk]))),\"\")","v":""},{"$f":"IFERROR(INDEX(Table1[Pin],1/(1/SUMPRODUCT((Table1[Reps]=RIGHT(INDEX(Table5[#Headers],coln),2)*1)*(Table1[Name]=Table5[[#This Row],[Name]])*Table1[Bnk]))),\"\")","v":""},{"$f":"IFERROR(INDEX(Table1[Pin],1/(1/SUMPRODUCT((Table1[Reps]=RIGHT(INDEX(Table5[#Headers],coln),2)*1)*(Table1[Name]=Table5[[#This Row],[Name]])*Table1[Bnk]))),\"\")","v":""},{"$f":"IFERROR(INDEX(Table1[Pin],1/(1/SUMPRODUCT((Table1[Reps]=RIGHT(INDEX(Table5[#Headers],coln),2)*1)*(Table1[Name]=Table5[[#This Row],[Name]])*Table1[Bnk]))),\"\")","v":""},{"$f":"IFERROR(INDEX(Table1[Pin],1/(1/SUMPRODUCT((Table1[Reps]=RIGHT(INDEX(Table5[#Headers],coln),2)*1)*(Table1[Name]=Table5[[#This Row],[Name]])*Table1[Bnk]))),\"\")","v":""},{"$f":"IFERROR(INDEX(Table1[Pin],1/(1/SUMPRODUCT((Table1[Reps]=RIGHT(INDEX(Table5[#Headers],coln),2)*1)*(Table1[Name]=Table5[[#This Row],[Name]])*Table1[Bnk]))),\"\")","v":""},{"$f":"IFERROR(INDEX(Table1[Pin],1/(1/SUMPRODUCT((Table1[Reps]=RIGHT(INDEX(Table5[#Headers],coln),2)*1)*(Table1[Name]=Table5[[#This Row],[Name]])*Table1[Bnk]))),\"\")","v":""},{"$f":"IFERROR(INDEX(Table1[Pin],1/(1/SUMPRODUCT((Table1[Reps]=RIGHT(INDEX(Table5[#Headers],coln),2)*1)*(Table1[Name]=Table5[[#This Row],[Name]])*Table1[Bnk]))),\"\")","v":""},{"$f":"IFERROR(INDEX(Table1[Pin],1/(1/SUMPRODUCT((Table1[Reps]=RIGHT(INDEX(Table5[#Headers],coln),2)*1)*(Table1[Name]=Table5[[#This Row],[Name]])*Table1[Bnk]))),\"\")","v":""},{"$f":"IFERROR(INDEX(Table1[Pin],1/(1/SUMPRODUCT((Table1[Reps]=RIGHT(INDEX(Table5[#Headers],coln),2)*1)*(Table1[Name]=Table5[[#This Row],[Name]])*Table1[Bnk]))),\"\")","v":""},{"$f":"[Pin01]","v":"H12"},{"$f":"CONCATENATE([Pin14],IF([Pin02]=\"\",\"\",\", \"&[Pin02]))","v":"H12"},{"$f":"CONCATENATE([Pin15],IF([Pin03]=\"\",\"\",\", \"&[Pin03]))","v":"H12"},{"$f":"CONCATENATE([Pin16],IF([Pin04]=\"\",\"\",\", \"&[Pin04]))","v":"H12"},{"$f":"CONCATENATE([Pin17],IF([Pin05]=\"\",\"\",\", \"&[Pin05]))","v":"H12"},{"$f":"CONCATENATE([Pin18],IF([Pin06]=\"\",\"\",\", \"&[Pin06]))","v":"H12"},{"$f":"CONCATENATE([Pin19],IF([Pin07]=\"\",\"\",\", \"&[Pin07]))","v":"H12"},{"$f":"CONCATENATE([Pin20],IF([Pin08]=\"\",\"\",\", \"&[Pin08]))","v":"H12"},{"$f":"CONCATENATE([Pin21],IF([Pin09]=\"\",\"\",\", \"&[Pin09]))","v":"H12"},{"$f":"CONCATENATE([Pin22],IF([Pin10]=\"\",\"\",\", \"&[Pin10]))","v":"H12"},{"$f":"CONCATENATE([Pin23],IF([Pin11]=\"\",\"\",\", \"&[Pin11]))","v":"H12"},{"$f":"CONCATENATE([Pin24],IF([Pin12]=\"\",\"\",\", \"&[Pin12]))","v":"H12"},{"$f":"CONCATENATE([Pin25],IF([Pin13]=\"\",\"\",\", \"&[Pin13]))","v":"H12"},{"$f":"IFERROR(INDEX(Table1[InOut],1/(1/SUMPRODUCT((Table1[Reps]=1)*(Table1[Name]=Table5[[#This Row],[Name]])*Table1[Seq]))),\"\")","v":"I/O"},{"$f":"IFERROR(INDEX(Table1[Level],1/(1/SUMPRODUCT((Table1[Reps]=1)*(Table1[Name]=Table5[[#This Row],[Name]])*Table1[Seq]))),\"\")","v":"TTL"},{"$f":"IFERROR(INDEX(Table1[Func],1/(1/SUMPRODUCT((Table1[Reps]=1)*(Table1[Name]=Table5[[#This Row],[Name]])*Table1[Seq]))),\"\")","v":"GPIOportFbit1."}]
[null,null,"F11","GND","-","Power","GroundreferenceforlogicandI/Opins.",{"$f":"COUNTIF(INDEX([Name],1):Table1[[#This Row],[Name]],[Name])","v":5},{"$f":"IF(ISTEXT([Pin]),[Seq],INDEX([Bnk],[Seq]-1))","v":72},72,null,null,"PF2",{"$f":"IFERROR(INDEX(Table1[Pin],1/(1/SUMPRODUCT((Table1[Reps]=RIGHT(INDEX(Table5[#Headers],coln),2)*1)*(Table1[Name]=Table5[[#This Row],[Name]])*Table1[Bnk]))),\"\")","v":"J11"},{"$f":"IFERROR(INDEX(Table1[Pin],1/(1/SUMPRODUCT((Table1[Reps]=RIGHT(INDEX(Table5[#Headers],coln),2)*1)*(Table1[Name]=Table5[[#This Row],[Name]])*Table1[Bnk]))),\"\")","v":""},{"$f":"IFERROR(INDEX(Table1[Pin],1/(1/SUMPRODUCT((Table1[Reps]=RIGHT(INDEX(Table5[#Headers],coln),2)*1)*(Table1[Name]=Table5[[#This Row],[Name]])*Table1[Bnk]))),\"\")","v":""},{"$f":"IFERROR(INDEX(Table1[Pin],1/(1/SUMPRODUCT((Table1[Reps]=RIGHT(INDEX(Table5[#Headers],coln),2)*1)*(Table1[Name]=Table5[[#This Row],[Name]])*Table1[Bnk]))),\"\")","v":""},{"$f":"IFERROR(INDEX(Table1[Pin],1/(1/SUMPRODUCT((Table1[Reps]=RIGHT(INDEX(Table5[#Headers],coln),2)*1)*(Table1[Name]=Table5[[#This Row],[Name]])*Table1[Bnk]))),\"\")","v":""},{"$f":"IFERROR(INDEX(Table1[Pin],1/(1/SUMPRODUCT((Table1[Reps]=RIGHT(INDEX(Table5[#Headers],coln),2)*1)*(Table1[Name]=Table5[[#This Row],[Name]])*Table1[Bnk]))),\"\")","v":""},{"$f":"IFERROR(INDEX(Table1[Pin],1/(1/SUMPRODUCT((Table1[Reps]=RIGHT(INDEX(Table5[#Headers],coln),2)*1)*(Table1[Name]=Table5[[#This Row],[Name]])*Table1[Bnk]))),\"\")","v":""},{"$f":"IFERROR(INDEX(Table1[Pin],1/(1/SUMPRODUCT((Table1[Reps]=RIGHT(INDEX(Table5[#Headers],coln),2)*1)*(Table1[Name]=Table5[[#This Row],[Name]])*Table1[Bnk]))),\"\")","v":""},{"$f":"IFERROR(INDEX(Table1[Pin],1/(1/SUMPRODUCT((Table1[Reps]=RIGHT(INDEX(Table5[#Headers],coln),2)*1)*(Table1[Name]=Table5[[#This Row],[Name]])*Table1[Bnk]))),\"\")","v":""},{"$f":"IFERROR(INDEX(Table1[Pin],1/(1/SUMPRODUCT((Table1[Reps]=RIGHT(INDEX(Table5[#Headers],coln),2)*1)*(Table1[Name]=Table5[[#This Row],[Name]])*Table1[Bnk]))),\"\")","v":""},{"$f":"IFERROR(INDEX(Table1[Pin],1/(1/SUMPRODUCT((Table1[Reps]=RIGHT(INDEX(Table5[#Headers],coln),2)*1)*(Table1[Name]=Table5[[#This Row],[Name]])*Table1[Bnk]))),\"\")","v":""},{"$f":"IFERROR(INDEX(Table1[Pin],1/(1/SUMPRODUCT((Table1[Reps]=RIGHT(INDEX(Table5[#Headers],coln),2)*1)*(Table1[Name]=Table5[[#This Row],[Name]])*Table1[Bnk]))),\"\")","v":""},{"$f":"IFERROR(INDEX(Table1[Pin],1/(1/SUMPRODUCT((Table1[Reps]=RIGHT(INDEX(Table5[#Headers],coln),2)*1)*(Table1[Name]=Table5[[#This Row],[Name]])*Table1[Bnk]))),\"\")","v":""},{"$f":"[Pin01]","v":"J11"},{"$f":"CONCATENATE([Pin14],IF([Pin02]=\"\",\"\",\", \"&[Pin02]))","v":"J11"},{"$f":"CONCATENATE([Pin15],IF([Pin03]=\"\",\"\",\", \"&[Pin03]))","v":"J11"},{"$f":"CONCATENATE([Pin16],IF([Pin04]=\"\",\"\",\", \"&[Pin04]))","v":"J11"},{"$f":"CONCATENATE([Pin17],IF([Pin05]=\"\",\"\",\", \"&[Pin05]))","v":"J11"},{"$f":"CONCATENATE([Pin18],IF([Pin06]=\"\",\"\",\", \"&[Pin06]))","v":"J11"},{"$f":"CONCATENATE([Pin19],IF([Pin07]=\"\",\"\",\", \"&[Pin07]))","v":"J11"},{"$f":"CONCATENATE([Pin20],IF([Pin08]=\"\",\"\",\", \"&[Pin08]))","v":"J11"},{"$f":"CONCATENATE([Pin21],IF([Pin09]=\"\",\"\",\", \"&[Pin09]))","v":"J11"},{"$f":"CONCATENATE([Pin22],IF([Pin10]=\"\",\"\",\", \"&[Pin10]))","v":"J11"},{"$f":"CONCATENATE([Pin23],IF([Pin11]=\"\",\"\",\", \"&[Pin11]))","v":"J11"},{"$f":"CONCATENATE([Pin24],IF([Pin12]=\"\",\"\",\", \"&[Pin12]))","v":"J11"},{"$f":"CONCATENATE([Pin25],IF([Pin13]=\"\",\"\",\", \"&[Pin13]))","v":"J11"},{"$f":"IFERROR(INDEX(Table1[InOut],1/(1/SUMPRODUCT((Table1[Reps]=1)*(Table1[Name]=Table5[[#This Row],[Name]])*Table1[Seq]))),\"\")","v":"I/O"},{"$f":"IFERROR(INDEX(Table1[Level],1/(1/SUMPRODUCT((Table1[Reps]=1)*(Table1[Name]=Table5[[#This Row],[Name]])*Table1[Seq]))),\"\")","v":"TTL"},{"$f":"IFERROR(INDEX(Table1[Func],1/(1/SUMPRODUCT((Table1[Reps]=1)*(Table1[Name]=Table5[[#This Row],[Name]])*Table1[Seq]))),\"\")","v":"GPIOportFbit2."}]
[null,null,"F12","GND","-","Power","GroundreferenceforlogicandI/Opins.",{"$f":"COUNTIF(INDEX([Name],1):Table1[[#This Row],[Name]],[Name])","v":6},{"$f":"IF(ISTEXT([Pin]),[Seq],INDEX([Bnk],[Seq]-1))","v":73},73,null,null,"PF3",{"$f":"IFERROR(INDEX(Table1[Pin],1/(1/SUMPRODUCT((Table1[Reps]=RIGHT(INDEX(Table5[#Headers],coln),2)*1)*(Table1[Name]=Table5[[#This Row],[Name]])*Table1[Bnk]))),\"\")","v":"J12"},{"$f":"IFERROR(INDEX(Table1[Pin],1/(1/SUMPRODUCT((Table1[Reps]=RIGHT(INDEX(Table5[#Headers],coln),2)*1)*(Table1[Name]=Table5[[#This Row],[Name]])*Table1[Bnk]))),\"\")","v":""},{"$f":"IFERROR(INDEX(Table1[Pin],1/(1/SUMPRODUCT((Table1[Reps]=RIGHT(INDEX(Table5[#Headers],coln),2)*1)*(Table1[Name]=Table5[[#This Row],[Name]])*Table1[Bnk]))),\"\")","v":""},{"$f":"IFERROR(INDEX(Table1[Pin],1/(1/SUMPRODUCT((Table1[Reps]=RIGHT(INDEX(Table5[#Headers],coln),2)*1)*(Table1[Name]=Table5[[#This Row],[Name]])*Table1[Bnk]))),\"\")","v":""},{"$f":"IFERROR(INDEX(Table1[Pin],1/(1/SUMPRODUCT((Table1[Reps]=RIGHT(INDEX(Table5[#Headers],coln),2)*1)*(Table1[Name]=Table5[[#This Row],[Name]])*Table1[Bnk]))),\"\")","v":""},{"$f":"IFERROR(INDEX(Table1[Pin],1/(1/SUMPRODUCT((Table1[Reps]=RIGHT(INDEX(Table5[#Headers],coln),2)*1)*(Table1[Name]=Table5[[#This Row],[Name]])*Table1[Bnk]))),\"\")","v":""},{"$f":"IFERROR(INDEX(Table1[Pin],1/(1/SUMPRODUCT((Table1[Reps]=RIGHT(INDEX(Table5[#Headers],coln),2)*1)*(Table1[Name]=Table5[[#This Row],[Name]])*Table1[Bnk]))),\"\")","v":""},{"$f":"IFERROR(INDEX(Table1[Pin],1/(1/SUMPRODUCT((Table1[Reps]=RIGHT(INDEX(Table5[#Headers],coln),2)*1)*(Table1[Name]=Table5[[#This Row],[Name]])*Table1[Bnk]))),\"\")","v":""},{"$f":"IFERROR(INDEX(Table1[Pin],1/(1/SUMPRODUCT((Table1[Reps]=RIGHT(INDEX(Table5[#Headers],coln),2)*1)*(Table1[Name]=Table5[[#This Row],[Name]])*Table1[Bnk]))),\"\")","v":""},{"$f":"IFERROR(INDEX(Table1[Pin],1/(1/SUMPRODUCT((Table1[Reps]=RIGHT(INDEX(Table5[#Headers],coln),2)*1)*(Table1[Name]=Table5[[#This Row],[Name]])*Table1[Bnk]))),\"\")","v":""},{"$f":"IFERROR(INDEX(Table1[Pin],1/(1/SUMPRODUCT((Table1[Reps]=RIGHT(INDEX(Table5[#Headers],coln),2)*1)*(Table1[Name]=Table5[[#This Row],[Name]])*Table1[Bnk]))),\"\")","v":""},{"$f":"IFERROR(INDEX(Table1[Pin],1/(1/SUMPRODUCT((Table1[Reps]=RIGHT(INDEX(Table5[#Headers],coln),2)*1)*(Table1[Name]=Table5[[#This Row],[Name]])*Table1[Bnk]))),\"\")","v":""},{"$f":"IFERROR(INDEX(Table1[Pin],1/(1/SUMPRODUCT((Table1[Reps]=RIGHT(INDEX(Table5[#Headers],coln),2)*1)*(Table1[Name]=Table5[[#This Row],[Name]])*Table1[Bnk]))),\"\")","v":""},{"$f":"[Pin01]","v":"J12"},{"$f":"CONCATENATE([Pin14],IF([Pin02]=\"\",\"\",\", \"&[Pin02]))","v":"J12"},{"$f":"CONCATENATE([Pin15],IF([Pin03]=\"\",\"\",\", \"&[Pin03]))","v":"J12"},{"$f":"CONCATENATE([Pin16],IF([Pin04]=\"\",\"\",\", \"&[Pin04]))","v":"J12"},{"$f":"CONCATENATE([Pin17],IF([Pin05]=\"\",\"\",\", \"&[Pin05]))","v":"J12"},{"$f":"CONCATENATE([Pin18],IF([Pin06]=\"\",\"\",\", \"&[Pin06]))","v":"J12"},{"$f":"CONCATENATE([Pin19],IF([Pin07]=\"\",\"\",\", \"&[Pin07]))","v":"J12"},{"$f":"CONCATENATE([Pin20],IF([Pin08]=\"\",\"\",\", \"&[Pin08]))","v":"J12"},{"$f":"CONCATENATE([Pin21],IF([Pin09]=\"\",\"\",\", \"&[Pin09]))","v":"J12"},{"$f":"CONCATENATE([Pin22],IF([Pin10]=\"\",\"\",\", \"&[Pin10]))","v":"J12"},{"$f":"CONCATENATE([Pin23],IF([Pin11]=\"\",\"\",\", \"&[Pin11]))","v":"J12"},{"$f":"CONCATENATE([Pin24],IF([Pin12]=\"\",\"\",\", \"&[Pin12]))","v":"J12"},{"$f":"CONCATENATE([Pin25],IF([Pin13]=\"\",\"\",\", \"&[Pin13]))","v":"J12"},{"$f":"IFERROR(INDEX(Table1[InOut],1/(1/SUMPRODUCT((Table1[Reps]=1)*(Table1[Name]=Table5[[#This Row],[Name]])*Table1[Seq]))),\"\")","v":"I/O"},{"$f":"IFERROR(INDEX(Table1[Level],1/(1/SUMPRODUCT((Table1[Reps]=1)*(Table1[Name]=Table5[[#This Row],[Name]])*Table1[Seq]))),\"\")","v":"TTL"},{"$f":"IFERROR(INDEX(Table1[Func],1/(1/SUMPRODUCT((Table1[Reps]=1)*(Table1[Name]=Table5[[#This Row],[Name]])*Table1[Seq]))),\"\")","v":"GPIOportFbit3."}]
[null,null,"G1","PD0","I/O","TTL","GPIOportDbit0.",{"$f":"COUNTIF(INDEX([Name],1):Table1[[#This Row],[Name]],[Name])","v":1},{"$f":"IF(ISTEXT([Pin]),[Seq],INDEX([Bnk],[Seq]-1))","v":74},74,null,null,"PG0",{"$f":"IFERROR(INDEX(Table1[Pin],1/(1/SUMPRODUCT((Table1[Reps]=RIGHT(INDEX(Table5[#Headers],coln),2)*1)*(Table1[Name]=Table5[[#This Row],[Name]])*Table1[Bnk]))),\"\")","v":"K1"},{"$f":"IFERROR(INDEX(Table1[Pin],1/(1/SUMPRODUCT((Table1[Reps]=RIGHT(INDEX(Table5[#Headers],coln),2)*1)*(Table1[Name]=Table5[[#This Row],[Name]])*Table1[Bnk]))),\"\")","v":""},{"$f":"IFERROR(INDEX(Table1[Pin],1/(1/SUMPRODUCT((Table1[Reps]=RIGHT(INDEX(Table5[#Headers],coln),2)*1)*(Table1[Name]=Table5[[#This Row],[Name]])*Table1[Bnk]))),\"\")","v":""},{"$f":"IFERROR(INDEX(Table1[Pin],1/(1/SUMPRODUCT((Table1[Reps]=RIGHT(INDEX(Table5[#Headers],coln),2)*1)*(Table1[Name]=Table5[[#This Row],[Name]])*Table1[Bnk]))),\"\")","v":""},{"$f":"IFERROR(INDEX(Table1[Pin],1/(1/SUMPRODUCT((Table1[Reps]=RIGHT(INDEX(Table5[#Headers],coln),2)*1)*(Table1[Name]=Table5[[#This Row],[Name]])*Table1[Bnk]))),\"\")","v":""},{"$f":"IFERROR(INDEX(Table1[Pin],1/(1/SUMPRODUCT((Table1[Reps]=RIGHT(INDEX(Table5[#Headers],coln),2)*1)*(Table1[Name]=Table5[[#This Row],[Name]])*Table1[Bnk]))),\"\")","v":""},{"$f":"IFERROR(INDEX(Table1[Pin],1/(1/SUMPRODUCT((Table1[Reps]=RIGHT(INDEX(Table5[#Headers],coln),2)*1)*(Table1[Name]=Table5[[#This Row],[Name]])*Table1[Bnk]))),\"\")","v":""},{"$f":"IFERROR(INDEX(Table1[Pin],1/(1/SUMPRODUCT((Table1[Reps]=RIGHT(INDEX(Table5[#Headers],coln),2)*1)*(Table1[Name]=Table5[[#This Row],[Name]])*Table1[Bnk]))),\"\")","v":""},{"$f":"IFERROR(INDEX(Table1[Pin],1/(1/SUMPRODUCT((Table1[Reps]=RIGHT(INDEX(Table5[#Headers],coln),2)*1)*(Table1[Name]=Table5[[#This Row],[Name]])*Table1[Bnk]))),\"\")","v":""},{"$f":"IFERROR(INDEX(Table1[Pin],1/(1/SUMPRODUCT((Table1[Reps]=RIGHT(INDEX(Table5[#Headers],coln),2)*1)*(Table1[Name]=Table5[[#This Row],[Name]])*Table1[Bnk]))),\"\")","v":""},{"$f":"IFERROR(INDEX(Table1[Pin],1/(1/SUMPRODUCT((Table1[Reps]=RIGHT(INDEX(Table5[#Headers],coln),2)*1)*(Table1[Name]=Table5[[#This Row],[Name]])*Table1[Bnk]))),\"\")","v":""},{"$f":"IFERROR(INDEX(Table1[Pin],1/(1/SUMPRODUCT((Table1[Reps]=RIGHT(INDEX(Table5[#Headers],coln),2)*1)*(Table1[Name]=Table5[[#This Row],[Name]])*Table1[Bnk]))),\"\")","v":""},{"$f":"IFERROR(INDEX(Table1[Pin],1/(1/SUMPRODUCT((Table1[Reps]=RIGHT(INDEX(Table5[#Headers],coln),2)*1)*(Table1[Name]=Table5[[#This Row],[Name]])*Table1[Bnk]))),\"\")","v":""},{"$f":"[Pin01]","v":"K1"},{"$f":"CONCATENATE([Pin14],IF([Pin02]=\"\",\"\",\", \"&[Pin02]))","v":"K1"},{"$f":"CONCATENATE([Pin15],IF([Pin03]=\"\",\"\",\", \"&[Pin03]))","v":"K1"},{"$f":"CONCATENATE([Pin16],IF([Pin04]=\"\",\"\",\", \"&[Pin04]))","v":"K1"},{"$f":"CONCATENATE([Pin17],IF([Pin05]=\"\",\"\",\", \"&[Pin05]))","v":"K1"},{"$f":"CONCATENATE([Pin18],IF([Pin06]=\"\",\"\",\", \"&[Pin06]))","v":"K1"},{"$f":"CONCATENATE([Pin19],IF([Pin07]=\"\",\"\",\", \"&[Pin07]))","v":"K1"},{"$f":"CONCATENATE([Pin20],IF([Pin08]=\"\",\"\",\", \"&[Pin08]))","v":"K1"},{"$f":"CONCATENATE([Pin21],IF([Pin09]=\"\",\"\",\", \"&[Pin09]))","v":"K1"},{"$f":"CONCATENATE([Pin22],IF([Pin10]=\"\",\"\",\", \"&[Pin10]))","v":"K1"},{"$f":"CONCATENATE([Pin23],IF([Pin11]=\"\",\"\",\", \"&[Pin11]))","v":"K1"},{"$f":"CONCATENATE([Pin24],IF([Pin12]=\"\",\"\",\", \"&[Pin12]))","v":"K1"},{"$f":"CONCATENATE([Pin25],IF([Pin13]=\"\",\"\",\", \"&[Pin13]))","v":"K1"},{"$f":"IFERROR(INDEX(Table1[InOut],1/(1/SUMPRODUCT((Table1[Reps]=1)*(Table1[Name]=Table5[[#This Row],[Name]])*Table1[Seq]))),\"\")","v":"I/O"},{"$f":"IFERROR(INDEX(Table1[Level],1/(1/SUMPRODUCT((Table1[Reps]=1)*(Table1[Name]=Table5[[#This Row],[Name]])*Table1[Seq]))),\"\")","v":"TTL"},{"$f":"IFERROR(INDEX(Table1[Func],1/(1/SUMPRODUCT((Table1[Reps]=1)*(Table1[Name]=Table5[[#This Row],[Name]])*Table1[Seq]))),\"\")","v":"GPIOportGbit0."}]
[null,null,"G2","PD1","I/O","TTL","GPIOportDbit1.",{"$f":"COUNTIF(INDEX([Name],1):Table1[[#This Row],[Name]],[Name])","v":1},{"$f":"IF(ISTEXT([Pin]),[Seq],INDEX([Bnk],[Seq]-1))","v":75},75,null,null,"PG1",{"$f":"IFERROR(INDEX(Table1[Pin],1/(1/SUMPRODUCT((Table1[Reps]=RIGHT(INDEX(Table5[#Headers],coln),2)*1)*(Table1[Name]=Table5[[#This Row],[Name]])*Table1[Bnk]))),\"\")","v":"K2"},{"$f":"IFERROR(INDEX(Table1[Pin],1/(1/SUMPRODUCT((Table1[Reps]=RIGHT(INDEX(Table5[#Headers],coln),2)*1)*(Table1[Name]=Table5[[#This Row],[Name]])*Table1[Bnk]))),\"\")","v":""},{"$f":"IFERROR(INDEX(Table1[Pin],1/(1/SUMPRODUCT((Table1[Reps]=RIGHT(INDEX(Table5[#Headers],coln),2)*1)*(Table1[Name]=Table5[[#This Row],[Name]])*Table1[Bnk]))),\"\")","v":""},{"$f":"IFERROR(INDEX(Table1[Pin],1/(1/SUMPRODUCT((Table1[Reps]=RIGHT(INDEX(Table5[#Headers],coln),2)*1)*(Table1[Name]=Table5[[#This Row],[Name]])*Table1[Bnk]))),\"\")","v":""},{"$f":"IFERROR(INDEX(Table1[Pin],1/(1/SUMPRODUCT((Table1[Reps]=RIGHT(INDEX(Table5[#Headers],coln),2)*1)*(Table1[Name]=Table5[[#This Row],[Name]])*Table1[Bnk]))),\"\")","v":""},{"$f":"IFERROR(INDEX(Table1[Pin],1/(1/SUMPRODUCT((Table1[Reps]=RIGHT(INDEX(Table5[#Headers],coln),2)*1)*(Table1[Name]=Table5[[#This Row],[Name]])*Table1[Bnk]))),\"\")","v":""},{"$f":"IFERROR(INDEX(Table1[Pin],1/(1/SUMPRODUCT((Table1[Reps]=RIGHT(INDEX(Table5[#Headers],coln),2)*1)*(Table1[Name]=Table5[[#This Row],[Name]])*Table1[Bnk]))),\"\")","v":""},{"$f":"IFERROR(INDEX(Table1[Pin],1/(1/SUMPRODUCT((Table1[Reps]=RIGHT(INDEX(Table5[#Headers],coln),2)*1)*(Table1[Name]=Table5[[#This Row],[Name]])*Table1[Bnk]))),\"\")","v":""},{"$f":"IFERROR(INDEX(Table1[Pin],1/(1/SUMPRODUCT((Table1[Reps]=RIGHT(INDEX(Table5[#Headers],coln),2)*1)*(Table1[Name]=Table5[[#This Row],[Name]])*Table1[Bnk]))),\"\")","v":""},{"$f":"IFERROR(INDEX(Table1[Pin],1/(1/SUMPRODUCT((Table1[Reps]=RIGHT(INDEX(Table5[#Headers],coln),2)*1)*(Table1[Name]=Table5[[#This Row],[Name]])*Table1[Bnk]))),\"\")","v":""},{"$f":"IFERROR(INDEX(Table1[Pin],1/(1/SUMPRODUCT((Table1[Reps]=RIGHT(INDEX(Table5[#Headers],coln),2)*1)*(Table1[Name]=Table5[[#This Row],[Name]])*Table1[Bnk]))),\"\")","v":""},{"$f":"IFERROR(INDEX(Table1[Pin],1/(1/SUMPRODUCT((Table1[Reps]=RIGHT(INDEX(Table5[#Headers],coln),2)*1)*(Table1[Name]=Table5[[#This Row],[Name]])*Table1[Bnk]))),\"\")","v":""},{"$f":"IFERROR(INDEX(Table1[Pin],1/(1/SUMPRODUCT((Table1[Reps]=RIGHT(INDEX(Table5[#Headers],coln),2)*1)*(Table1[Name]=Table5[[#This Row],[Name]])*Table1[Bnk]))),\"\")","v":""},{"$f":"[Pin01]","v":"K2"},{"$f":"CONCATENATE([Pin14],IF([Pin02]=\"\",\"\",\", \"&[Pin02]))","v":"K2"},{"$f":"CONCATENATE([Pin15],IF([Pin03]=\"\",\"\",\", \"&[Pin03]))","v":"K2"},{"$f":"CONCATENATE([Pin16],IF([Pin04]=\"\",\"\",\", \"&[Pin04]))","v":"K2"},{"$f":"CONCATENATE([Pin17],IF([Pin05]=\"\",\"\",\", \"&[Pin05]))","v":"K2"},{"$f":"CONCATENATE([Pin18],IF([Pin06]=\"\",\"\",\", \"&[Pin06]))","v":"K2"},{"$f":"CONCATENATE([Pin19],IF([Pin07]=\"\",\"\",\", \"&[Pin07]))","v":"K2"},{"$f":"CONCATENATE([Pin20],IF([Pin08]=\"\",\"\",\", \"&[Pin08]))","v":"K2"},{"$f":"CONCATENATE([Pin21],IF([Pin09]=\"\",\"\",\", \"&[Pin09]))","v":"K2"},{"$f":"CONCATENATE([Pin22],IF([Pin10]=\"\",\"\",\", \"&[Pin10]))","v":"K2"},{"$f":"CONCATENATE([Pin23],IF([Pin11]=\"\",\"\",\", \"&[Pin11]))","v":"K2"},{"$f":"CONCATENATE([Pin24],IF([Pin12]=\"\",\"\",\", \"&[Pin12]))","v":"K2"},{"$f":"CONCATENATE([Pin25],IF([Pin13]=\"\",\"\",\", \"&[Pin13]))","v":"K2"},{"$f":"IFERROR(INDEX(Table1[InOut],1/(1/SUMPRODUCT((Table1[Reps]=1)*(Table1[Name]=Table5[[#This Row],[Name]])*Table1[Seq]))),\"\")","v":"I/O"},{"$f":"IFERROR(INDEX(Table1[Level],1/(1/SUMPRODUCT((Table1[Reps]=1)*(Table1[Name]=Table5[[#This Row],[Name]])*Table1[Seq]))),\"\")","v":"TTL"},{"$f":"IFERROR(INDEX(Table1[Func],1/(1/SUMPRODUCT((Table1[Reps]=1)*(Table1[Name]=Table5[[#This Row],[Name]])*Table1[Seq]))),\"\")","v":"GPIOportGbit1."}]
[null,null,"G3","VDD25","-","Power","Positivesupplyformostofthelogicfunction,includingthe",{"$f":"COUNTIF(INDEX([Name],1):Table1[[#This Row],[Name]],[Name])","v":4},{"$f":"IF(ISTEXT([Pin]),[Seq],INDEX([Bnk],[Seq]-1))","v":76},76,null,null,"RST",{"$f":"IFERROR(INDEX(Table1[Pin],1/(1/SUMPRODUCT((Table1[Reps]=RIGHT(INDEX(Table5[#Headers],coln),2)*1)*(Table1[Name]=Table5[[#This Row],[Name]])*Table1[Bnk]))),\"\")","v":"H11"},{"$f":"IFERROR(INDEX(Table1[Pin],1/(1/SUMPRODUCT((Table1[Reps]=RIGHT(INDEX(Table5[#Headers],coln),2)*1)*(Table1[Name]=Table5[[#This Row],[Name]])*Table1[Bnk]))),\"\")","v":""},{"$f":"IFERROR(INDEX(Table1[Pin],1/(1/SUMPRODUCT((Table1[Reps]=RIGHT(INDEX(Table5[#Headers],coln),2)*1)*(Table1[Name]=Table5[[#This Row],[Name]])*Table1[Bnk]))),\"\")","v":""},{"$f":"IFERROR(INDEX(Table1[Pin],1/(1/SUMPRODUCT((Table1[Reps]=RIGHT(INDEX(Table5[#Headers],coln),2)*1)*(Table1[Name]=Table5[[#This Row],[Name]])*Table1[Bnk]))),\"\")","v":""},{"$f":"IFERROR(INDEX(Table1[Pin],1/(1/SUMPRODUCT((Table1[Reps]=RIGHT(INDEX(Table5[#Headers],coln),2)*1)*(Table1[Name]=Table5[[#This Row],[Name]])*Table1[Bnk]))),\"\")","v":""},{"$f":"IFERROR(INDEX(Table1[Pin],1/(1/SUMPRODUCT((Table1[Reps]=RIGHT(INDEX(Table5[#Headers],coln),2)*1)*(Table1[Name]=Table5[[#This Row],[Name]])*Table1[Bnk]))),\"\")","v":""},{"$f":"IFERROR(INDEX(Table1[Pin],1/(1/SUMPRODUCT((Table1[Reps]=RIGHT(INDEX(Table5[#Headers],coln),2)*1)*(Table1[Name]=Table5[[#This Row],[Name]])*Table1[Bnk]))),\"\")","v":""},{"$f":"IFERROR(INDEX(Table1[Pin],1/(1/SUMPRODUCT((Table1[Reps]=RIGHT(INDEX(Table5[#Headers],coln),2)*1)*(Table1[Name]=Table5[[#This Row],[Name]])*Table1[Bnk]))),\"\")","v":""},{"$f":"IFERROR(INDEX(Table1[Pin],1/(1/SUMPRODUCT((Table1[Reps]=RIGHT(INDEX(Table5[#Headers],coln),2)*1)*(Table1[Name]=Table5[[#This Row],[Name]])*Table1[Bnk]))),\"\")","v":""},{"$f":"IFERROR(INDEX(Table1[Pin],1/(1/SUMPRODUCT((Table1[Reps]=RIGHT(INDEX(Table5[#Headers],coln),2)*1)*(Table1[Name]=Table5[[#This Row],[Name]])*Table1[Bnk]))),\"\")","v":""},{"$f":"IFERROR(INDEX(Table1[Pin],1/(1/SUMPRODUCT((Table1[Reps]=RIGHT(INDEX(Table5[#Headers],coln),2)*1)*(Table1[Name]=Table5[[#This Row],[Name]])*Table1[Bnk]))),\"\")","v":""},{"$f":"IFERROR(INDEX(Table1[Pin],1/(1/SUMPRODUCT((Table1[Reps]=RIGHT(INDEX(Table5[#Headers],coln),2)*1)*(Table1[Name]=Table5[[#This Row],[Name]])*Table1[Bnk]))),\"\")","v":""},{"$f":"IFERROR(INDEX(Table1[Pin],1/(1/SUMPRODUCT((Table1[Reps]=RIGHT(INDEX(Table5[#Headers],coln),2)*1)*(Table1[Name]=Table5[[#This Row],[Name]])*Table1[Bnk]))),\"\")","v":""},{"$f":"[Pin01]","v":"H11"},{"$f":"CONCATENATE([Pin14],IF([Pin02]=\"\",\"\",\", \"&[Pin02]))","v":"H11"},{"$f":"CONCATENATE([Pin15],IF([Pin03]=\"\",\"\",\", \"&[Pin03]))","v":"H11"},{"$f":"CONCATENATE([Pin16],IF([Pin04]=\"\",\"\",\", \"&[Pin04]))","v":"H11"},{"$f":"CONCATENATE([Pin17],IF([Pin05]=\"\",\"\",\", \"&[Pin05]))","v":"H11"},{"$f":"CONCATENATE([Pin18],IF([Pin06]=\"\",\"\",\", \"&[Pin06]))","v":"H11"},{"$f":"CONCATENATE([Pin19],IF([Pin07]=\"\",\"\",\", \"&[Pin07]))","v":"H11"},{"$f":"CONCATENATE([Pin20],IF([Pin08]=\"\",\"\",\", \"&[Pin08]))","v":"H11"},{"$f":"CONCATENATE([Pin21],IF([Pin09]=\"\",\"\",\", \"&[Pin09]))","v":"H11"},{"$f":"CONCATENATE([Pin22],IF([Pin10]=\"\",\"\",\", \"&[Pin10]))","v":"H11"},{"$f":"CONCATENATE([Pin23],IF([Pin11]=\"\",\"\",\", \"&[Pin11]))","v":"H11"},{"$f":"CONCATENATE([Pin24],IF([Pin12]=\"\",\"\",\", \"&[Pin12]))","v":"H11"},{"$f":"CONCATENATE([Pin25],IF([Pin13]=\"\",\"\",\", \"&[Pin13]))","v":"H11"},{"$f":"IFERROR(INDEX(Table1[InOut],1/(1/SUMPRODUCT((Table1[Reps]=1)*(Table1[Name]=Table5[[#This Row],[Name]])*Table1[Seq]))),\"\")","v":"I"},{"$f":"IFERROR(INDEX(Table1[Level],1/(1/SUMPRODUCT((Table1[Reps]=1)*(Table1[Name]=Table5[[#This Row],[Name]])*Table1[Seq]))),\"\")","v":"TTL"},{"$f":"IFERROR(INDEX(Table1[Func],1/(1/SUMPRODUCT((Table1[Reps]=1)*(Table1[Name]=Table5[[#This Row],[Name]])*Table1[Seq]))),\"\")","v":"Systemresetinput."}]
[null,null,"G10","VDD33","-","Power","PositivesupplyforI/Oandsomelogic.",{"$f":"COUNTIF(INDEX([Name],1):Table1[[#This Row],[Name]],[Name])","v":2},{"$f":"IF(ISTEXT([Pin]),[Seq],INDEX([Bnk],[Seq]-1))","v":77},77,null,null,"RXIN",{"$f":"IFERROR(INDEX(Table1[Pin],1/(1/SUMPRODUCT((Table1[Reps]=RIGHT(INDEX(Table5[#Headers],coln),2)*1)*(Table1[Name]=Table5[[#This Row],[Name]])*Table1[Bnk]))),\"\")","v":"L7"},{"$f":"IFERROR(INDEX(Table1[Pin],1/(1/SUMPRODUCT((Table1[Reps]=RIGHT(INDEX(Table5[#Headers],coln),2)*1)*(Table1[Name]=Table5[[#This Row],[Name]])*Table1[Bnk]))),\"\")","v":""},{"$f":"IFERROR(INDEX(Table1[Pin],1/(1/SUMPRODUCT((Table1[Reps]=RIGHT(INDEX(Table5[#Headers],coln),2)*1)*(Table1[Name]=Table5[[#This Row],[Name]])*Table1[Bnk]))),\"\")","v":""},{"$f":"IFERROR(INDEX(Table1[Pin],1/(1/SUMPRODUCT((Table1[Reps]=RIGHT(INDEX(Table5[#Headers],coln),2)*1)*(Table1[Name]=Table5[[#This Row],[Name]])*Table1[Bnk]))),\"\")","v":""},{"$f":"IFERROR(INDEX(Table1[Pin],1/(1/SUMPRODUCT((Table1[Reps]=RIGHT(INDEX(Table5[#Headers],coln),2)*1)*(Table1[Name]=Table5[[#This Row],[Name]])*Table1[Bnk]))),\"\")","v":""},{"$f":"IFERROR(INDEX(Table1[Pin],1/(1/SUMPRODUCT((Table1[Reps]=RIGHT(INDEX(Table5[#Headers],coln),2)*1)*(Table1[Name]=Table5[[#This Row],[Name]])*Table1[Bnk]))),\"\")","v":""},{"$f":"IFERROR(INDEX(Table1[Pin],1/(1/SUMPRODUCT((Table1[Reps]=RIGHT(INDEX(Table5[#Headers],coln),2)*1)*(Table1[Name]=Table5[[#This Row],[Name]])*Table1[Bnk]))),\"\")","v":""},{"$f":"IFERROR(INDEX(Table1[Pin],1/(1/SUMPRODUCT((Table1[Reps]=RIGHT(INDEX(Table5[#Headers],coln),2)*1)*(Table1[Name]=Table5[[#This Row],[Name]])*Table1[Bnk]))),\"\")","v":""},{"$f":"IFERROR(INDEX(Table1[Pin],1/(1/SUMPRODUCT((Table1[Reps]=RIGHT(INDEX(Table5[#Headers],coln),2)*1)*(Table1[Name]=Table5[[#This Row],[Name]])*Table1[Bnk]))),\"\")","v":""},{"$f":"IFERROR(INDEX(Table1[Pin],1/(1/SUMPRODUCT((Table1[Reps]=RIGHT(INDEX(Table5[#Headers],coln),2)*1)*(Table1[Name]=Table5[[#This Row],[Name]])*Table1[Bnk]))),\"\")","v":""},{"$f":"IFERROR(INDEX(Table1[Pin],1/(1/SUMPRODUCT((Table1[Reps]=RIGHT(INDEX(Table5[#Headers],coln),2)*1)*(Table1[Name]=Table5[[#This Row],[Name]])*Table1[Bnk]))),\"\")","v":""},{"$f":"IFERROR(INDEX(Table1[Pin],1/(1/SUMPRODUCT((Table1[Reps]=RIGHT(INDEX(Table5[#Headers],coln),2)*1)*(Table1[Name]=Table5[[#This Row],[Name]])*Table1[Bnk]))),\"\")","v":""},{"$f":"IFERROR(INDEX(Table1[Pin],1/(1/SUMPRODUCT((Table1[Reps]=RIGHT(INDEX(Table5[#Headers],coln),2)*1)*(Table1[Name]=Table5[[#This Row],[Name]])*Table1[Bnk]))),\"\")","v":""},{"$f":"[Pin01]","v":"L7"},{"$f":"CONCATENATE([Pin14],IF([Pin02]=\"\",\"\",\", \"&[Pin02]))","v":"L7"},{"$f":"CONCATENATE([Pin15],IF([Pin03]=\"\",\"\",\", \"&[Pin03]))","v":"L7"},{"$f":"CONCATENATE([Pin16],IF([Pin04]=\"\",\"\",\", \"&[Pin04]))","v":"L7"},{"$f":"CONCATENATE([Pin17],IF([Pin05]=\"\",\"\",\", \"&[Pin05]))","v":"L7"},{"$f":"CONCATENATE([Pin18],IF([Pin06]=\"\",\"\",\", \"&[Pin06]))","v":"L7"},{"$f":"CONCATENATE([Pin19],IF([Pin07]=\"\",\"\",\", \"&[Pin07]))","v":"L7"},{"$f":"CONCATENATE([Pin20],IF([Pin08]=\"\",\"\",\", \"&[Pin08]))","v":"L7"},{"$f":"CONCATENATE([Pin21],IF([Pin09]=\"\",\"\",\", \"&[Pin09]))","v":"L7"},{"$f":"CONCATENATE([Pin22],IF([Pin10]=\"\",\"\",\", \"&[Pin10]))","v":"L7"},{"$f":"CONCATENATE([Pin23],IF([Pin11]=\"\",\"\",\", \"&[Pin11]))","v":"L7"},{"$f":"CONCATENATE([Pin24],IF([Pin12]=\"\",\"\",\", \"&[Pin12]))","v":"L7"},{"$f":"CONCATENATE([Pin25],IF([Pin13]=\"\",\"\",\", \"&[Pin13]))","v":"L7"},{"$f":"IFERROR(INDEX(Table1[InOut],1/(1/SUMPRODUCT((Table1[Reps]=1)*(Table1[Name]=Table5[[#This Row],[Name]])*Table1[Seq]))),\"\")","v":"I"},{"$f":"IFERROR(INDEX(Table1[Level],1/(1/SUMPRODUCT((Table1[Reps]=1)*(Table1[Name]=Table5[[#This Row],[Name]])*Table1[Seq]))),\"\")","v":"Analog"},{"$f":"IFERROR(INDEX(Table1[Func],1/(1/SUMPRODUCT((Table1[Reps]=1)*(Table1[Name]=Table5[[#This Row],[Name]])*Table1[Seq]))),\"\")","v":"RXINoftheEthernetPHY."}]
[null,null,"G11","VDD33","-","Power","PositivesupplyforI/Oandsomelogic.",{"$f":"COUNTIF(INDEX([Name],1):Table1[[#This Row],[Name]],[Name])","v":3},{"$f":"IF(ISTEXT([Pin]),[Seq],INDEX([Bnk],[Seq]-1))","v":78},78,null,null,"RXIP",{"$f":"IFERROR(INDEX(Table1[Pin],1/(1/SUMPRODUCT((Table1[Reps]=RIGHT(INDEX(Table5[#Headers],coln),2)*1)*(Table1[Name]=Table5[[#This Row],[Name]])*Table1[Bnk]))),\"\")","v":"M7"},{"$f":"IFERROR(INDEX(Table1[Pin],1/(1/SUMPRODUCT((Table1[Reps]=RIGHT(INDEX(Table5[#Headers],coln),2)*1)*(Table1[Name]=Table5[[#This Row],[Name]])*Table1[Bnk]))),\"\")","v":""},{"$f":"IFERROR(INDEX(Table1[Pin],1/(1/SUMPRODUCT((Table1[Reps]=RIGHT(INDEX(Table5[#Headers],coln),2)*1)*(Table1[Name]=Table5[[#This Row],[Name]])*Table1[Bnk]))),\"\")","v":""},{"$f":"IFERROR(INDEX(Table1[Pin],1/(1/SUMPRODUCT((Table1[Reps]=RIGHT(INDEX(Table5[#Headers],coln),2)*1)*(Table1[Name]=Table5[[#This Row],[Name]])*Table1[Bnk]))),\"\")","v":""},{"$f":"IFERROR(INDEX(Table1[Pin],1/(1/SUMPRODUCT((Table1[Reps]=RIGHT(INDEX(Table5[#Headers],coln),2)*1)*(Table1[Name]=Table5[[#This Row],[Name]])*Table1[Bnk]))),\"\")","v":""},{"$f":"IFERROR(INDEX(Table1[Pin],1/(1/SUMPRODUCT((Table1[Reps]=RIGHT(INDEX(Table5[#Headers],coln),2)*1)*(Table1[Name]=Table5[[#This Row],[Name]])*Table1[Bnk]))),\"\")","v":""},{"$f":"IFERROR(INDEX(Table1[Pin],1/(1/SUMPRODUCT((Table1[Reps]=RIGHT(INDEX(Table5[#Headers],coln),2)*1)*(Table1[Name]=Table5[[#This Row],[Name]])*Table1[Bnk]))),\"\")","v":""},{"$f":"IFERROR(INDEX(Table1[Pin],1/(1/SUMPRODUCT((Table1[Reps]=RIGHT(INDEX(Table5[#Headers],coln),2)*1)*(Table1[Name]=Table5[[#This Row],[Name]])*Table1[Bnk]))),\"\")","v":""},{"$f":"IFERROR(INDEX(Table1[Pin],1/(1/SUMPRODUCT((Table1[Reps]=RIGHT(INDEX(Table5[#Headers],coln),2)*1)*(Table1[Name]=Table5[[#This Row],[Name]])*Table1[Bnk]))),\"\")","v":""},{"$f":"IFERROR(INDEX(Table1[Pin],1/(1/SUMPRODUCT((Table1[Reps]=RIGHT(INDEX(Table5[#Headers],coln),2)*1)*(Table1[Name]=Table5[[#This Row],[Name]])*Table1[Bnk]))),\"\")","v":""},{"$f":"IFERROR(INDEX(Table1[Pin],1/(1/SUMPRODUCT((Table1[Reps]=RIGHT(INDEX(Table5[#Headers],coln),2)*1)*(Table1[Name]=Table5[[#This Row],[Name]])*Table1[Bnk]))),\"\")","v":""},{"$f":"IFERROR(INDEX(Table1[Pin],1/(1/SUMPRODUCT((Table1[Reps]=RIGHT(INDEX(Table5[#Headers],coln),2)*1)*(Table1[Name]=Table5[[#This Row],[Name]])*Table1[Bnk]))),\"\")","v":""},{"$f":"IFERROR(INDEX(Table1[Pin],1/(1/SUMPRODUCT((Table1[Reps]=RIGHT(INDEX(Table5[#Headers],coln),2)*1)*(Table1[Name]=Table5[[#This Row],[Name]])*Table1[Bnk]))),\"\")","v":""},{"$f":"[Pin01]","v":"M7"},{"$f":"CONCATENATE([Pin14],IF([Pin02]=\"\",\"\",\", \"&[Pin02]))","v":"M7"},{"$f":"CONCATENATE([Pin15],IF([Pin03]=\"\",\"\",\", \"&[Pin03]))","v":"M7"},{"$f":"CONCATENATE([Pin16],IF([Pin04]=\"\",\"\",\", \"&[Pin04]))","v":"M7"},{"$f":"CONCATENATE([Pin17],IF([Pin05]=\"\",\"\",\", \"&[Pin05]))","v":"M7"},{"$f":"CONCATENATE([Pin18],IF([Pin06]=\"\",\"\",\", \"&[Pin06]))","v":"M7"},{"$f":"CONCATENATE([Pin19],IF([Pin07]=\"\",\"\",\", \"&[Pin07]))","v":"M7"},{"$f":"CONCATENATE([Pin20],IF([Pin08]=\"\",\"\",\", \"&[Pin08]))","v":"M7"},{"$f":"CONCATENATE([Pin21],IF([Pin09]=\"\",\"\",\", \"&[Pin09]))","v":"M7"},{"$f":"CONCATENATE([Pin22],IF([Pin10]=\"\",\"\",\", \"&[Pin10]))","v":"M7"},{"$f":"CONCATENATE([Pin23],IF([Pin11]=\"\",\"\",\", \"&[Pin11]))","v":"M7"},{"$f":"CONCATENATE([Pin24],IF([Pin12]=\"\",\"\",\", \"&[Pin12]))","v":"M7"},{"$f":"CONCATENATE([Pin25],IF([Pin13]=\"\",\"\",\", \"&[Pin13]))","v":"M7"},{"$f":"IFERROR(INDEX(Table1[InOut],1/(1/SUMPRODUCT((Table1[Reps]=1)*(Table1[Name]=Table5[[#This Row],[Name]])*Table1[Seq]))),\"\")","v":"I"},{"$f":"IFERROR(INDEX(Table1[Level],1/(1/SUMPRODUCT((Table1[Reps]=1)*(Table1[Name]=Table5[[#This Row],[Name]])*Table1[Seq]))),\"\")","v":"Analog"},{"$f":"IFERROR(INDEX(Table1[Func],1/(1/SUMPRODUCT((Table1[Reps]=1)*(Table1[Name]=Table5[[#This Row],[Name]])*Table1[Seq]))),\"\")","v":"RXIPoftheEthernetPHY."}]
[null,null,"G12","VDD33","-","Power","PositivesupplyforI/Oandsomelogic.",{"$f":"COUNTIF(INDEX([Name],1):Table1[[#This Row],[Name]],[Name])","v":4},{"$f":"IF(ISTEXT([Pin]),[Seq],INDEX([Bnk],[Seq]-1))","v":79},79,null,null,"SSI0Clk",{"$f":"IFERROR(INDEX(Table1[Pin],1/(1/SUMPRODUCT((Table1[Reps]=RIGHT(INDEX(Table5[#Headers],coln),2)*1)*(Table1[Name]=Table5[[#This Row],[Name]])*Table1[Bnk]))),\"\")","v":"M4"},{"$f":"IFERROR(INDEX(Table1[Pin],1/(1/SUMPRODUCT((Table1[Reps]=RIGHT(INDEX(Table5[#Headers],coln),2)*1)*(Table1[Name]=Table5[[#This Row],[Name]])*Table1[Bnk]))),\"\")","v":""},{"$f":"IFERROR(INDEX(Table1[Pin],1/(1/SUMPRODUCT((Table1[Reps]=RIGHT(INDEX(Table5[#Headers],coln),2)*1)*(Table1[Name]=Table5[[#This Row],[Name]])*Table1[Bnk]))),\"\")","v":""},{"$f":"IFERROR(INDEX(Table1[Pin],1/(1/SUMPRODUCT((Table1[Reps]=RIGHT(INDEX(Table5[#Headers],coln),2)*1)*(Table1[Name]=Table5[[#This Row],[Name]])*Table1[Bnk]))),\"\")","v":""},{"$f":"IFERROR(INDEX(Table1[Pin],1/(1/SUMPRODUCT((Table1[Reps]=RIGHT(INDEX(Table5[#Headers],coln),2)*1)*(Table1[Name]=Table5[[#This Row],[Name]])*Table1[Bnk]))),\"\")","v":""},{"$f":"IFERROR(INDEX(Table1[Pin],1/(1/SUMPRODUCT((Table1[Reps]=RIGHT(INDEX(Table5[#Headers],coln),2)*1)*(Table1[Name]=Table5[[#This Row],[Name]])*Table1[Bnk]))),\"\")","v":""},{"$f":"IFERROR(INDEX(Table1[Pin],1/(1/SUMPRODUCT((Table1[Reps]=RIGHT(INDEX(Table5[#Headers],coln),2)*1)*(Table1[Name]=Table5[[#This Row],[Name]])*Table1[Bnk]))),\"\")","v":""},{"$f":"IFERROR(INDEX(Table1[Pin],1/(1/SUMPRODUCT((Table1[Reps]=RIGHT(INDEX(Table5[#Headers],coln),2)*1)*(Table1[Name]=Table5[[#This Row],[Name]])*Table1[Bnk]))),\"\")","v":""},{"$f":"IFERROR(INDEX(Table1[Pin],1/(1/SUMPRODUCT((Table1[Reps]=RIGHT(INDEX(Table5[#Headers],coln),2)*1)*(Table1[Name]=Table5[[#This Row],[Name]])*Table1[Bnk]))),\"\")","v":""},{"$f":"IFERROR(INDEX(Table1[Pin],1/(1/SUMPRODUCT((Table1[Reps]=RIGHT(INDEX(Table5[#Headers],coln),2)*1)*(Table1[Name]=Table5[[#This Row],[Name]])*Table1[Bnk]))),\"\")","v":""},{"$f":"IFERROR(INDEX(Table1[Pin],1/(1/SUMPRODUCT((Table1[Reps]=RIGHT(INDEX(Table5[#Headers],coln),2)*1)*(Table1[Name]=Table5[[#This Row],[Name]])*Table1[Bnk]))),\"\")","v":""},{"$f":"IFERROR(INDEX(Table1[Pin],1/(1/SUMPRODUCT((Table1[Reps]=RIGHT(INDEX(Table5[#Headers],coln),2)*1)*(Table1[Name]=Table5[[#This Row],[Name]])*Table1[Bnk]))),\"\")","v":""},{"$f":"IFERROR(INDEX(Table1[Pin],1/(1/SUMPRODUCT((Table1[Reps]=RIGHT(INDEX(Table5[#Headers],coln),2)*1)*(Table1[Name]=Table5[[#This Row],[Name]])*Table1[Bnk]))),\"\")","v":""},{"$f":"[Pin01]","v":"M4"},{"$f":"CONCATENATE([Pin14],IF([Pin02]=\"\",\"\",\", \"&[Pin02]))","v":"M4"},{"$f":"CONCATENATE([Pin15],IF([Pin03]=\"\",\"\",\", \"&[Pin03]))","v":"M4"},{"$f":"CONCATENATE([Pin16],IF([Pin04]=\"\",\"\",\", \"&[Pin04]))","v":"M4"},{"$f":"CONCATENATE([Pin17],IF([Pin05]=\"\",\"\",\", \"&[Pin05]))","v":"M4"},{"$f":"CONCATENATE([Pin18],IF([Pin06]=\"\",\"\",\", \"&[Pin06]))","v":"M4"},{"$f":"CONCATENATE([Pin19],IF([Pin07]=\"\",\"\",\", \"&[Pin07]))","v":"M4"},{"$f":"CONCATENATE([Pin20],IF([Pin08]=\"\",\"\",\", \"&[Pin08]))","v":"M4"},{"$f":"CONCATENATE([Pin21],IF([Pin09]=\"\",\"\",\", \"&[Pin09]))","v":"M4"},{"$f":"CONCATENATE([Pin22],IF([Pin10]=\"\",\"\",\", \"&[Pin10]))","v":"M4"},{"$f":"CONCATENATE([Pin23],IF([Pin11]=\"\",\"\",\", \"&[Pin11]))","v":"M4"},{"$f":"CONCATENATE([Pin24],IF([Pin12]=\"\",\"\",\", \"&[Pin12]))","v":"M4"},{"$f":"CONCATENATE([Pin25],IF([Pin13]=\"\",\"\",\", \"&[Pin13]))","v":"M4"},{"$f":"IFERROR(INDEX(Table1[InOut],1/(1/SUMPRODUCT((Table1[Reps]=1)*(Table1[Name]=Table5[[#This Row],[Name]])*Table1[Seq]))),\"\")","v":"I/O"},{"$f":"IFERROR(INDEX(Table1[Level],1/(1/SUMPRODUCT((Table1[Reps]=1)*(Table1[Name]=Table5[[#This Row],[Name]])*Table1[Seq]))),\"\")","v":"TTL"},{"$f":"IFERROR(INDEX(Table1[Func],1/(1/SUMPRODUCT((Table1[Reps]=1)*(Table1[Name]=Table5[[#This Row],[Name]])*Table1[Seq]))),\"\")","v":"SSImodule0clock."}]
[null,null,"H1","PD3","I/O","TTL","GPIOportDbit3.",{"$f":"COUNTIF(INDEX([Name],1):Table1[[#This Row],[Name]],[Name])","v":1},{"$f":"IF(ISTEXT([Pin]),[Seq],INDEX([Bnk],[Seq]-1))","v":80},80,null,null,"SSI0Fss",{"$f":"IFERROR(INDEX(Table1[Pin],1/(1/SUMPRODUCT((Table1[Reps]=RIGHT(INDEX(Table5[#Headers],coln),2)*1)*(Table1[Name]=Table5[[#This Row],[Name]])*Table1[Bnk]))),\"\")","v":"L4"},{"$f":"IFERROR(INDEX(Table1[Pin],1/(1/SUMPRODUCT((Table1[Reps]=RIGHT(INDEX(Table5[#Headers],coln),2)*1)*(Table1[Name]=Table5[[#This Row],[Name]])*Table1[Bnk]))),\"\")","v":""},{"$f":"IFERROR(INDEX(Table1[Pin],1/(1/SUMPRODUCT((Table1[Reps]=RIGHT(INDEX(Table5[#Headers],coln),2)*1)*(Table1[Name]=Table5[[#This Row],[Name]])*Table1[Bnk]))),\"\")","v":""},{"$f":"IFERROR(INDEX(Table1[Pin],1/(1/SUMPRODUCT((Table1[Reps]=RIGHT(INDEX(Table5[#Headers],coln),2)*1)*(Table1[Name]=Table5[[#This Row],[Name]])*Table1[Bnk]))),\"\")","v":""},{"$f":"IFERROR(INDEX(Table1[Pin],1/(1/SUMPRODUCT((Table1[Reps]=RIGHT(INDEX(Table5[#Headers],coln),2)*1)*(Table1[Name]=Table5[[#This Row],[Name]])*Table1[Bnk]))),\"\")","v":""},{"$f":"IFERROR(INDEX(Table1[Pin],1/(1/SUMPRODUCT((Table1[Reps]=RIGHT(INDEX(Table5[#Headers],coln),2)*1)*(Table1[Name]=Table5[[#This Row],[Name]])*Table1[Bnk]))),\"\")","v":""},{"$f":"IFERROR(INDEX(Table1[Pin],1/(1/SUMPRODUCT((Table1[Reps]=RIGHT(INDEX(Table5[#Headers],coln),2)*1)*(Table1[Name]=Table5[[#This Row],[Name]])*Table1[Bnk]))),\"\")","v":""},{"$f":"IFERROR(INDEX(Table1[Pin],1/(1/SUMPRODUCT((Table1[Reps]=RIGHT(INDEX(Table5[#Headers],coln),2)*1)*(Table1[Name]=Table5[[#This Row],[Name]])*Table1[Bnk]))),\"\")","v":""},{"$f":"IFERROR(INDEX(Table1[Pin],1/(1/SUMPRODUCT((Table1[Reps]=RIGHT(INDEX(Table5[#Headers],coln),2)*1)*(Table1[Name]=Table5[[#This Row],[Name]])*Table1[Bnk]))),\"\")","v":""},{"$f":"IFERROR(INDEX(Table1[Pin],1/(1/SUMPRODUCT((Table1[Reps]=RIGHT(INDEX(Table5[#Headers],coln),2)*1)*(Table1[Name]=Table5[[#This Row],[Name]])*Table1[Bnk]))),\"\")","v":""},{"$f":"IFERROR(INDEX(Table1[Pin],1/(1/SUMPRODUCT((Table1[Reps]=RIGHT(INDEX(Table5[#Headers],coln),2)*1)*(Table1[Name]=Table5[[#This Row],[Name]])*Table1[Bnk]))),\"\")","v":""},{"$f":"IFERROR(INDEX(Table1[Pin],1/(1/SUMPRODUCT((Table1[Reps]=RIGHT(INDEX(Table5[#Headers],coln),2)*1)*(Table1[Name]=Table5[[#This Row],[Name]])*Table1[Bnk]))),\"\")","v":""},{"$f":"IFERROR(INDEX(Table1[Pin],1/(1/SUMPRODUCT((Table1[Reps]=RIGHT(INDEX(Table5[#Headers],coln),2)*1)*(Table1[Name]=Table5[[#This Row],[Name]])*Table1[Bnk]))),\"\")","v":""},{"$f":"[Pin01]","v":"L4"},{"$f":"CONCATENATE([Pin14],IF([Pin02]=\"\",\"\",\", \"&[Pin02]))","v":"L4"},{"$f":"CONCATENATE([Pin15],IF([Pin03]=\"\",\"\",\", \"&[Pin03]))","v":"L4"},{"$f":"CONCATENATE([Pin16],IF([Pin04]=\"\",\"\",\", \"&[Pin04]))","v":"L4"},{"$f":"CONCATENATE([Pin17],IF([Pin05]=\"\",\"\",\", \"&[Pin05]))","v":"L4"},{"$f":"CONCATENATE([Pin18],IF([Pin06]=\"\",\"\",\", \"&[Pin06]))","v":"L4"},{"$f":"CONCATENATE([Pin19],IF([Pin07]=\"\",\"\",\", \"&[Pin07]))","v":"L4"},{"$f":"CONCATENATE([Pin20],IF([Pin08]=\"\",\"\",\", \"&[Pin08]))","v":"L4"},{"$f":"CONCATENATE([Pin21],IF([Pin09]=\"\",\"\",\", \"&[Pin09]))","v":"L4"},{"$f":"CONCATENATE([Pin22],IF([Pin10]=\"\",\"\",\", \"&[Pin10]))","v":"L4"},{"$f":"CONCATENATE([Pin23],IF([Pin11]=\"\",\"\",\", \"&[Pin11]))","v":"L4"},{"$f":"CONCATENATE([Pin24],IF([Pin12]=\"\",\"\",\", \"&[Pin12]))","v":"L4"},{"$f":"CONCATENATE([Pin25],IF([Pin13]=\"\",\"\",\", \"&[Pin13]))","v":"L4"},{"$f":"IFERROR(INDEX(Table1[InOut],1/(1/SUMPRODUCT((Table1[Reps]=1)*(Table1[Name]=Table5[[#This Row],[Name]])*Table1[Seq]))),\"\")","v":"I/O"},{"$f":"IFERROR(INDEX(Table1[Level],1/(1/SUMPRODUCT((Table1[Reps]=1)*(Table1[Name]=Table5[[#This Row],[Name]])*Table1[Seq]))),\"\")","v":"TTL"},{"$f":"IFERROR(INDEX(Table1[Func],1/(1/SUMPRODUCT((Table1[Reps]=1)*(Table1[Name]=Table5[[#This Row],[Name]])*Table1[Seq]))),\"\")","v":"SSImodule0frame."}]
[null,null,null,"U1Tx","O","TTL","UARTmodule1transmit.WheninIrDAmode,thissignalhasIrDA",{"$f":"COUNTIF(INDEX([Name],1):Table1[[#This Row],[Name]],[Name])","v":1},{"$f":"IF(ISTEXT([Pin]),[Seq],INDEX([Bnk],[Seq]-1))","v":80},81,null,null,"SSI0Rx",{"$f":"IFERROR(INDEX(Table1[Pin],1/(1/SUMPRODUCT((Table1[Reps]=RIGHT(INDEX(Table5[#Headers],coln),2)*1)*(Table1[Name]=Table5[[#This Row],[Name]])*Table1[Bnk]))),\"\")","v":"L5"},{"$f":"IFERROR(INDEX(Table1[Pin],1/(1/SUMPRODUCT((Table1[Reps]=RIGHT(INDEX(Table5[#Headers],coln),2)*1)*(Table1[Name]=Table5[[#This Row],[Name]])*Table1[Bnk]))),\"\")","v":""},{"$f":"IFERROR(INDEX(Table1[Pin],1/(1/SUMPRODUCT((Table1[Reps]=RIGHT(INDEX(Table5[#Headers],coln),2)*1)*(Table1[Name]=Table5[[#This Row],[Name]])*Table1[Bnk]))),\"\")","v":""},{"$f":"IFERROR(INDEX(Table1[Pin],1/(1/SUMPRODUCT((Table1[Reps]=RIGHT(INDEX(Table5[#Headers],coln),2)*1)*(Table1[Name]=Table5[[#This Row],[Name]])*Table1[Bnk]))),\"\")","v":""},{"$f":"IFERROR(INDEX(Table1[Pin],1/(1/SUMPRODUCT((Table1[Reps]=RIGHT(INDEX(Table5[#Headers],coln),2)*1)*(Table1[Name]=Table5[[#This Row],[Name]])*Table1[Bnk]))),\"\")","v":""},{"$f":"IFERROR(INDEX(Table1[Pin],1/(1/SUMPRODUCT((Table1[Reps]=RIGHT(INDEX(Table5[#Headers],coln),2)*1)*(Table1[Name]=Table5[[#This Row],[Name]])*Table1[Bnk]))),\"\")","v":""},{"$f":"IFERROR(INDEX(Table1[Pin],1/(1/SUMPRODUCT((Table1[Reps]=RIGHT(INDEX(Table5[#Headers],coln),2)*1)*(Table1[Name]=Table5[[#This Row],[Name]])*Table1[Bnk]))),\"\")","v":""},{"$f":"IFERROR(INDEX(Table1[Pin],1/(1/SUMPRODUCT((Table1[Reps]=RIGHT(INDEX(Table5[#Headers],coln),2)*1)*(Table1[Name]=Table5[[#This Row],[Name]])*Table1[Bnk]))),\"\")","v":""},{"$f":"IFERROR(INDEX(Table1[Pin],1/(1/SUMPRODUCT((Table1[Reps]=RIGHT(INDEX(Table5[#Headers],coln),2)*1)*(Table1[Name]=Table5[[#This Row],[Name]])*Table1[Bnk]))),\"\")","v":""},{"$f":"IFERROR(INDEX(Table1[Pin],1/(1/SUMPRODUCT((Table1[Reps]=RIGHT(INDEX(Table5[#Headers],coln),2)*1)*(Table1[Name]=Table5[[#This Row],[Name]])*Table1[Bnk]))),\"\")","v":""},{"$f":"IFERROR(INDEX(Table1[Pin],1/(1/SUMPRODUCT((Table1[Reps]=RIGHT(INDEX(Table5[#Headers],coln),2)*1)*(Table1[Name]=Table5[[#This Row],[Name]])*Table1[Bnk]))),\"\")","v":""},{"$f":"IFERROR(INDEX(Table1[Pin],1/(1/SUMPRODUCT((Table1[Reps]=RIGHT(INDEX(Table5[#Headers],coln),2)*1)*(Table1[Name]=Table5[[#This Row],[Name]])*Table1[Bnk]))),\"\")","v":""},{"$f":"IFERROR(INDEX(Table1[Pin],1/(1/SUMPRODUCT((Table1[Reps]=RIGHT(INDEX(Table5[#Headers],coln),2)*1)*(Table1[Name]=Table5[[#This Row],[Name]])*Table1[Bnk]))),\"\")","v":""},{"$f":"[Pin01]","v":"L5"},{"$f":"CONCATENATE([Pin14],IF([Pin02]=\"\",\"\",\", \"&[Pin02]))","v":"L5"},{"$f":"CONCATENATE([Pin15],IF([Pin03]=\"\",\"\",\", \"&[Pin03]))","v":"L5"},{"$f":"CONCATENATE([Pin16],IF([Pin04]=\"\",\"\",\", \"&[Pin04]))","v":"L5"},{"$f":"CONCATENATE([Pin17],IF([Pin05]=\"\",\"\",\", \"&[Pin05]))","v":"L5"},{"$f":"CONCATENATE([Pin18],IF([Pin06]=\"\",\"\",\", \"&[Pin06]))","v":"L5"},{"$f":"CONCATENATE([Pin19],IF([Pin07]=\"\",\"\",\", \"&[Pin07]))","v":"L5"},{"$f":"CONCATENATE([Pin20],IF([Pin08]=\"\",\"\",\", \"&[Pin08]))","v":"L5"},{"$f":"CONCATENATE([Pin21],IF([Pin09]=\"\",\"\",\", \"&[Pin09]))","v":"L5"},{"$f":"CONCATENATE([Pin22],IF([Pin10]=\"\",\"\",\", \"&[Pin10]))","v":"L5"},{"$f":"CONCATENATE([Pin23],IF([Pin11]=\"\",\"\",\", \"&[Pin11]))","v":"L5"},{"$f":"CONCATENATE([Pin24],IF([Pin12]=\"\",\"\",\", \"&[Pin12]))","v":"L5"},{"$f":"CONCATENATE([Pin25],IF([Pin13]=\"\",\"\",\", \"&[Pin13]))","v":"L5"},{"$f":"IFERROR(INDEX(Table1[InOut],1/(1/SUMPRODUCT((Table1[Reps]=1)*(Table1[Name]=Table5[[#This Row],[Name]])*Table1[Seq]))),\"\")","v":"I"},{"$f":"IFERROR(INDEX(Table1[Level],1/(1/SUMPRODUCT((Table1[Reps]=1)*(Table1[Name]=Table5[[#This Row],[Name]])*Table1[Seq]))),\"\")","v":"TTL"},{"$f":"IFERROR(INDEX(Table1[Func],1/(1/SUMPRODUCT((Table1[Reps]=1)*(Table1[Name]=Table5[[#This Row],[Name]])*Table1[Seq]))),\"\")","v":"SSImodule0receive."}]
[null,null,"H2","PD2","I/O","TTL","GPIOportDbit2.",{"$f":"COUNTIF(INDEX([Name],1):Table1[[#This Row],[Name]],[Name])","v":1},{"$f":"IF(ISTEXT([Pin]),[Seq],INDEX([Bnk],[Seq]-1))","v":82},82,null,null,"SSI0Tx",{"$f":"IFERROR(INDEX(Table1[Pin],1/(1/SUMPRODUCT((Table1[Reps]=RIGHT(INDEX(Table5[#Headers],coln),2)*1)*(Table1[Name]=Table5[[#This Row],[Name]])*Table1[Bnk]))),\"\")","v":"M5"},{"$f":"IFERROR(INDEX(Table1[Pin],1/(1/SUMPRODUCT((Table1[Reps]=RIGHT(INDEX(Table5[#Headers],coln),2)*1)*(Table1[Name]=Table5[[#This Row],[Name]])*Table1[Bnk]))),\"\")","v":""},{"$f":"IFERROR(INDEX(Table1[Pin],1/(1/SUMPRODUCT((Table1[Reps]=RIGHT(INDEX(Table5[#Headers],coln),2)*1)*(Table1[Name]=Table5[[#This Row],[Name]])*Table1[Bnk]))),\"\")","v":""},{"$f":"IFERROR(INDEX(Table1[Pin],1/(1/SUMPRODUCT((Table1[Reps]=RIGHT(INDEX(Table5[#Headers],coln),2)*1)*(Table1[Name]=Table5[[#This Row],[Name]])*Table1[Bnk]))),\"\")","v":""},{"$f":"IFERROR(INDEX(Table1[Pin],1/(1/SUMPRODUCT((Table1[Reps]=RIGHT(INDEX(Table5[#Headers],coln),2)*1)*(Table1[Name]=Table5[[#This Row],[Name]])*Table1[Bnk]))),\"\")","v":""},{"$f":"IFERROR(INDEX(Table1[Pin],1/(1/SUMPRODUCT((Table1[Reps]=RIGHT(INDEX(Table5[#Headers],coln),2)*1)*(Table1[Name]=Table5[[#This Row],[Name]])*Table1[Bnk]))),\"\")","v":""},{"$f":"IFERROR(INDEX(Table1[Pin],1/(1/SUMPRODUCT((Table1[Reps]=RIGHT(INDEX(Table5[#Headers],coln),2)*1)*(Table1[Name]=Table5[[#This Row],[Name]])*Table1[Bnk]))),\"\")","v":""},{"$f":"IFERROR(INDEX(Table1[Pin],1/(1/SUMPRODUCT((Table1[Reps]=RIGHT(INDEX(Table5[#Headers],coln),2)*1)*(Table1[Name]=Table5[[#This Row],[Name]])*Table1[Bnk]))),\"\")","v":""},{"$f":"IFERROR(INDEX(Table1[Pin],1/(1/SUMPRODUCT((Table1[Reps]=RIGHT(INDEX(Table5[#Headers],coln),2)*1)*(Table1[Name]=Table5[[#This Row],[Name]])*Table1[Bnk]))),\"\")","v":""},{"$f":"IFERROR(INDEX(Table1[Pin],1/(1/SUMPRODUCT((Table1[Reps]=RIGHT(INDEX(Table5[#Headers],coln),2)*1)*(Table1[Name]=Table5[[#This Row],[Name]])*Table1[Bnk]))),\"\")","v":""},{"$f":"IFERROR(INDEX(Table1[Pin],1/(1/SUMPRODUCT((Table1[Reps]=RIGHT(INDEX(Table5[#Headers],coln),2)*1)*(Table1[Name]=Table5[[#This Row],[Name]])*Table1[Bnk]))),\"\")","v":""},{"$f":"IFERROR(INDEX(Table1[Pin],1/(1/SUMPRODUCT((Table1[Reps]=RIGHT(INDEX(Table5[#Headers],coln),2)*1)*(Table1[Name]=Table5[[#This Row],[Name]])*Table1[Bnk]))),\"\")","v":""},{"$f":"IFERROR(INDEX(Table1[Pin],1/(1/SUMPRODUCT((Table1[Reps]=RIGHT(INDEX(Table5[#Headers],coln),2)*1)*(Table1[Name]=Table5[[#This Row],[Name]])*Table1[Bnk]))),\"\")","v":""},{"$f":"[Pin01]","v":"M5"},{"$f":"CONCATENATE([Pin14],IF([Pin02]=\"\",\"\",\", \"&[Pin02]))","v":"M5"},{"$f":"CONCATENATE([Pin15],IF([Pin03]=\"\",\"\",\", \"&[Pin03]))","v":"M5"},{"$f":"CONCATENATE([Pin16],IF([Pin04]=\"\",\"\",\", \"&[Pin04]))","v":"M5"},{"$f":"CONCATENATE([Pin17],IF([Pin05]=\"\",\"\",\", \"&[Pin05]))","v":"M5"},{"$f":"CONCATENATE([Pin18],IF([Pin06]=\"\",\"\",\", \"&[Pin06]))","v":"M5"},{"$f":"CONCATENATE([Pin19],IF([Pin07]=\"\",\"\",\", \"&[Pin07]))","v":"M5"},{"$f":"CONCATENATE([Pin20],IF([Pin08]=\"\",\"\",\", \"&[Pin08]))","v":"M5"},{"$f":"CONCATENATE([Pin21],IF([Pin09]=\"\",\"\",\", \"&[Pin09]))","v":"M5"},{"$f":"CONCATENATE([Pin22],IF([Pin10]=\"\",\"\",\", \"&[Pin10]))","v":"M5"},{"$f":"CONCATENATE([Pin23],IF([Pin11]=\"\",\"\",\", \"&[Pin11]))","v":"M5"},{"$f":"CONCATENATE([Pin24],IF([Pin12]=\"\",\"\",\", \"&[Pin12]))","v":"M5"},{"$f":"CONCATENATE([Pin25],IF([Pin13]=\"\",\"\",\", \"&[Pin13]))","v":"M5"},{"$f":"IFERROR(INDEX(Table1[InOut],1/(1/SUMPRODUCT((Table1[Reps]=1)*(Table1[Name]=Table5[[#This Row],[Name]])*Table1[Seq]))),\"\")","v":"O"},{"$f":"IFERROR(INDEX(Table1[Level],1/(1/SUMPRODUCT((Table1[Reps]=1)*(Table1[Name]=Table5[[#This Row],[Name]])*Table1[Seq]))),\"\")","v":"TTL"},{"$f":"IFERROR(INDEX(Table1[Func],1/(1/SUMPRODUCT((Table1[Reps]=1)*(Table1[Name]=Table5[[#This Row],[Name]])*Table1[Seq]))),\"\")","v":"SSImodule0transmit."}]
[null,null,null,"U1Rx","I","TTL","UARTmodule1receive.WheninIrDAmode,thissignalhasIrDA",{"$f":"COUNTIF(INDEX([Name],1):Table1[[#This Row],[Name]],[Name])","v":1},{"$f":"IF(ISTEXT([Pin]),[Seq],INDEX([Bnk],[Seq]-1))","v":82},83,null,null,"SSI1Clk",{"$f":"IFERROR(INDEX(Table1[Pin],1/(1/SUMPRODUCT((Table1[Reps]=RIGHT(INDEX(Table5[#Headers],coln),2)*1)*(Table1[Name]=Table5[[#This Row],[Name]])*Table1[Bnk]))),\"\")","v":"A11"},{"$f":"IFERROR(INDEX(Table1[Pin],1/(1/SUMPRODUCT((Table1[Reps]=RIGHT(INDEX(Table5[#Headers],coln),2)*1)*(Table1[Name]=Table5[[#This Row],[Name]])*Table1[Bnk]))),\"\")","v":""},{"$f":"IFERROR(INDEX(Table1[Pin],1/(1/SUMPRODUCT((Table1[Reps]=RIGHT(INDEX(Table5[#Headers],coln),2)*1)*(Table1[Name]=Table5[[#This Row],[Name]])*Table1[Bnk]))),\"\")","v":""},{"$f":"IFERROR(INDEX(Table1[Pin],1/(1/SUMPRODUCT((Table1[Reps]=RIGHT(INDEX(Table5[#Headers],coln),2)*1)*(Table1[Name]=Table5[[#This Row],[Name]])*Table1[Bnk]))),\"\")","v":""},{"$f":"IFERROR(INDEX(Table1[Pin],1/(1/SUMPRODUCT((Table1[Reps]=RIGHT(INDEX(Table5[#Headers],coln),2)*1)*(Table1[Name]=Table5[[#This Row],[Name]])*Table1[Bnk]))),\"\")","v":""},{"$f":"IFERROR(INDEX(Table1[Pin],1/(1/SUMPRODUCT((Table1[Reps]=RIGHT(INDEX(Table5[#Headers],coln),2)*1)*(Table1[Name]=Table5[[#This Row],[Name]])*Table1[Bnk]))),\"\")","v":""},{"$f":"IFERROR(INDEX(Table1[Pin],1/(1/SUMPRODUCT((Table1[Reps]=RIGHT(INDEX(Table5[#Headers],coln),2)*1)*(Table1[Name]=Table5[[#This Row],[Name]])*Table1[Bnk]))),\"\")","v":""},{"$f":"IFERROR(INDEX(Table1[Pin],1/(1/SUMPRODUCT((Table1[Reps]=RIGHT(INDEX(Table5[#Headers],coln),2)*1)*(Table1[Name]=Table5[[#This Row],[Name]])*Table1[Bnk]))),\"\")","v":""},{"$f":"IFERROR(INDEX(Table1[Pin],1/(1/SUMPRODUCT((Table1[Reps]=RIGHT(INDEX(Table5[#Headers],coln),2)*1)*(Table1[Name]=Table5[[#This Row],[Name]])*Table1[Bnk]))),\"\")","v":""},{"$f":"IFERROR(INDEX(Table1[Pin],1/(1/SUMPRODUCT((Table1[Reps]=RIGHT(INDEX(Table5[#Headers],coln),2)*1)*(Table1[Name]=Table5[[#This Row],[Name]])*Table1[Bnk]))),\"\")","v":""},{"$f":"IFERROR(INDEX(Table1[Pin],1/(1/SUMPRODUCT((Table1[Reps]=RIGHT(INDEX(Table5[#Headers],coln),2)*1)*(Table1[Name]=Table5[[#This Row],[Name]])*Table1[Bnk]))),\"\")","v":""},{"$f":"IFERROR(INDEX(Table1[Pin],1/(1/SUMPRODUCT((Table1[Reps]=RIGHT(INDEX(Table5[#Headers],coln),2)*1)*(Table1[Name]=Table5[[#This Row],[Name]])*Table1[Bnk]))),\"\")","v":""},{"$f":"IFERROR(INDEX(Table1[Pin],1/(1/SUMPRODUCT((Table1[Reps]=RIGHT(INDEX(Table5[#Headers],coln),2)*1)*(Table1[Name]=Table5[[#This Row],[Name]])*Table1[Bnk]))),\"\")","v":""},{"$f":"[Pin01]","v":"A11"},{"$f":"CONCATENATE([Pin14],IF([Pin02]=\"\",\"\",\", \"&[Pin02]))","v":"A11"},{"$f":"CONCATENATE([Pin15],IF([Pin03]=\"\",\"\",\", \"&[Pin03]))","v":"A11"},{"$f":"CONCATENATE([Pin16],IF([Pin04]=\"\",\"\",\", \"&[Pin04]))","v":"A11"},{"$f":"CONCATENATE([Pin17],IF([Pin05]=\"\",\"\",\", \"&[Pin05]))","v":"A11"},{"$f":"CONCATENATE([Pin18],IF([Pin06]=\"\",\"\",\", \"&[Pin06]))","v":"A11"},{"$f":"CONCATENATE([Pin19],IF([Pin07]=\"\",\"\",\", \"&[Pin07]))","v":"A11"},{"$f":"CONCATENATE([Pin20],IF([Pin08]=\"\",\"\",\", \"&[Pin08]))","v":"A11"},{"$f":"CONCATENATE([Pin21],IF([Pin09]=\"\",\"\",\", \"&[Pin09]))","v":"A11"},{"$f":"CONCATENATE([Pin22],IF([Pin10]=\"\",\"\",\", \"&[Pin10]))","v":"A11"},{"$f":"CONCATENATE([Pin23],IF([Pin11]=\"\",\"\",\", \"&[Pin11]))","v":"A11"},{"$f":"CONCATENATE([Pin24],IF([Pin12]=\"\",\"\",\", \"&[Pin12]))","v":"A11"},{"$f":"CONCATENATE([Pin25],IF([Pin13]=\"\",\"\",\", \"&[Pin13]))","v":"A11"},{"$f":"IFERROR(INDEX(Table1[InOut],1/(1/SUMPRODUCT((Table1[Reps]=1)*(Table1[Name]=Table5[[#This Row],[Name]])*Table1[Seq]))),\"\")","v":"I/O"},{"$f":"IFERROR(INDEX(Table1[Level],1/(1/SUMPRODUCT((Table1[Reps]=1)*(Table1[Name]=Table5[[#This Row],[Name]])*Table1[Seq]))),\"\")","v":"TTL"},{"$f":"IFERROR(INDEX(Table1[Func],1/(1/SUMPRODUCT((Table1[Reps]=1)*(Table1[Name]=Table5[[#This Row],[Name]])*Table1[Seq]))),\"\")","v":"SSImodule1clock."}]
[null,null,"H3","GND","-","Power","GroundreferenceforlogicandI/Opins.",{"$f":"COUNTIF(INDEX([Name],1):Table1[[#This Row],[Name]],[Name])","v":7},{"$f":"IF(ISTEXT([Pin]),[Seq],INDEX([Bnk],[Seq]-1))","v":84},84,null,null,"SSI1Fss",{"$f":"IFERROR(INDEX(Table1[Pin],1/(1/SUMPRODUCT((Table1[Reps]=RIGHT(INDEX(Table5[#Headers],coln),2)*1)*(Table1[Name]=Table5[[#This Row],[Name]])*Table1[Bnk]))),\"\")","v":"B12"},{"$f":"IFERROR(INDEX(Table1[Pin],1/(1/SUMPRODUCT((Table1[Reps]=RIGHT(INDEX(Table5[#Headers],coln),2)*1)*(Table1[Name]=Table5[[#This Row],[Name]])*Table1[Bnk]))),\"\")","v":""},{"$f":"IFERROR(INDEX(Table1[Pin],1/(1/SUMPRODUCT((Table1[Reps]=RIGHT(INDEX(Table5[#Headers],coln),2)*1)*(Table1[Name]=Table5[[#This Row],[Name]])*Table1[Bnk]))),\"\")","v":""},{"$f":"IFERROR(INDEX(Table1[Pin],1/(1/SUMPRODUCT((Table1[Reps]=RIGHT(INDEX(Table5[#Headers],coln),2)*1)*(Table1[Name]=Table5[[#This Row],[Name]])*Table1[Bnk]))),\"\")","v":""},{"$f":"IFERROR(INDEX(Table1[Pin],1/(1/SUMPRODUCT((Table1[Reps]=RIGHT(INDEX(Table5[#Headers],coln),2)*1)*(Table1[Name]=Table5[[#This Row],[Name]])*Table1[Bnk]))),\"\")","v":""},{"$f":"IFERROR(INDEX(Table1[Pin],1/(1/SUMPRODUCT((Table1[Reps]=RIGHT(INDEX(Table5[#Headers],coln),2)*1)*(Table1[Name]=Table5[[#This Row],[Name]])*Table1[Bnk]))),\"\")","v":""},{"$f":"IFERROR(INDEX(Table1[Pin],1/(1/SUMPRODUCT((Table1[Reps]=RIGHT(INDEX(Table5[#Headers],coln),2)*1)*(Table1[Name]=Table5[[#This Row],[Name]])*Table1[Bnk]))),\"\")","v":""},{"$f":"IFERROR(INDEX(Table1[Pin],1/(1/SUMPRODUCT((Table1[Reps]=RIGHT(INDEX(Table5[#Headers],coln),2)*1)*(Table1[Name]=Table5[[#This Row],[Name]])*Table1[Bnk]))),\"\")","v":""},{"$f":"IFERROR(INDEX(Table1[Pin],1/(1/SUMPRODUCT((Table1[Reps]=RIGHT(INDEX(Table5[#Headers],coln),2)*1)*(Table1[Name]=Table5[[#This Row],[Name]])*Table1[Bnk]))),\"\")","v":""},{"$f":"IFERROR(INDEX(Table1[Pin],1/(1/SUMPRODUCT((Table1[Reps]=RIGHT(INDEX(Table5[#Headers],coln),2)*1)*(Table1[Name]=Table5[[#This Row],[Name]])*Table1[Bnk]))),\"\")","v":""},{"$f":"IFERROR(INDEX(Table1[Pin],1/(1/SUMPRODUCT((Table1[Reps]=RIGHT(INDEX(Table5[#Headers],coln),2)*1)*(Table1[Name]=Table5[[#This Row],[Name]])*Table1[Bnk]))),\"\")","v":""},{"$f":"IFERROR(INDEX(Table1[Pin],1/(1/SUMPRODUCT((Table1[Reps]=RIGHT(INDEX(Table5[#Headers],coln),2)*1)*(Table1[Name]=Table5[[#This Row],[Name]])*Table1[Bnk]))),\"\")","v":""},{"$f":"IFERROR(INDEX(Table1[Pin],1/(1/SUMPRODUCT((Table1[Reps]=RIGHT(INDEX(Table5[#Headers],coln),2)*1)*(Table1[Name]=Table5[[#This Row],[Name]])*Table1[Bnk]))),\"\")","v":""},{"$f":"[Pin01]","v":"B12"},{"$f":"CONCATENATE([Pin14],IF([Pin02]=\"\",\"\",\", \"&[Pin02]))","v":"B12"},{"$f":"CONCATENATE([Pin15],IF([Pin03]=\"\",\"\",\", \"&[Pin03]))","v":"B12"},{"$f":"CONCATENATE([Pin16],IF([Pin04]=\"\",\"\",\", \"&[Pin04]))","v":"B12"},{"$f":"CONCATENATE([Pin17],IF([Pin05]=\"\",\"\",\", \"&[Pin05]))","v":"B12"},{"$f":"CONCATENATE([Pin18],IF([Pin06]=\"\",\"\",\", \"&[Pin06]))","v":"B12"},{"$f":"CONCATENATE([Pin19],IF([Pin07]=\"\",\"\",\", \"&[Pin07]))","v":"B12"},{"$f":"CONCATENATE([Pin20],IF([Pin08]=\"\",\"\",\", \"&[Pin08]))","v":"B12"},{"$f":"CONCATENATE([Pin21],IF([Pin09]=\"\",\"\",\", \"&[Pin09]))","v":"B12"},{"$f":"CONCATENATE([Pin22],IF([Pin10]=\"\",\"\",\", \"&[Pin10]))","v":"B12"},{"$f":"CONCATENATE([Pin23],IF([Pin11]=\"\",\"\",\", \"&[Pin11]))","v":"B12"},{"$f":"CONCATENATE([Pin24],IF([Pin12]=\"\",\"\",\", \"&[Pin12]))","v":"B12"},{"$f":"CONCATENATE([Pin25],IF([Pin13]=\"\",\"\",\", \"&[Pin13]))","v":"B12"},{"$f":"IFERROR(INDEX(Table1[InOut],1/(1/SUMPRODUCT((Table1[Reps]=1)*(Table1[Name]=Table5[[#This Row],[Name]])*Table1[Seq]))),\"\")","v":"I/O"},{"$f":"IFERROR(INDEX(Table1[Level],1/(1/SUMPRODUCT((Table1[Reps]=1)*(Table1[Name]=Table5[[#This Row],[Name]])*Table1[Seq]))),\"\")","v":"TTL"},{"$f":"IFERROR(INDEX(Table1[Func],1/(1/SUMPRODUCT((Table1[Reps]=1)*(Table1[Name]=Table5[[#This Row],[Name]])*Table1[Seq]))),\"\")","v":"SSImodule1frame."}]
[null,null,"H10","VDD33","-","Power","PositivesupplyforI/Oandsomelogic.",{"$f":"COUNTIF(INDEX([Name],1):Table1[[#This Row],[Name]],[Name])","v":5},{"$f":"IF(ISTEXT([Pin]),[Seq],INDEX([Bnk],[Seq]-1))","v":85},85,null,null,"SSI1Rx",{"$f":"IFERROR(INDEX(Table1[Pin],1/(1/SUMPRODUCT((Table1[Reps]=RIGHT(INDEX(Table5[#Headers],coln),2)*1)*(Table1[Name]=Table5[[#This Row],[Name]])*Table1[Bnk]))),\"\")","v":"B11"},{"$f":"IFERROR(INDEX(Table1[Pin],1/(1/SUMPRODUCT((Table1[Reps]=RIGHT(INDEX(Table5[#Headers],coln),2)*1)*(Table1[Name]=Table5[[#This Row],[Name]])*Table1[Bnk]))),\"\")","v":""},{"$f":"IFERROR(INDEX(Table1[Pin],1/(1/SUMPRODUCT((Table1[Reps]=RIGHT(INDEX(Table5[#Headers],coln),2)*1)*(Table1[Name]=Table5[[#This Row],[Name]])*Table1[Bnk]))),\"\")","v":""},{"$f":"IFERROR(INDEX(Table1[Pin],1/(1/SUMPRODUCT((Table1[Reps]=RIGHT(INDEX(Table5[#Headers],coln),2)*1)*(Table1[Name]=Table5[[#This Row],[Name]])*Table1[Bnk]))),\"\")","v":""},{"$f":"IFERROR(INDEX(Table1[Pin],1/(1/SUMPRODUCT((Table1[Reps]=RIGHT(INDEX(Table5[#Headers],coln),2)*1)*(Table1[Name]=Table5[[#This Row],[Name]])*Table1[Bnk]))),\"\")","v":""},{"$f":"IFERROR(INDEX(Table1[Pin],1/(1/SUMPRODUCT((Table1[Reps]=RIGHT(INDEX(Table5[#Headers],coln),2)*1)*(Table1[Name]=Table5[[#This Row],[Name]])*Table1[Bnk]))),\"\")","v":""},{"$f":"IFERROR(INDEX(Table1[Pin],1/(1/SUMPRODUCT((Table1[Reps]=RIGHT(INDEX(Table5[#Headers],coln),2)*1)*(Table1[Name]=Table5[[#This Row],[Name]])*Table1[Bnk]))),\"\")","v":""},{"$f":"IFERROR(INDEX(Table1[Pin],1/(1/SUMPRODUCT((Table1[Reps]=RIGHT(INDEX(Table5[#Headers],coln),2)*1)*(Table1[Name]=Table5[[#This Row],[Name]])*Table1[Bnk]))),\"\")","v":""},{"$f":"IFERROR(INDEX(Table1[Pin],1/(1/SUMPRODUCT((Table1[Reps]=RIGHT(INDEX(Table5[#Headers],coln),2)*1)*(Table1[Name]=Table5[[#This Row],[Name]])*Table1[Bnk]))),\"\")","v":""},{"$f":"IFERROR(INDEX(Table1[Pin],1/(1/SUMPRODUCT((Table1[Reps]=RIGHT(INDEX(Table5[#Headers],coln),2)*1)*(Table1[Name]=Table5[[#This Row],[Name]])*Table1[Bnk]))),\"\")","v":""},{"$f":"IFERROR(INDEX(Table1[Pin],1/(1/SUMPRODUCT((Table1[Reps]=RIGHT(INDEX(Table5[#Headers],coln),2)*1)*(Table1[Name]=Table5[[#This Row],[Name]])*Table1[Bnk]))),\"\")","v":""},{"$f":"IFERROR(INDEX(Table1[Pin],1/(1/SUMPRODUCT((Table1[Reps]=RIGHT(INDEX(Table5[#Headers],coln),2)*1)*(Table1[Name]=Table5[[#This Row],[Name]])*Table1[Bnk]))),\"\")","v":""},{"$f":"IFERROR(INDEX(Table1[Pin],1/(1/SUMPRODUCT((Table1[Reps]=RIGHT(INDEX(Table5[#Headers],coln),2)*1)*(Table1[Name]=Table5[[#This Row],[Name]])*Table1[Bnk]))),\"\")","v":""},{"$f":"[Pin01]","v":"B11"},{"$f":"CONCATENATE([Pin14],IF([Pin02]=\"\",\"\",\", \"&[Pin02]))","v":"B11"},{"$f":"CONCATENATE([Pin15],IF([Pin03]=\"\",\"\",\", \"&[Pin03]))","v":"B11"},{"$f":"CONCATENATE([Pin16],IF([Pin04]=\"\",\"\",\", \"&[Pin04]))","v":"B11"},{"$f":"CONCATENATE([Pin17],IF([Pin05]=\"\",\"\",\", \"&[Pin05]))","v":"B11"},{"$f":"CONCATENATE([Pin18],IF([Pin06]=\"\",\"\",\", \"&[Pin06]))","v":"B11"},{"$f":"CONCATENATE([Pin19],IF([Pin07]=\"\",\"\",\", \"&[Pin07]))","v":"B11"},{"$f":"CONCATENATE([Pin20],IF([Pin08]=\"\",\"\",\", \"&[Pin08]))","v":"B11"},{"$f":"CONCATENATE([Pin21],IF([Pin09]=\"\",\"\",\", \"&[Pin09]))","v":"B11"},{"$f":"CONCATENATE([Pin22],IF([Pin10]=\"\",\"\",\", \"&[Pin10]))","v":"B11"},{"$f":"CONCATENATE([Pin23],IF([Pin11]=\"\",\"\",\", \"&[Pin11]))","v":"B11"},{"$f":"CONCATENATE([Pin24],IF([Pin12]=\"\",\"\",\", \"&[Pin12]))","v":"B11"},{"$f":"CONCATENATE([Pin25],IF([Pin13]=\"\",\"\",\", \"&[Pin13]))","v":"B11"},{"$f":"IFERROR(INDEX(Table1[InOut],1/(1/SUMPRODUCT((Table1[Reps]=1)*(Table1[Name]=Table5[[#This Row],[Name]])*Table1[Seq]))),\"\")","v":"I"},{"$f":"IFERROR(INDEX(Table1[Level],1/(1/SUMPRODUCT((Table1[Reps]=1)*(Table1[Name]=Table5[[#This Row],[Name]])*Table1[Seq]))),\"\")","v":"TTL"},{"$f":"IFERROR(INDEX(Table1[Func],1/(1/SUMPRODUCT((Table1[Reps]=1)*(Table1[Name]=Table5[[#This Row],[Name]])*Table1[Seq]))),\"\")","v":"SSImodule1receive."}]
[null,null,"H11","RST","I","TTL","Systemresetinput.",{"$f":"COUNTIF(INDEX([Name],1):Table1[[#This Row],[Name]],[Name])","v":1},{"$f":"IF(ISTEXT([Pin]),[Seq],INDEX([Bnk],[Seq]-1))","v":86},86,null,null,"SSI1Tx",{"$f":"IFERROR(INDEX(Table1[Pin],1/(1/SUMPRODUCT((Table1[Reps]=RIGHT(INDEX(Table5[#Headers],coln),2)*1)*(Table1[Name]=Table5[[#This Row],[Name]])*Table1[Bnk]))),\"\")","v":"A12"},{"$f":"IFERROR(INDEX(Table1[Pin],1/(1/SUMPRODUCT((Table1[Reps]=RIGHT(INDEX(Table5[#Headers],coln),2)*1)*(Table1[Name]=Table5[[#This Row],[Name]])*Table1[Bnk]))),\"\")","v":""},{"$f":"IFERROR(INDEX(Table1[Pin],1/(1/SUMPRODUCT((Table1[Reps]=RIGHT(INDEX(Table5[#Headers],coln),2)*1)*(Table1[Name]=Table5[[#This Row],[Name]])*Table1[Bnk]))),\"\")","v":""},{"$f":"IFERROR(INDEX(Table1[Pin],1/(1/SUMPRODUCT((Table1[Reps]=RIGHT(INDEX(Table5[#Headers],coln),2)*1)*(Table1[Name]=Table5[[#This Row],[Name]])*Table1[Bnk]))),\"\")","v":""},{"$f":"IFERROR(INDEX(Table1[Pin],1/(1/SUMPRODUCT((Table1[Reps]=RIGHT(INDEX(Table5[#Headers],coln),2)*1)*(Table1[Name]=Table5[[#This Row],[Name]])*Table1[Bnk]))),\"\")","v":""},{"$f":"IFERROR(INDEX(Table1[Pin],1/(1/SUMPRODUCT((Table1[Reps]=RIGHT(INDEX(Table5[#Headers],coln),2)*1)*(Table1[Name]=Table5[[#This Row],[Name]])*Table1[Bnk]))),\"\")","v":""},{"$f":"IFERROR(INDEX(Table1[Pin],1/(1/SUMPRODUCT((Table1[Reps]=RIGHT(INDEX(Table5[#Headers],coln),2)*1)*(Table1[Name]=Table5[[#This Row],[Name]])*Table1[Bnk]))),\"\")","v":""},{"$f":"IFERROR(INDEX(Table1[Pin],1/(1/SUMPRODUCT((Table1[Reps]=RIGHT(INDEX(Table5[#Headers],coln),2)*1)*(Table1[Name]=Table5[[#This Row],[Name]])*Table1[Bnk]))),\"\")","v":""},{"$f":"IFERROR(INDEX(Table1[Pin],1/(1/SUMPRODUCT((Table1[Reps]=RIGHT(INDEX(Table5[#Headers],coln),2)*1)*(Table1[Name]=Table5[[#This Row],[Name]])*Table1[Bnk]))),\"\")","v":""},{"$f":"IFERROR(INDEX(Table1[Pin],1/(1/SUMPRODUCT((Table1[Reps]=RIGHT(INDEX(Table5[#Headers],coln),2)*1)*(Table1[Name]=Table5[[#This Row],[Name]])*Table1[Bnk]))),\"\")","v":""},{"$f":"IFERROR(INDEX(Table1[Pin],1/(1/SUMPRODUCT((Table1[Reps]=RIGHT(INDEX(Table5[#Headers],coln),2)*1)*(Table1[Name]=Table5[[#This Row],[Name]])*Table1[Bnk]))),\"\")","v":""},{"$f":"IFERROR(INDEX(Table1[Pin],1/(1/SUMPRODUCT((Table1[Reps]=RIGHT(INDEX(Table5[#Headers],coln),2)*1)*(Table1[Name]=Table5[[#This Row],[Name]])*Table1[Bnk]))),\"\")","v":""},{"$f":"IFERROR(INDEX(Table1[Pin],1/(1/SUMPRODUCT((Table1[Reps]=RIGHT(INDEX(Table5[#Headers],coln),2)*1)*(Table1[Name]=Table5[[#This Row],[Name]])*Table1[Bnk]))),\"\")","v":""},{"$f":"[Pin01]","v":"A12"},{"$f":"CONCATENATE([Pin14],IF([Pin02]=\"\",\"\",\", \"&[Pin02]))","v":"A12"},{"$f":"CONCATENATE([Pin15],IF([Pin03]=\"\",\"\",\", \"&[Pin03]))","v":"A12"},{"$f":"CONCATENATE([Pin16],IF([Pin04]=\"\",\"\",\", \"&[Pin04]))","v":"A12"},{"$f":"CONCATENATE([Pin17],IF([Pin05]=\"\",\"\",\", \"&[Pin05]))","v":"A12"},{"$f":"CONCATENATE([Pin18],IF([Pin06]=\"\",\"\",\", \"&[Pin06]))","v":"A12"},{"$f":"CONCATENATE([Pin19],IF([Pin07]=\"\",\"\",\", \"&[Pin07]))","v":"A12"},{"$f":"CONCATENATE([Pin20],IF([Pin08]=\"\",\"\",\", \"&[Pin08]))","v":"A12"},{"$f":"CONCATENATE([Pin21],IF([Pin09]=\"\",\"\",\", \"&[Pin09]))","v":"A12"},{"$f":"CONCATENATE([Pin22],IF([Pin10]=\"\",\"\",\", \"&[Pin10]))","v":"A12"},{"$f":"CONCATENATE([Pin23],IF([Pin11]=\"\",\"\",\", \"&[Pin11]))","v":"A12"},{"$f":"CONCATENATE([Pin24],IF([Pin12]=\"\",\"\",\", \"&[Pin12]))","v":"A12"},{"$f":"CONCATENATE([Pin25],IF([Pin13]=\"\",\"\",\", \"&[Pin13]))","v":"A12"},{"$f":"IFERROR(INDEX(Table1[InOut],1/(1/SUMPRODUCT((Table1[Reps]=1)*(Table1[Name]=Table5[[#This Row],[Name]])*Table1[Seq]))),\"\")","v":"O"},{"$f":"IFERROR(INDEX(Table1[Level],1/(1/SUMPRODUCT((Table1[Reps]=1)*(Table1[Name]=Table5[[#This Row],[Name]])*Table1[Seq]))),\"\")","v":"TTL"},{"$f":"IFERROR(INDEX(Table1[Func],1/(1/SUMPRODUCT((Table1[Reps]=1)*(Table1[Name]=Table5[[#This Row],[Name]])*Table1[Seq]))),\"\")","v":"SSImodule1transmit."}]
[null,null,"H12","PF1","I/O","TTL","GPIOportFbit1.",{"$f":"COUNTIF(INDEX([Name],1):Table1[[#This Row],[Name]],[Name])","v":1},{"$f":"IF(ISTEXT([Pin]),[Seq],INDEX([Bnk],[Seq]-1))","v":87},87,null,null,"SWCLK",{"$f":"IFERROR(INDEX(Table1[Pin],1/(1/SUMPRODUCT((Table1[Reps]=RIGHT(INDEX(Table5[#Headers],coln),2)*1)*(Table1[Name]=Table5[[#This Row],[Name]])*Table1[Bnk]))),\"\")","v":"A9"},{"$f":"IFERROR(INDEX(Table1[Pin],1/(1/SUMPRODUCT((Table1[Reps]=RIGHT(INDEX(Table5[#Headers],coln),2)*1)*(Table1[Name]=Table5[[#This Row],[Name]])*Table1[Bnk]))),\"\")","v":""},{"$f":"IFERROR(INDEX(Table1[Pin],1/(1/SUMPRODUCT((Table1[Reps]=RIGHT(INDEX(Table5[#Headers],coln),2)*1)*(Table1[Name]=Table5[[#This Row],[Name]])*Table1[Bnk]))),\"\")","v":""},{"$f":"IFERROR(INDEX(Table1[Pin],1/(1/SUMPRODUCT((Table1[Reps]=RIGHT(INDEX(Table5[#Headers],coln),2)*1)*(Table1[Name]=Table5[[#This Row],[Name]])*Table1[Bnk]))),\"\")","v":""},{"$f":"IFERROR(INDEX(Table1[Pin],1/(1/SUMPRODUCT((Table1[Reps]=RIGHT(INDEX(Table5[#Headers],coln),2)*1)*(Table1[Name]=Table5[[#This Row],[Name]])*Table1[Bnk]))),\"\")","v":""},{"$f":"IFERROR(INDEX(Table1[Pin],1/(1/SUMPRODUCT((Table1[Reps]=RIGHT(INDEX(Table5[#Headers],coln),2)*1)*(Table1[Name]=Table5[[#This Row],[Name]])*Table1[Bnk]))),\"\")","v":""},{"$f":"IFERROR(INDEX(Table1[Pin],1/(1/SUMPRODUCT((Table1[Reps]=RIGHT(INDEX(Table5[#Headers],coln),2)*1)*(Table1[Name]=Table5[[#This Row],[Name]])*Table1[Bnk]))),\"\")","v":""},{"$f":"IFERROR(INDEX(Table1[Pin],1/(1/SUMPRODUCT((Table1[Reps]=RIGHT(INDEX(Table5[#Headers],coln),2)*1)*(Table1[Name]=Table5[[#This Row],[Name]])*Table1[Bnk]))),\"\")","v":""},{"$f":"IFERROR(INDEX(Table1[Pin],1/(1/SUMPRODUCT((Table1[Reps]=RIGHT(INDEX(Table5[#Headers],coln),2)*1)*(Table1[Name]=Table5[[#This Row],[Name]])*Table1[Bnk]))),\"\")","v":""},{"$f":"IFERROR(INDEX(Table1[Pin],1/(1/SUMPRODUCT((Table1[Reps]=RIGHT(INDEX(Table5[#Headers],coln),2)*1)*(Table1[Name]=Table5[[#This Row],[Name]])*Table1[Bnk]))),\"\")","v":""},{"$f":"IFERROR(INDEX(Table1[Pin],1/(1/SUMPRODUCT((Table1[Reps]=RIGHT(INDEX(Table5[#Headers],coln),2)*1)*(Table1[Name]=Table5[[#This Row],[Name]])*Table1[Bnk]))),\"\")","v":""},{"$f":"IFERROR(INDEX(Table1[Pin],1/(1/SUMPRODUCT((Table1[Reps]=RIGHT(INDEX(Table5[#Headers],coln),2)*1)*(Table1[Name]=Table5[[#This Row],[Name]])*Table1[Bnk]))),\"\")","v":""},{"$f":"IFERROR(INDEX(Table1[Pin],1/(1/SUMPRODUCT((Table1[Reps]=RIGHT(INDEX(Table5[#Headers],coln),2)*1)*(Table1[Name]=Table5[[#This Row],[Name]])*Table1[Bnk]))),\"\")","v":""},{"$f":"[Pin01]","v":"A9"},{"$f":"CONCATENATE([Pin14],IF([Pin02]=\"\",\"\",\", \"&[Pin02]))","v":"A9"},{"$f":"CONCATENATE([Pin15],IF([Pin03]=\"\",\"\",\", \"&[Pin03]))","v":"A9"},{"$f":"CONCATENATE([Pin16],IF([Pin04]=\"\",\"\",\", \"&[Pin04]))","v":"A9"},{"$f":"CONCATENATE([Pin17],IF([Pin05]=\"\",\"\",\", \"&[Pin05]))","v":"A9"},{"$f":"CONCATENATE([Pin18],IF([Pin06]=\"\",\"\",\", \"&[Pin06]))","v":"A9"},{"$f":"CONCATENATE([Pin19],IF([Pin07]=\"\",\"\",\", \"&[Pin07]))","v":"A9"},{"$f":"CONCATENATE([Pin20],IF([Pin08]=\"\",\"\",\", \"&[Pin08]))","v":"A9"},{"$f":"CONCATENATE([Pin21],IF([Pin09]=\"\",\"\",\", \"&[Pin09]))","v":"A9"},{"$f":"CONCATENATE([Pin22],IF([Pin10]=\"\",\"\",\", \"&[Pin10]))","v":"A9"},{"$f":"CONCATENATE([Pin23],IF([Pin11]=\"\",\"\",\", \"&[Pin11]))","v":"A9"},{"$f":"CONCATENATE([Pin24],IF([Pin12]=\"\",\"\",\", \"&[Pin12]))","v":"A9"},{"$f":"CONCATENATE([Pin25],IF([Pin13]=\"\",\"\",\", \"&[Pin13]))","v":"A9"},{"$f":"IFERROR(INDEX(Table1[InOut],1/(1/SUMPRODUCT((Table1[Reps]=1)*(Table1[Name]=Table5[[#This Row],[Name]])*Table1[Seq]))),\"\")","v":"I"},{"$f":"IFERROR(INDEX(Table1[Level],1/(1/SUMPRODUCT((Table1[Reps]=1)*(Table1[Name]=Table5[[#This Row],[Name]])*Table1[Seq]))),\"\")","v":"TTL"},{"$f":"IFERROR(INDEX(Table1[Func],1/(1/SUMPRODUCT((Table1[Reps]=1)*(Table1[Name]=Table5[[#This Row],[Name]])*Table1[Seq]))),\"\")","v":"JTAG/SWDCLK."}]
[null,null,"J1","XTALNPHY","O","TTL","XTALNoftheEthernetPHY.Whenusingasingle-ended25-",{"$f":"COUNTIF(INDEX([Name],1):Table1[[#This Row],[Name]],[Name])","v":1},{"$f":"IF(ISTEXT([Pin]),[Seq],INDEX([Bnk],[Seq]-1))","v":88},88,null,null,"SWDIO",{"$f":"IFERROR(INDEX(Table1[Pin],1/(1/SUMPRODUCT((Table1[Reps]=RIGHT(INDEX(Table5[#Headers],coln),2)*1)*(Table1[Name]=Table5[[#This Row],[Name]])*Table1[Bnk]))),\"\")","v":"B9"},{"$f":"IFERROR(INDEX(Table1[Pin],1/(1/SUMPRODUCT((Table1[Reps]=RIGHT(INDEX(Table5[#Headers],coln),2)*1)*(Table1[Name]=Table5[[#This Row],[Name]])*Table1[Bnk]))),\"\")","v":""},{"$f":"IFERROR(INDEX(Table1[Pin],1/(1/SUMPRODUCT((Table1[Reps]=RIGHT(INDEX(Table5[#Headers],coln),2)*1)*(Table1[Name]=Table5[[#This Row],[Name]])*Table1[Bnk]))),\"\")","v":""},{"$f":"IFERROR(INDEX(Table1[Pin],1/(1/SUMPRODUCT((Table1[Reps]=RIGHT(INDEX(Table5[#Headers],coln),2)*1)*(Table1[Name]=Table5[[#This Row],[Name]])*Table1[Bnk]))),\"\")","v":""},{"$f":"IFERROR(INDEX(Table1[Pin],1/(1/SUMPRODUCT((Table1[Reps]=RIGHT(INDEX(Table5[#Headers],coln),2)*1)*(Table1[Name]=Table5[[#This Row],[Name]])*Table1[Bnk]))),\"\")","v":""},{"$f":"IFERROR(INDEX(Table1[Pin],1/(1/SUMPRODUCT((Table1[Reps]=RIGHT(INDEX(Table5[#Headers],coln),2)*1)*(Table1[Name]=Table5[[#This Row],[Name]])*Table1[Bnk]))),\"\")","v":""},{"$f":"IFERROR(INDEX(Table1[Pin],1/(1/SUMPRODUCT((Table1[Reps]=RIGHT(INDEX(Table5[#Headers],coln),2)*1)*(Table1[Name]=Table5[[#This Row],[Name]])*Table1[Bnk]))),\"\")","v":""},{"$f":"IFERROR(INDEX(Table1[Pin],1/(1/SUMPRODUCT((Table1[Reps]=RIGHT(INDEX(Table5[#Headers],coln),2)*1)*(Table1[Name]=Table5[[#This Row],[Name]])*Table1[Bnk]))),\"\")","v":""},{"$f":"IFERROR(INDEX(Table1[Pin],1/(1/SUMPRODUCT((Table1[Reps]=RIGHT(INDEX(Table5[#Headers],coln),2)*1)*(Table1[Name]=Table5[[#This Row],[Name]])*Table1[Bnk]))),\"\")","v":""},{"$f":"IFERROR(INDEX(Table1[Pin],1/(1/SUMPRODUCT((Table1[Reps]=RIGHT(INDEX(Table5[#Headers],coln),2)*1)*(Table1[Name]=Table5[[#This Row],[Name]])*Table1[Bnk]))),\"\")","v":""},{"$f":"IFERROR(INDEX(Table1[Pin],1/(1/SUMPRODUCT((Table1[Reps]=RIGHT(INDEX(Table5[#Headers],coln),2)*1)*(Table1[Name]=Table5[[#This Row],[Name]])*Table1[Bnk]))),\"\")","v":""},{"$f":"IFERROR(INDEX(Table1[Pin],1/(1/SUMPRODUCT((Table1[Reps]=RIGHT(INDEX(Table5[#Headers],coln),2)*1)*(Table1[Name]=Table5[[#This Row],[Name]])*Table1[Bnk]))),\"\")","v":""},{"$f":"IFERROR(INDEX(Table1[Pin],1/(1/SUMPRODUCT((Table1[Reps]=RIGHT(INDEX(Table5[#Headers],coln),2)*1)*(Table1[Name]=Table5[[#This Row],[Name]])*Table1[Bnk]))),\"\")","v":""},{"$f":"[Pin01]","v":"B9"},{"$f":"CONCATENATE([Pin14],IF([Pin02]=\"\",\"\",\", \"&[Pin02]))","v":"B9"},{"$f":"CONCATENATE([Pin15],IF([Pin03]=\"\",\"\",\", \"&[Pin03]))","v":"B9"},{"$f":"CONCATENATE([Pin16],IF([Pin04]=\"\",\"\",\", \"&[Pin04]))","v":"B9"},{"$f":"CONCATENATE([Pin17],IF([Pin05]=\"\",\"\",\", \"&[Pin05]))","v":"B9"},{"$f":"CONCATENATE([Pin18],IF([Pin06]=\"\",\"\",\", \"&[Pin06]))","v":"B9"},{"$f":"CONCATENATE([Pin19],IF([Pin07]=\"\",\"\",\", \"&[Pin07]))","v":"B9"},{"$f":"CONCATENATE([Pin20],IF([Pin08]=\"\",\"\",\", \"&[Pin08]))","v":"B9"},{"$f":"CONCATENATE([Pin21],IF([Pin09]=\"\",\"\",\", \"&[Pin09]))","v":"B9"},{"$f":"CONCATENATE([Pin22],IF([Pin10]=\"\",\"\",\", \"&[Pin10]))","v":"B9"},{"$f":"CONCATENATE([Pin23],IF([Pin11]=\"\",\"\",\", \"&[Pin11]))","v":"B9"},{"$f":"CONCATENATE([Pin24],IF([Pin12]=\"\",\"\",\", \"&[Pin12]))","v":"B9"},{"$f":"CONCATENATE([Pin25],IF([Pin13]=\"\",\"\",\", \"&[Pin13]))","v":"B9"},{"$f":"IFERROR(INDEX(Table1[InOut],1/(1/SUMPRODUCT((Table1[Reps]=1)*(Table1[Name]=Table5[[#This Row],[Name]])*Table1[Seq]))),\"\")","v":"I/O"},{"$f":"IFERROR(INDEX(Table1[Level],1/(1/SUMPRODUCT((Table1[Reps]=1)*(Table1[Name]=Table5[[#This Row],[Name]])*Table1[Seq]))),\"\")","v":"TTL"},{"$f":"IFERROR(INDEX(Table1[Func],1/(1/SUMPRODUCT((Table1[Reps]=1)*(Table1[Name]=Table5[[#This Row],[Name]])*Table1[Seq]))),\"\")","v":"JTAGTMSandSWDIO."}]
[null,null,"J2","XTALPPHY","I","TTL","XTALPoftheEthernetPHY.",{"$f":"COUNTIF(INDEX([Name],1):Table1[[#This Row],[Name]],[Name])","v":1},{"$f":"IF(ISTEXT([Pin]),[Seq],INDEX([Bnk],[Seq]-1))","v":89},89,null,null,"SWO",{"$f":"IFERROR(INDEX(Table1[Pin],1/(1/SUMPRODUCT((Table1[Reps]=RIGHT(INDEX(Table5[#Headers],coln),2)*1)*(Table1[Name]=Table5[[#This Row],[Name]])*Table1[Bnk]))),\"\")","v":"A10"},{"$f":"IFERROR(INDEX(Table1[Pin],1/(1/SUMPRODUCT((Table1[Reps]=RIGHT(INDEX(Table5[#Headers],coln),2)*1)*(Table1[Name]=Table5[[#This Row],[Name]])*Table1[Bnk]))),\"\")","v":""},{"$f":"IFERROR(INDEX(Table1[Pin],1/(1/SUMPRODUCT((Table1[Reps]=RIGHT(INDEX(Table5[#Headers],coln),2)*1)*(Table1[Name]=Table5[[#This Row],[Name]])*Table1[Bnk]))),\"\")","v":""},{"$f":"IFERROR(INDEX(Table1[Pin],1/(1/SUMPRODUCT((Table1[Reps]=RIGHT(INDEX(Table5[#Headers],coln),2)*1)*(Table1[Name]=Table5[[#This Row],[Name]])*Table1[Bnk]))),\"\")","v":""},{"$f":"IFERROR(INDEX(Table1[Pin],1/(1/SUMPRODUCT((Table1[Reps]=RIGHT(INDEX(Table5[#Headers],coln),2)*1)*(Table1[Name]=Table5[[#This Row],[Name]])*Table1[Bnk]))),\"\")","v":""},{"$f":"IFERROR(INDEX(Table1[Pin],1/(1/SUMPRODUCT((Table1[Reps]=RIGHT(INDEX(Table5[#Headers],coln),2)*1)*(Table1[Name]=Table5[[#This Row],[Name]])*Table1[Bnk]))),\"\")","v":""},{"$f":"IFERROR(INDEX(Table1[Pin],1/(1/SUMPRODUCT((Table1[Reps]=RIGHT(INDEX(Table5[#Headers],coln),2)*1)*(Table1[Name]=Table5[[#This Row],[Name]])*Table1[Bnk]))),\"\")","v":""},{"$f":"IFERROR(INDEX(Table1[Pin],1/(1/SUMPRODUCT((Table1[Reps]=RIGHT(INDEX(Table5[#Headers],coln),2)*1)*(Table1[Name]=Table5[[#This Row],[Name]])*Table1[Bnk]))),\"\")","v":""},{"$f":"IFERROR(INDEX(Table1[Pin],1/(1/SUMPRODUCT((Table1[Reps]=RIGHT(INDEX(Table5[#Headers],coln),2)*1)*(Table1[Name]=Table5[[#This Row],[Name]])*Table1[Bnk]))),\"\")","v":""},{"$f":"IFERROR(INDEX(Table1[Pin],1/(1/SUMPRODUCT((Table1[Reps]=RIGHT(INDEX(Table5[#Headers],coln),2)*1)*(Table1[Name]=Table5[[#This Row],[Name]])*Table1[Bnk]))),\"\")","v":""},{"$f":"IFERROR(INDEX(Table1[Pin],1/(1/SUMPRODUCT((Table1[Reps]=RIGHT(INDEX(Table5[#Headers],coln),2)*1)*(Table1[Name]=Table5[[#This Row],[Name]])*Table1[Bnk]))),\"\")","v":""},{"$f":"IFERROR(INDEX(Table1[Pin],1/(1/SUMPRODUCT((Table1[Reps]=RIGHT(INDEX(Table5[#Headers],coln),2)*1)*(Table1[Name]=Table5[[#This Row],[Name]])*Table1[Bnk]))),\"\")","v":""},{"$f":"IFERROR(INDEX(Table1[Pin],1/(1/SUMPRODUCT((Table1[Reps]=RIGHT(INDEX(Table5[#Headers],coln),2)*1)*(Table1[Name]=Table5[[#This Row],[Name]])*Table1[Bnk]))),\"\")","v":""},{"$f":"[Pin01]","v":"A10"},{"$f":"CONCATENATE([Pin14],IF([Pin02]=\"\",\"\",\", \"&[Pin02]))","v":"A10"},{"$f":"CONCATENATE([Pin15],IF([Pin03]=\"\",\"\",\", \"&[Pin03]))","v":"A10"},{"$f":"CONCATENATE([Pin16],IF([Pin04]=\"\",\"\",\", \"&[Pin04]))","v":"A10"},{"$f":"CONCATENATE([Pin17],IF([Pin05]=\"\",\"\",\", \"&[Pin05]))","v":"A10"},{"$f":"CONCATENATE([Pin18],IF([Pin06]=\"\",\"\",\", \"&[Pin06]))","v":"A10"},{"$f":"CONCATENATE([Pin19],IF([Pin07]=\"\",\"\",\", \"&[Pin07]))","v":"A10"},{"$f":"CONCATENATE([Pin20],IF([Pin08]=\"\",\"\",\", \"&[Pin08]))","v":"A10"},{"$f":"CONCATENATE([Pin21],IF([Pin09]=\"\",\"\",\", \"&[Pin09]))","v":"A10"},{"$f":"CONCATENATE([Pin22],IF([Pin10]=\"\",\"\",\", \"&[Pin10]))","v":"A10"},{"$f":"CONCATENATE([Pin23],IF([Pin11]=\"\",\"\",\", \"&[Pin11]))","v":"A10"},{"$f":"CONCATENATE([Pin24],IF([Pin12]=\"\",\"\",\", \"&[Pin12]))","v":"A10"},{"$f":"CONCATENATE([Pin25],IF([Pin13]=\"\",\"\",\", \"&[Pin13]))","v":"A10"},{"$f":"IFERROR(INDEX(Table1[InOut],1/(1/SUMPRODUCT((Table1[Reps]=1)*(Table1[Name]=Table5[[#This Row],[Name]])*Table1[Seq]))),\"\")","v":"O"},{"$f":"IFERROR(INDEX(Table1[Level],1/(1/SUMPRODUCT((Table1[Reps]=1)*(Table1[Name]=Table5[[#This Row],[Name]])*Table1[Seq]))),\"\")","v":"TTL"},{"$f":"IFERROR(INDEX(Table1[Func],1/(1/SUMPRODUCT((Table1[Reps]=1)*(Table1[Name]=Table5[[#This Row],[Name]])*Table1[Seq]))),\"\")","v":"JTAGTDOandSWO."}]
[null,null,"J3","GND","-","Power","GroundreferenceforlogicandI/Opins.",{"$f":"COUNTIF(INDEX([Name],1):Table1[[#This Row],[Name]],[Name])","v":8},{"$f":"IF(ISTEXT([Pin]),[Seq],INDEX([Bnk],[Seq]-1))","v":90},90,null,null,"TCK",{"$f":"IFERROR(INDEX(Table1[Pin],1/(1/SUMPRODUCT((Table1[Reps]=RIGHT(INDEX(Table5[#Headers],coln),2)*1)*(Table1[Name]=Table5[[#This Row],[Name]])*Table1[Bnk]))),\"\")","v":"A9"},{"$f":"IFERROR(INDEX(Table1[Pin],1/(1/SUMPRODUCT((Table1[Reps]=RIGHT(INDEX(Table5[#Headers],coln),2)*1)*(Table1[Name]=Table5[[#This Row],[Name]])*Table1[Bnk]))),\"\")","v":""},{"$f":"IFERROR(INDEX(Table1[Pin],1/(1/SUMPRODUCT((Table1[Reps]=RIGHT(INDEX(Table5[#Headers],coln),2)*1)*(Table1[Name]=Table5[[#This Row],[Name]])*Table1[Bnk]))),\"\")","v":""},{"$f":"IFERROR(INDEX(Table1[Pin],1/(1/SUMPRODUCT((Table1[Reps]=RIGHT(INDEX(Table5[#Headers],coln),2)*1)*(Table1[Name]=Table5[[#This Row],[Name]])*Table1[Bnk]))),\"\")","v":""},{"$f":"IFERROR(INDEX(Table1[Pin],1/(1/SUMPRODUCT((Table1[Reps]=RIGHT(INDEX(Table5[#Headers],coln),2)*1)*(Table1[Name]=Table5[[#This Row],[Name]])*Table1[Bnk]))),\"\")","v":""},{"$f":"IFERROR(INDEX(Table1[Pin],1/(1/SUMPRODUCT((Table1[Reps]=RIGHT(INDEX(Table5[#Headers],coln),2)*1)*(Table1[Name]=Table5[[#This Row],[Name]])*Table1[Bnk]))),\"\")","v":""},{"$f":"IFERROR(INDEX(Table1[Pin],1/(1/SUMPRODUCT((Table1[Reps]=RIGHT(INDEX(Table5[#Headers],coln),2)*1)*(Table1[Name]=Table5[[#This Row],[Name]])*Table1[Bnk]))),\"\")","v":""},{"$f":"IFERROR(INDEX(Table1[Pin],1/(1/SUMPRODUCT((Table1[Reps]=RIGHT(INDEX(Table5[#Headers],coln),2)*1)*(Table1[Name]=Table5[[#This Row],[Name]])*Table1[Bnk]))),\"\")","v":""},{"$f":"IFERROR(INDEX(Table1[Pin],1/(1/SUMPRODUCT((Table1[Reps]=RIGHT(INDEX(Table5[#Headers],coln),2)*1)*(Table1[Name]=Table5[[#This Row],[Name]])*Table1[Bnk]))),\"\")","v":""},{"$f":"IFERROR(INDEX(Table1[Pin],1/(1/SUMPRODUCT((Table1[Reps]=RIGHT(INDEX(Table5[#Headers],coln),2)*1)*(Table1[Name]=Table5[[#This Row],[Name]])*Table1[Bnk]))),\"\")","v":""},{"$f":"IFERROR(INDEX(Table1[Pin],1/(1/SUMPRODUCT((Table1[Reps]=RIGHT(INDEX(Table5[#Headers],coln),2)*1)*(Table1[Name]=Table5[[#This Row],[Name]])*Table1[Bnk]))),\"\")","v":""},{"$f":"IFERROR(INDEX(Table1[Pin],1/(1/SUMPRODUCT((Table1[Reps]=RIGHT(INDEX(Table5[#Headers],coln),2)*1)*(Table1[Name]=Table5[[#This Row],[Name]])*Table1[Bnk]))),\"\")","v":""},{"$f":"IFERROR(INDEX(Table1[Pin],1/(1/SUMPRODUCT((Table1[Reps]=RIGHT(INDEX(Table5[#Headers],coln),2)*1)*(Table1[Name]=Table5[[#This Row],[Name]])*Table1[Bnk]))),\"\")","v":""},{"$f":"[Pin01]","v":"A9"},{"$f":"CONCATENATE([Pin14],IF([Pin02]=\"\",\"\",\", \"&[Pin02]))","v":"A9"},{"$f":"CONCATENATE([Pin15],IF([Pin03]=\"\",\"\",\", \"&[Pin03]))","v":"A9"},{"$f":"CONCATENATE([Pin16],IF([Pin04]=\"\",\"\",\", \"&[Pin04]))","v":"A9"},{"$f":"CONCATENATE([Pin17],IF([Pin05]=\"\",\"\",\", \"&[Pin05]))","v":"A9"},{"$f":"CONCATENATE([Pin18],IF([Pin06]=\"\",\"\",\", \"&[Pin06]))","v":"A9"},{"$f":"CONCATENATE([Pin19],IF([Pin07]=\"\",\"\",\", \"&[Pin07]))","v":"A9"},{"$f":"CONCATENATE([Pin20],IF([Pin08]=\"\",\"\",\", \"&[Pin08]))","v":"A9"},{"$f":"CONCATENATE([Pin21],IF([Pin09]=\"\",\"\",\", \"&[Pin09]))","v":"A9"},{"$f":"CONCATENATE([Pin22],IF([Pin10]=\"\",\"\",\", \"&[Pin10]))","v":"A9"},{"$f":"CONCATENATE([Pin23],IF([Pin11]=\"\",\"\",\", \"&[Pin11]))","v":"A9"},{"$f":"CONCATENATE([Pin24],IF([Pin12]=\"\",\"\",\", \"&[Pin12]))","v":"A9"},{"$f":"CONCATENATE([Pin25],IF([Pin13]=\"\",\"\",\", \"&[Pin13]))","v":"A9"},{"$f":"IFERROR(INDEX(Table1[InOut],1/(1/SUMPRODUCT((Table1[Reps]=1)*(Table1[Name]=Table5[[#This Row],[Name]])*Table1[Seq]))),\"\")","v":"I"},{"$f":"IFERROR(INDEX(Table1[Level],1/(1/SUMPRODUCT((Table1[Reps]=1)*(Table1[Name]=Table5[[#This Row],[Name]])*Table1[Seq]))),\"\")","v":"TTL"},{"$f":"IFERROR(INDEX(Table1[Func],1/(1/SUMPRODUCT((Table1[Reps]=1)*(Table1[Name]=Table5[[#This Row],[Name]])*Table1[Seq]))),\"\")","v":"JTAG/SWDCLK."}]
[null,null,"J10","GND","-","Power","GroundreferenceforlogicandI/Opins.",{"$f":"COUNTIF(INDEX([Name],1):Table1[[#This Row],[Name]],[Name])","v":9},{"$f":"IF(ISTEXT([Pin]),[Seq],INDEX([Bnk],[Seq]-1))","v":91},91,null,null,"TDI",{"$f":"IFERROR(INDEX(Table1[Pin],1/(1/SUMPRODUCT((Table1[Reps]=RIGHT(INDEX(Table5[#Headers],coln),2)*1)*(Table1[Name]=Table5[[#This Row],[Name]])*Table1[Bnk]))),\"\")","v":"B8"},{"$f":"IFERROR(INDEX(Table1[Pin],1/(1/SUMPRODUCT((Table1[Reps]=RIGHT(INDEX(Table5[#Headers],coln),2)*1)*(Table1[Name]=Table5[[#This Row],[Name]])*Table1[Bnk]))),\"\")","v":""},{"$f":"IFERROR(INDEX(Table1[Pin],1/(1/SUMPRODUCT((Table1[Reps]=RIGHT(INDEX(Table5[#Headers],coln),2)*1)*(Table1[Name]=Table5[[#This Row],[Name]])*Table1[Bnk]))),\"\")","v":""},{"$f":"IFERROR(INDEX(Table1[Pin],1/(1/SUMPRODUCT((Table1[Reps]=RIGHT(INDEX(Table5[#Headers],coln),2)*1)*(Table1[Name]=Table5[[#This Row],[Name]])*Table1[Bnk]))),\"\")","v":""},{"$f":"IFERROR(INDEX(Table1[Pin],1/(1/SUMPRODUCT((Table1[Reps]=RIGHT(INDEX(Table5[#Headers],coln),2)*1)*(Table1[Name]=Table5[[#This Row],[Name]])*Table1[Bnk]))),\"\")","v":""},{"$f":"IFERROR(INDEX(Table1[Pin],1/(1/SUMPRODUCT((Table1[Reps]=RIGHT(INDEX(Table5[#Headers],coln),2)*1)*(Table1[Name]=Table5[[#This Row],[Name]])*Table1[Bnk]))),\"\")","v":""},{"$f":"IFERROR(INDEX(Table1[Pin],1/(1/SUMPRODUCT((Table1[Reps]=RIGHT(INDEX(Table5[#Headers],coln),2)*1)*(Table1[Name]=Table5[[#This Row],[Name]])*Table1[Bnk]))),\"\")","v":""},{"$f":"IFERROR(INDEX(Table1[Pin],1/(1/SUMPRODUCT((Table1[Reps]=RIGHT(INDEX(Table5[#Headers],coln),2)*1)*(Table1[Name]=Table5[[#This Row],[Name]])*Table1[Bnk]))),\"\")","v":""},{"$f":"IFERROR(INDEX(Table1[Pin],1/(1/SUMPRODUCT((Table1[Reps]=RIGHT(INDEX(Table5[#Headers],coln),2)*1)*(Table1[Name]=Table5[[#This Row],[Name]])*Table1[Bnk]))),\"\")","v":""},{"$f":"IFERROR(INDEX(Table1[Pin],1/(1/SUMPRODUCT((Table1[Reps]=RIGHT(INDEX(Table5[#Headers],coln),2)*1)*(Table1[Name]=Table5[[#This Row],[Name]])*Table1[Bnk]))),\"\")","v":""},{"$f":"IFERROR(INDEX(Table1[Pin],1/(1/SUMPRODUCT((Table1[Reps]=RIGHT(INDEX(Table5[#Headers],coln),2)*1)*(Table1[Name]=Table5[[#This Row],[Name]])*Table1[Bnk]))),\"\")","v":""},{"$f":"IFERROR(INDEX(Table1[Pin],1/(1/SUMPRODUCT((Table1[Reps]=RIGHT(INDEX(Table5[#Headers],coln),2)*1)*(Table1[Name]=Table5[[#This Row],[Name]])*Table1[Bnk]))),\"\")","v":""},{"$f":"IFERROR(INDEX(Table1[Pin],1/(1/SUMPRODUCT((Table1[Reps]=RIGHT(INDEX(Table5[#Headers],coln),2)*1)*(Table1[Name]=Table5[[#This Row],[Name]])*Table1[Bnk]))),\"\")","v":""},{"$f":"[Pin01]","v":"B8"},{"$f":"CONCATENATE([Pin14],IF([Pin02]=\"\",\"\",\", \"&[Pin02]))","v":"B8"},{"$f":"CONCATENATE([Pin15],IF([Pin03]=\"\",\"\",\", \"&[Pin03]))","v":"B8"},{"$f":"CONCATENATE([Pin16],IF([Pin04]=\"\",\"\",\", \"&[Pin04]))","v":"B8"},{"$f":"CONCATENATE([Pin17],IF([Pin05]=\"\",\"\",\", \"&[Pin05]))","v":"B8"},{"$f":"CONCATENATE([Pin18],IF([Pin06]=\"\",\"\",\", \"&[Pin06]))","v":"B8"},{"$f":"CONCATENATE([Pin19],IF([Pin07]=\"\",\"\",\", \"&[Pin07]))","v":"B8"},{"$f":"CONCATENATE([Pin20],IF([Pin08]=\"\",\"\",\", \"&[Pin08]))","v":"B8"},{"$f":"CONCATENATE([Pin21],IF([Pin09]=\"\",\"\",\", \"&[Pin09]))","v":"B8"},{"$f":"CONCATENATE([Pin22],IF([Pin10]=\"\",\"\",\", \"&[Pin10]))","v":"B8"},{"$f":"CONCATENATE([Pin23],IF([Pin11]=\"\",\"\",\", \"&[Pin11]))","v":"B8"},{"$f":"CONCATENATE([Pin24],IF([Pin12]=\"\",\"\",\", \"&[Pin12]))","v":"B8"},{"$f":"CONCATENATE([Pin25],IF([Pin13]=\"\",\"\",\", \"&[Pin13]))","v":"B8"},{"$f":"IFERROR(INDEX(Table1[InOut],1/(1/SUMPRODUCT((Table1[Reps]=1)*(Table1[Name]=Table5[[#This Row],[Name]])*Table1[Seq]))),\"\")","v":"I"},{"$f":"IFERROR(INDEX(Table1[Level],1/(1/SUMPRODUCT((Table1[Reps]=1)*(Table1[Name]=Table5[[#This Row],[Name]])*Table1[Seq]))),\"\")","v":"TTL"},{"$f":"IFERROR(INDEX(Table1[Func],1/(1/SUMPRODUCT((Table1[Reps]=1)*(Table1[Name]=Table5[[#This Row],[Name]])*Table1[Seq]))),\"\")","v":"JTAGTDI."}]
[null,null,"J11","PF2","I/O","TTL","GPIOportFbit2.",{"$f":"COUNTIF(INDEX([Name],1):Table1[[#This Row],[Name]],[Name])","v":1},{"$f":"IF(ISTEXT([Pin]),[Seq],INDEX([Bnk],[Seq]-1))","v":92},92,null,null,"TDO",{"$f":"IFERROR(INDEX(Table1[Pin],1/(1/SUMPRODUCT((Table1[Reps]=RIGHT(INDEX(Table5[#Headers],coln),2)*1)*(Table1[Name]=Table5[[#This Row],[Name]])*Table1[Bnk]))),\"\")","v":"A10"},{"$f":"IFERROR(INDEX(Table1[Pin],1/(1/SUMPRODUCT((Table1[Reps]=RIGHT(INDEX(Table5[#Headers],coln),2)*1)*(Table1[Name]=Table5[[#This Row],[Name]])*Table1[Bnk]))),\"\")","v":""},{"$f":"IFERROR(INDEX(Table1[Pin],1/(1/SUMPRODUCT((Table1[Reps]=RIGHT(INDEX(Table5[#Headers],coln),2)*1)*(Table1[Name]=Table5[[#This Row],[Name]])*Table1[Bnk]))),\"\")","v":""},{"$f":"IFERROR(INDEX(Table1[Pin],1/(1/SUMPRODUCT((Table1[Reps]=RIGHT(INDEX(Table5[#Headers],coln),2)*1)*(Table1[Name]=Table5[[#This Row],[Name]])*Table1[Bnk]))),\"\")","v":""},{"$f":"IFERROR(INDEX(Table1[Pin],1/(1/SUMPRODUCT((Table1[Reps]=RIGHT(INDEX(Table5[#Headers],coln),2)*1)*(Table1[Name]=Table5[[#This Row],[Name]])*Table1[Bnk]))),\"\")","v":""},{"$f":"IFERROR(INDEX(Table1[Pin],1/(1/SUMPRODUCT((Table1[Reps]=RIGHT(INDEX(Table5[#Headers],coln),2)*1)*(Table1[Name]=Table5[[#This Row],[Name]])*Table1[Bnk]))),\"\")","v":""},{"$f":"IFERROR(INDEX(Table1[Pin],1/(1/SUMPRODUCT((Table1[Reps]=RIGHT(INDEX(Table5[#Headers],coln),2)*1)*(Table1[Name]=Table5[[#This Row],[Name]])*Table1[Bnk]))),\"\")","v":""},{"$f":"IFERROR(INDEX(Table1[Pin],1/(1/SUMPRODUCT((Table1[Reps]=RIGHT(INDEX(Table5[#Headers],coln),2)*1)*(Table1[Name]=Table5[[#This Row],[Name]])*Table1[Bnk]))),\"\")","v":""},{"$f":"IFERROR(INDEX(Table1[Pin],1/(1/SUMPRODUCT((Table1[Reps]=RIGHT(INDEX(Table5[#Headers],coln),2)*1)*(Table1[Name]=Table5[[#This Row],[Name]])*Table1[Bnk]))),\"\")","v":""},{"$f":"IFERROR(INDEX(Table1[Pin],1/(1/SUMPRODUCT((Table1[Reps]=RIGHT(INDEX(Table5[#Headers],coln),2)*1)*(Table1[Name]=Table5[[#This Row],[Name]])*Table1[Bnk]))),\"\")","v":""},{"$f":"IFERROR(INDEX(Table1[Pin],1/(1/SUMPRODUCT((Table1[Reps]=RIGHT(INDEX(Table5[#Headers],coln),2)*1)*(Table1[Name]=Table5[[#This Row],[Name]])*Table1[Bnk]))),\"\")","v":""},{"$f":"IFERROR(INDEX(Table1[Pin],1/(1/SUMPRODUCT((Table1[Reps]=RIGHT(INDEX(Table5[#Headers],coln),2)*1)*(Table1[Name]=Table5[[#This Row],[Name]])*Table1[Bnk]))),\"\")","v":""},{"$f":"IFERROR(INDEX(Table1[Pin],1/(1/SUMPRODUCT((Table1[Reps]=RIGHT(INDEX(Table5[#Headers],coln),2)*1)*(Table1[Name]=Table5[[#This Row],[Name]])*Table1[Bnk]))),\"\")","v":""},{"$f":"[Pin01]","v":"A10"},{"$f":"CONCATENATE([Pin14],IF([Pin02]=\"\",\"\",\", \"&[Pin02]))","v":"A10"},{"$f":"CONCATENATE([Pin15],IF([Pin03]=\"\",\"\",\", \"&[Pin03]))","v":"A10"},{"$f":"CONCATENATE([Pin16],IF([Pin04]=\"\",\"\",\", \"&[Pin04]))","v":"A10"},{"$f":"CONCATENATE([Pin17],IF([Pin05]=\"\",\"\",\", \"&[Pin05]))","v":"A10"},{"$f":"CONCATENATE([Pin18],IF([Pin06]=\"\",\"\",\", \"&[Pin06]))","v":"A10"},{"$f":"CONCATENATE([Pin19],IF([Pin07]=\"\",\"\",\", \"&[Pin07]))","v":"A10"},{"$f":"CONCATENATE([Pin20],IF([Pin08]=\"\",\"\",\", \"&[Pin08]))","v":"A10"},{"$f":"CONCATENATE([Pin21],IF([Pin09]=\"\",\"\",\", \"&[Pin09]))","v":"A10"},{"$f":"CONCATENATE([Pin22],IF([Pin10]=\"\",\"\",\", \"&[Pin10]))","v":"A10"},{"$f":"CONCATENATE([Pin23],IF([Pin11]=\"\",\"\",\", \"&[Pin11]))","v":"A10"},{"$f":"CONCATENATE([Pin24],IF([Pin12]=\"\",\"\",\", \"&[Pin12]))","v":"A10"},{"$f":"CONCATENATE([Pin25],IF([Pin13]=\"\",\"\",\", \"&[Pin13]))","v":"A10"},{"$f":"IFERROR(INDEX(Table1[InOut],1/(1/SUMPRODUCT((Table1[Reps]=1)*(Table1[Name]=Table5[[#This Row],[Name]])*Table1[Seq]))),\"\")","v":"O"},{"$f":"IFERROR(INDEX(Table1[Level],1/(1/SUMPRODUCT((Table1[Reps]=1)*(Table1[Name]=Table5[[#This Row],[Name]])*Table1[Seq]))),\"\")","v":"TTL"},{"$f":"IFERROR(INDEX(Table1[Func],1/(1/SUMPRODUCT((Table1[Reps]=1)*(Table1[Name]=Table5[[#This Row],[Name]])*Table1[Seq]))),\"\")","v":"JTAGTDOandSWO."}]
[null,null,null,"LED1","O","TTL","MIILED1.",{"$f":"COUNTIF(INDEX([Name],1):Table1[[#This Row],[Name]],[Name])","v":1},{"$f":"IF(ISTEXT([Pin]),[Seq],INDEX([Bnk],[Seq]-1))","v":92},93,null,null,"TMS",{"$f":"IFERROR(INDEX(Table1[Pin],1/(1/SUMPRODUCT((Table1[Reps]=RIGHT(INDEX(Table5[#Headers],coln),2)*1)*(Table1[Name]=Table5[[#This Row],[Name]])*Table1[Bnk]))),\"\")","v":"B9"},{"$f":"IFERROR(INDEX(Table1[Pin],1/(1/SUMPRODUCT((Table1[Reps]=RIGHT(INDEX(Table5[#Headers],coln),2)*1)*(Table1[Name]=Table5[[#This Row],[Name]])*Table1[Bnk]))),\"\")","v":""},{"$f":"IFERROR(INDEX(Table1[Pin],1/(1/SUMPRODUCT((Table1[Reps]=RIGHT(INDEX(Table5[#Headers],coln),2)*1)*(Table1[Name]=Table5[[#This Row],[Name]])*Table1[Bnk]))),\"\")","v":""},{"$f":"IFERROR(INDEX(Table1[Pin],1/(1/SUMPRODUCT((Table1[Reps]=RIGHT(INDEX(Table5[#Headers],coln),2)*1)*(Table1[Name]=Table5[[#This Row],[Name]])*Table1[Bnk]))),\"\")","v":""},{"$f":"IFERROR(INDEX(Table1[Pin],1/(1/SUMPRODUCT((Table1[Reps]=RIGHT(INDEX(Table5[#Headers],coln),2)*1)*(Table1[Name]=Table5[[#This Row],[Name]])*Table1[Bnk]))),\"\")","v":""},{"$f":"IFERROR(INDEX(Table1[Pin],1/(1/SUMPRODUCT((Table1[Reps]=RIGHT(INDEX(Table5[#Headers],coln),2)*1)*(Table1[Name]=Table5[[#This Row],[Name]])*Table1[Bnk]))),\"\")","v":""},{"$f":"IFERROR(INDEX(Table1[Pin],1/(1/SUMPRODUCT((Table1[Reps]=RIGHT(INDEX(Table5[#Headers],coln),2)*1)*(Table1[Name]=Table5[[#This Row],[Name]])*Table1[Bnk]))),\"\")","v":""},{"$f":"IFERROR(INDEX(Table1[Pin],1/(1/SUMPRODUCT((Table1[Reps]=RIGHT(INDEX(Table5[#Headers],coln),2)*1)*(Table1[Name]=Table5[[#This Row],[Name]])*Table1[Bnk]))),\"\")","v":""},{"$f":"IFERROR(INDEX(Table1[Pin],1/(1/SUMPRODUCT((Table1[Reps]=RIGHT(INDEX(Table5[#Headers],coln),2)*1)*(Table1[Name]=Table5[[#This Row],[Name]])*Table1[Bnk]))),\"\")","v":""},{"$f":"IFERROR(INDEX(Table1[Pin],1/(1/SUMPRODUCT((Table1[Reps]=RIGHT(INDEX(Table5[#Headers],coln),2)*1)*(Table1[Name]=Table5[[#This Row],[Name]])*Table1[Bnk]))),\"\")","v":""},{"$f":"IFERROR(INDEX(Table1[Pin],1/(1/SUMPRODUCT((Table1[Reps]=RIGHT(INDEX(Table5[#Headers],coln),2)*1)*(Table1[Name]=Table5[[#This Row],[Name]])*Table1[Bnk]))),\"\")","v":""},{"$f":"IFERROR(INDEX(Table1[Pin],1/(1/SUMPRODUCT((Table1[Reps]=RIGHT(INDEX(Table5[#Headers],coln),2)*1)*(Table1[Name]=Table5[[#This Row],[Name]])*Table1[Bnk]))),\"\")","v":""},{"$f":"IFERROR(INDEX(Table1[Pin],1/(1/SUMPRODUCT((Table1[Reps]=RIGHT(INDEX(Table5[#Headers],coln),2)*1)*(Table1[Name]=Table5[[#This Row],[Name]])*Table1[Bnk]))),\"\")","v":""},{"$f":"[Pin01]","v":"B9"},{"$f":"CONCATENATE([Pin14],IF([Pin02]=\"\",\"\",\", \"&[Pin02]))","v":"B9"},{"$f":"CONCATENATE([Pin15],IF([Pin03]=\"\",\"\",\", \"&[Pin03]))","v":"B9"},{"$f":"CONCATENATE([Pin16],IF([Pin04]=\"\",\"\",\", \"&[Pin04]))","v":"B9"},{"$f":"CONCATENATE([Pin17],IF([Pin05]=\"\",\"\",\", \"&[Pin05]))","v":"B9"},{"$f":"CONCATENATE([Pin18],IF([Pin06]=\"\",\"\",\", \"&[Pin06]))","v":"B9"},{"$f":"CONCATENATE([Pin19],IF([Pin07]=\"\",\"\",\", \"&[Pin07]))","v":"B9"},{"$f":"CONCATENATE([Pin20],IF([Pin08]=\"\",\"\",\", \"&[Pin08]))","v":"B9"},{"$f":"CONCATENATE([Pin21],IF([Pin09]=\"\",\"\",\", \"&[Pin09]))","v":"B9"},{"$f":"CONCATENATE([Pin22],IF([Pin10]=\"\",\"\",\", \"&[Pin10]))","v":"B9"},{"$f":"CONCATENATE([Pin23],IF([Pin11]=\"\",\"\",\", \"&[Pin11]))","v":"B9"},{"$f":"CONCATENATE([Pin24],IF([Pin12]=\"\",\"\",\", \"&[Pin12]))","v":"B9"},{"$f":"CONCATENATE([Pin25],IF([Pin13]=\"\",\"\",\", \"&[Pin13]))","v":"B9"},{"$f":"IFERROR(INDEX(Table1[InOut],1/(1/SUMPRODUCT((Table1[Reps]=1)*(Table1[Name]=Table5[[#This Row],[Name]])*Table1[Seq]))),\"\")","v":"I/O"},{"$f":"IFERROR(INDEX(Table1[Level],1/(1/SUMPRODUCT((Table1[Reps]=1)*(Table1[Name]=Table5[[#This Row],[Name]])*Table1[Seq]))),\"\")","v":"TTL"},{"$f":"IFERROR(INDEX(Table1[Func],1/(1/SUMPRODUCT((Table1[Reps]=1)*(Table1[Name]=Table5[[#This Row],[Name]])*Table1[Seq]))),\"\")","v":"JTAGTMSandSWDIO."}]
[null,null,"J12","PF3","I/O","TTL","GPIOportFbit3.",{"$f":"COUNTIF(INDEX([Name],1):Table1[[#This Row],[Name]],[Name])","v":1},{"$f":"IF(ISTEXT([Pin]),[Seq],INDEX([Bnk],[Seq]-1))","v":94},94,null,null,"TRST",{"$f":"IFERROR(INDEX(Table1[Pin],1/(1/SUMPRODUCT((Table1[Reps]=RIGHT(INDEX(Table5[#Headers],coln),2)*1)*(Table1[Name]=Table5[[#This Row],[Name]])*Table1[Bnk]))),\"\")","v":"A8"},{"$f":"IFERROR(INDEX(Table1[Pin],1/(1/SUMPRODUCT((Table1[Reps]=RIGHT(INDEX(Table5[#Headers],coln),2)*1)*(Table1[Name]=Table5[[#This Row],[Name]])*Table1[Bnk]))),\"\")","v":""},{"$f":"IFERROR(INDEX(Table1[Pin],1/(1/SUMPRODUCT((Table1[Reps]=RIGHT(INDEX(Table5[#Headers],coln),2)*1)*(Table1[Name]=Table5[[#This Row],[Name]])*Table1[Bnk]))),\"\")","v":""},{"$f":"IFERROR(INDEX(Table1[Pin],1/(1/SUMPRODUCT((Table1[Reps]=RIGHT(INDEX(Table5[#Headers],coln),2)*1)*(Table1[Name]=Table5[[#This Row],[Name]])*Table1[Bnk]))),\"\")","v":""},{"$f":"IFERROR(INDEX(Table1[Pin],1/(1/SUMPRODUCT((Table1[Reps]=RIGHT(INDEX(Table5[#Headers],coln),2)*1)*(Table1[Name]=Table5[[#This Row],[Name]])*Table1[Bnk]))),\"\")","v":""},{"$f":"IFERROR(INDEX(Table1[Pin],1/(1/SUMPRODUCT((Table1[Reps]=RIGHT(INDEX(Table5[#Headers],coln),2)*1)*(Table1[Name]=Table5[[#This Row],[Name]])*Table1[Bnk]))),\"\")","v":""},{"$f":"IFERROR(INDEX(Table1[Pin],1/(1/SUMPRODUCT((Table1[Reps]=RIGHT(INDEX(Table5[#Headers],coln),2)*1)*(Table1[Name]=Table5[[#This Row],[Name]])*Table1[Bnk]))),\"\")","v":""},{"$f":"IFERROR(INDEX(Table1[Pin],1/(1/SUMPRODUCT((Table1[Reps]=RIGHT(INDEX(Table5[#Headers],coln),2)*1)*(Table1[Name]=Table5[[#This Row],[Name]])*Table1[Bnk]))),\"\")","v":""},{"$f":"IFERROR(INDEX(Table1[Pin],1/(1/SUMPRODUCT((Table1[Reps]=RIGHT(INDEX(Table5[#Headers],coln),2)*1)*(Table1[Name]=Table5[[#This Row],[Name]])*Table1[Bnk]))),\"\")","v":""},{"$f":"IFERROR(INDEX(Table1[Pin],1/(1/SUMPRODUCT((Table1[Reps]=RIGHT(INDEX(Table5[#Headers],coln),2)*1)*(Table1[Name]=Table5[[#This Row],[Name]])*Table1[Bnk]))),\"\")","v":""},{"$f":"IFERROR(INDEX(Table1[Pin],1/(1/SUMPRODUCT((Table1[Reps]=RIGHT(INDEX(Table5[#Headers],coln),2)*1)*(Table1[Name]=Table5[[#This Row],[Name]])*Table1[Bnk]))),\"\")","v":""},{"$f":"IFERROR(INDEX(Table1[Pin],1/(1/SUMPRODUCT((Table1[Reps]=RIGHT(INDEX(Table5[#Headers],coln),2)*1)*(Table1[Name]=Table5[[#This Row],[Name]])*Table1[Bnk]))),\"\")","v":""},{"$f":"IFERROR(INDEX(Table1[Pin],1/(1/SUMPRODUCT((Table1[Reps]=RIGHT(INDEX(Table5[#Headers],coln),2)*1)*(Table1[Name]=Table5[[#This Row],[Name]])*Table1[Bnk]))),\"\")","v":""},{"$f":"[Pin01]","v":"A8"},{"$f":"CONCATENATE([Pin14],IF([Pin02]=\"\",\"\",\", \"&[Pin02]))","v":"A8"},{"$f":"CONCATENATE([Pin15],IF([Pin03]=\"\",\"\",\", \"&[Pin03]))","v":"A8"},{"$f":"CONCATENATE([Pin16],IF([Pin04]=\"\",\"\",\", \"&[Pin04]))","v":"A8"},{"$f":"CONCATENATE([Pin17],IF([Pin05]=\"\",\"\",\", \"&[Pin05]))","v":"A8"},{"$f":"CONCATENATE([Pin18],IF([Pin06]=\"\",\"\",\", \"&[Pin06]))","v":"A8"},{"$f":"CONCATENATE([Pin19],IF([Pin07]=\"\",\"\",\", \"&[Pin07]))","v":"A8"},{"$f":"CONCATENATE([Pin20],IF([Pin08]=\"\",\"\",\", \"&[Pin08]))","v":"A8"},{"$f":"CONCATENATE([Pin21],IF([Pin09]=\"\",\"\",\", \"&[Pin09]))","v":"A8"},{"$f":"CONCATENATE([Pin22],IF([Pin10]=\"\",\"\",\", \"&[Pin10]))","v":"A8"},{"$f":"CONCATENATE([Pin23],IF([Pin11]=\"\",\"\",\", \"&[Pin11]))","v":"A8"},{"$f":"CONCATENATE([Pin24],IF([Pin12]=\"\",\"\",\", \"&[Pin12]))","v":"A8"},{"$f":"CONCATENATE([Pin25],IF([Pin13]=\"\",\"\",\", \"&[Pin13]))","v":"A8"},{"$f":"IFERROR(INDEX(Table1[InOut],1/(1/SUMPRODUCT((Table1[Reps]=1)*(Table1[Name]=Table5[[#This Row],[Name]])*Table1[Seq]))),\"\")","v":"I"},{"$f":"IFERROR(INDEX(Table1[Level],1/(1/SUMPRODUCT((Table1[Reps]=1)*(Table1[Name]=Table5[[#This Row],[Name]])*Table1[Seq]))),\"\")","v":"TTL"},{"$f":"IFERROR(INDEX(Table1[Func],1/(1/SUMPRODUCT((Table1[Reps]=1)*(Table1[Name]=Table5[[#This Row],[Name]])*Table1[Seq]))),\"\")","v":"JTAGTRST."}]
[null,null,null,"LED0","O","TTL","MIILED0.",{"$f":"COUNTIF(INDEX([Name],1):Table1[[#This Row],[Name]],[Name])","v":1},{"$f":"IF(ISTEXT([Pin]),[Seq],INDEX([Bnk],[Seq]-1))","v":94},95,null,null,"TXON",{"$f":"IFERROR(INDEX(Table1[Pin],1/(1/SUMPRODUCT((Table1[Reps]=RIGHT(INDEX(Table5[#Headers],coln),2)*1)*(Table1[Name]=Table5[[#This Row],[Name]])*Table1[Bnk]))),\"\")","v":"L8"},{"$f":"IFERROR(INDEX(Table1[Pin],1/(1/SUMPRODUCT((Table1[Reps]=RIGHT(INDEX(Table5[#Headers],coln),2)*1)*(Table1[Name]=Table5[[#This Row],[Name]])*Table1[Bnk]))),\"\")","v":""},{"$f":"IFERROR(INDEX(Table1[Pin],1/(1/SUMPRODUCT((Table1[Reps]=RIGHT(INDEX(Table5[#Headers],coln),2)*1)*(Table1[Name]=Table5[[#This Row],[Name]])*Table1[Bnk]))),\"\")","v":""},{"$f":"IFERROR(INDEX(Table1[Pin],1/(1/SUMPRODUCT((Table1[Reps]=RIGHT(INDEX(Table5[#Headers],coln),2)*1)*(Table1[Name]=Table5[[#This Row],[Name]])*Table1[Bnk]))),\"\")","v":""},{"$f":"IFERROR(INDEX(Table1[Pin],1/(1/SUMPRODUCT((Table1[Reps]=RIGHT(INDEX(Table5[#Headers],coln),2)*1)*(Table1[Name]=Table5[[#This Row],[Name]])*Table1[Bnk]))),\"\")","v":""},{"$f":"IFERROR(INDEX(Table1[Pin],1/(1/SUMPRODUCT((Table1[Reps]=RIGHT(INDEX(Table5[#Headers],coln),2)*1)*(Table1[Name]=Table5[[#This Row],[Name]])*Table1[Bnk]))),\"\")","v":""},{"$f":"IFERROR(INDEX(Table1[Pin],1/(1/SUMPRODUCT((Table1[Reps]=RIGHT(INDEX(Table5[#Headers],coln),2)*1)*(Table1[Name]=Table5[[#This Row],[Name]])*Table1[Bnk]))),\"\")","v":""},{"$f":"IFERROR(INDEX(Table1[Pin],1/(1/SUMPRODUCT((Table1[Reps]=RIGHT(INDEX(Table5[#Headers],coln),2)*1)*(Table1[Name]=Table5[[#This Row],[Name]])*Table1[Bnk]))),\"\")","v":""},{"$f":"IFERROR(INDEX(Table1[Pin],1/(1/SUMPRODUCT((Table1[Reps]=RIGHT(INDEX(Table5[#Headers],coln),2)*1)*(Table1[Name]=Table5[[#This Row],[Name]])*Table1[Bnk]))),\"\")","v":""},{"$f":"IFERROR(INDEX(Table1[Pin],1/(1/SUMPRODUCT((Table1[Reps]=RIGHT(INDEX(Table5[#Headers],coln),2)*1)*(Table1[Name]=Table5[[#This Row],[Name]])*Table1[Bnk]))),\"\")","v":""},{"$f":"IFERROR(INDEX(Table1[Pin],1/(1/SUMPRODUCT((Table1[Reps]=RIGHT(INDEX(Table5[#Headers],coln),2)*1)*(Table1[Name]=Table5[[#This Row],[Name]])*Table1[Bnk]))),\"\")","v":""},{"$f":"IFERROR(INDEX(Table1[Pin],1/(1/SUMPRODUCT((Table1[Reps]=RIGHT(INDEX(Table5[#Headers],coln),2)*1)*(Table1[Name]=Table5[[#This Row],[Name]])*Table1[Bnk]))),\"\")","v":""},{"$f":"IFERROR(INDEX(Table1[Pin],1/(1/SUMPRODUCT((Table1[Reps]=RIGHT(INDEX(Table5[#Headers],coln),2)*1)*(Table1[Name]=Table5[[#This Row],[Name]])*Table1[Bnk]))),\"\")","v":""},{"$f":"[Pin01]","v":"L8"},{"$f":"CONCATENATE([Pin14],IF([Pin02]=\"\",\"\",\", \"&[Pin02]))","v":"L8"},{"$f":"CONCATENATE([Pin15],IF([Pin03]=\"\",\"\",\", \"&[Pin03]))","v":"L8"},{"$f":"CONCATENATE([Pin16],IF([Pin04]=\"\",\"\",\", \"&[Pin04]))","v":"L8"},{"$f":"CONCATENATE([Pin17],IF([Pin05]=\"\",\"\",\", \"&[Pin05]))","v":"L8"},{"$f":"CONCATENATE([Pin18],IF([Pin06]=\"\",\"\",\", \"&[Pin06]))","v":"L8"},{"$f":"CONCATENATE([Pin19],IF([Pin07]=\"\",\"\",\", \"&[Pin07]))","v":"L8"},{"$f":"CONCATENATE([Pin20],IF([Pin08]=\"\",\"\",\", \"&[Pin08]))","v":"L8"},{"$f":"CONCATENATE([Pin21],IF([Pin09]=\"\",\"\",\", \"&[Pin09]))","v":"L8"},{"$f":"CONCATENATE([Pin22],IF([Pin10]=\"\",\"\",\", \"&[Pin10]))","v":"L8"},{"$f":"CONCATENATE([Pin23],IF([Pin11]=\"\",\"\",\", \"&[Pin11]))","v":"L8"},{"$f":"CONCATENATE([Pin24],IF([Pin12]=\"\",\"\",\", \"&[Pin12]))","v":"L8"},{"$f":"CONCATENATE([Pin25],IF([Pin13]=\"\",\"\",\", \"&[Pin13]))","v":"L8"},{"$f":"IFERROR(INDEX(Table1[InOut],1/(1/SUMPRODUCT((Table1[Reps]=1)*(Table1[Name]=Table5[[#This Row],[Name]])*Table1[Seq]))),\"\")","v":"O"},{"$f":"IFERROR(INDEX(Table1[Level],1/(1/SUMPRODUCT((Table1[Reps]=1)*(Table1[Name]=Table5[[#This Row],[Name]])*Table1[Seq]))),\"\")","v":"Analog"},{"$f":"IFERROR(INDEX(Table1[Func],1/(1/SUMPRODUCT((Table1[Reps]=1)*(Table1[Name]=Table5[[#This Row],[Name]])*Table1[Seq]))),\"\")","v":"TXONoftheEthernetPHY."}]
[null,null,"K1","PG0","I/O","TTL","GPIOportGbit0.",{"$f":"COUNTIF(INDEX([Name],1):Table1[[#This Row],[Name]],[Name])","v":1},{"$f":"IF(ISTEXT([Pin]),[Seq],INDEX([Bnk],[Seq]-1))","v":96},96,null,null,"TXOP",{"$f":"IFERROR(INDEX(Table1[Pin],1/(1/SUMPRODUCT((Table1[Reps]=RIGHT(INDEX(Table5[#Headers],coln),2)*1)*(Table1[Name]=Table5[[#This Row],[Name]])*Table1[Bnk]))),\"\")","v":"M8"},{"$f":"IFERROR(INDEX(Table1[Pin],1/(1/SUMPRODUCT((Table1[Reps]=RIGHT(INDEX(Table5[#Headers],coln),2)*1)*(Table1[Name]=Table5[[#This Row],[Name]])*Table1[Bnk]))),\"\")","v":""},{"$f":"IFERROR(INDEX(Table1[Pin],1/(1/SUMPRODUCT((Table1[Reps]=RIGHT(INDEX(Table5[#Headers],coln),2)*1)*(Table1[Name]=Table5[[#This Row],[Name]])*Table1[Bnk]))),\"\")","v":""},{"$f":"IFERROR(INDEX(Table1[Pin],1/(1/SUMPRODUCT((Table1[Reps]=RIGHT(INDEX(Table5[#Headers],coln),2)*1)*(Table1[Name]=Table5[[#This Row],[Name]])*Table1[Bnk]))),\"\")","v":""},{"$f":"IFERROR(INDEX(Table1[Pin],1/(1/SUMPRODUCT((Table1[Reps]=RIGHT(INDEX(Table5[#Headers],coln),2)*1)*(Table1[Name]=Table5[[#This Row],[Name]])*Table1[Bnk]))),\"\")","v":""},{"$f":"IFERROR(INDEX(Table1[Pin],1/(1/SUMPRODUCT((Table1[Reps]=RIGHT(INDEX(Table5[#Headers],coln),2)*1)*(Table1[Name]=Table5[[#This Row],[Name]])*Table1[Bnk]))),\"\")","v":""},{"$f":"IFERROR(INDEX(Table1[Pin],1/(1/SUMPRODUCT((Table1[Reps]=RIGHT(INDEX(Table5[#Headers],coln),2)*1)*(Table1[Name]=Table5[[#This Row],[Name]])*Table1[Bnk]))),\"\")","v":""},{"$f":"IFERROR(INDEX(Table1[Pin],1/(1/SUMPRODUCT((Table1[Reps]=RIGHT(INDEX(Table5[#Headers],coln),2)*1)*(Table1[Name]=Table5[[#This Row],[Name]])*Table1[Bnk]))),\"\")","v":""},{"$f":"IFERROR(INDEX(Table1[Pin],1/(1/SUMPRODUCT((Table1[Reps]=RIGHT(INDEX(Table5[#Headers],coln),2)*1)*(Table1[Name]=Table5[[#This Row],[Name]])*Table1[Bnk]))),\"\")","v":""},{"$f":"IFERROR(INDEX(Table1[Pin],1/(1/SUMPRODUCT((Table1[Reps]=RIGHT(INDEX(Table5[#Headers],coln),2)*1)*(Table1[Name]=Table5[[#This Row],[Name]])*Table1[Bnk]))),\"\")","v":""},{"$f":"IFERROR(INDEX(Table1[Pin],1/(1/SUMPRODUCT((Table1[Reps]=RIGHT(INDEX(Table5[#Headers],coln),2)*1)*(Table1[Name]=Table5[[#This Row],[Name]])*Table1[Bnk]))),\"\")","v":""},{"$f":"IFERROR(INDEX(Table1[Pin],1/(1/SUMPRODUCT((Table1[Reps]=RIGHT(INDEX(Table5[#Headers],coln),2)*1)*(Table1[Name]=Table5[[#This Row],[Name]])*Table1[Bnk]))),\"\")","v":""},{"$f":"IFERROR(INDEX(Table1[Pin],1/(1/SUMPRODUCT((Table1[Reps]=RIGHT(INDEX(Table5[#Headers],coln),2)*1)*(Table1[Name]=Table5[[#This Row],[Name]])*Table1[Bnk]))),\"\")","v":""},{"$f":"[Pin01]","v":"M8"},{"$f":"CONCATENATE([Pin14],IF([Pin02]=\"\",\"\",\", \"&[Pin02]))","v":"M8"},{"$f":"CONCATENATE([Pin15],IF([Pin03]=\"\",\"\",\", \"&[Pin03]))","v":"M8"},{"$f":"CONCATENATE([Pin16],IF([Pin04]=\"\",\"\",\", \"&[Pin04]))","v":"M8"},{"$f":"CONCATENATE([Pin17],IF([Pin05]=\"\",\"\",\", \"&[Pin05]))","v":"M8"},{"$f":"CONCATENATE([Pin18],IF([Pin06]=\"\",\"\",\", \"&[Pin06]))","v":"M8"},{"$f":"CONCATENATE([Pin19],IF([Pin07]=\"\",\"\",\", \"&[Pin07]))","v":"M8"},{"$f":"CONCATENATE([Pin20],IF([Pin08]=\"\",\"\",\", \"&[Pin08]))","v":"M8"},{"$f":"CONCATENATE([Pin21],IF([Pin09]=\"\",\"\",\", \"&[Pin09]))","v":"M8"},{"$f":"CONCATENATE([Pin22],IF([Pin10]=\"\",\"\",\", \"&[Pin10]))","v":"M8"},{"$f":"CONCATENATE([Pin23],IF([Pin11]=\"\",\"\",\", \"&[Pin11]))","v":"M8"},{"$f":"CONCATENATE([Pin24],IF([Pin12]=\"\",\"\",\", \"&[Pin12]))","v":"M8"},{"$f":"CONCATENATE([Pin25],IF([Pin13]=\"\",\"\",\", \"&[Pin13]))","v":"M8"},{"$f":"IFERROR(INDEX(Table1[InOut],1/(1/SUMPRODUCT((Table1[Reps]=1)*(Table1[Name]=Table5[[#This Row],[Name]])*Table1[Seq]))),\"\")","v":"O"},{"$f":"IFERROR(INDEX(Table1[Level],1/(1/SUMPRODUCT((Table1[Reps]=1)*(Table1[Name]=Table5[[#This Row],[Name]])*Table1[Seq]))),\"\")","v":"Analog"},{"$f":"IFERROR(INDEX(Table1[Func],1/(1/SUMPRODUCT((Table1[Reps]=1)*(Table1[Name]=Table5[[#This Row],[Name]])*Table1[Seq]))),\"\")","v":"TXOPoftheEthernetPHY."}]
[null,null,null,"I2C1SCL","O","TTL","2Cmodule1clock.",{"$f":"COUNTIF(INDEX([Name],1):Table1[[#This Row],[Name]],[Name])","v":1},{"$f":"IF(ISTEXT([Pin]),[Seq],INDEX([Bnk],[Seq]-1))","v":96},97,null,null,"U0Rx",{"$f":"IFERROR(INDEX(Table1[Pin],1/(1/SUMPRODUCT((Table1[Reps]=RIGHT(INDEX(Table5[#Headers],coln),2)*1)*(Table1[Name]=Table5[[#This Row],[Name]])*Table1[Bnk]))),\"\")","v":"L3"},{"$f":"IFERROR(INDEX(Table1[Pin],1/(1/SUMPRODUCT((Table1[Reps]=RIGHT(INDEX(Table5[#Headers],coln),2)*1)*(Table1[Name]=Table5[[#This Row],[Name]])*Table1[Bnk]))),\"\")","v":""},{"$f":"IFERROR(INDEX(Table1[Pin],1/(1/SUMPRODUCT((Table1[Reps]=RIGHT(INDEX(Table5[#Headers],coln),2)*1)*(Table1[Name]=Table5[[#This Row],[Name]])*Table1[Bnk]))),\"\")","v":""},{"$f":"IFERROR(INDEX(Table1[Pin],1/(1/SUMPRODUCT((Table1[Reps]=RIGHT(INDEX(Table5[#Headers],coln),2)*1)*(Table1[Name]=Table5[[#This Row],[Name]])*Table1[Bnk]))),\"\")","v":""},{"$f":"IFERROR(INDEX(Table1[Pin],1/(1/SUMPRODUCT((Table1[Reps]=RIGHT(INDEX(Table5[#Headers],coln),2)*1)*(Table1[Name]=Table5[[#This Row],[Name]])*Table1[Bnk]))),\"\")","v":""},{"$f":"IFERROR(INDEX(Table1[Pin],1/(1/SUMPRODUCT((Table1[Reps]=RIGHT(INDEX(Table5[#Headers],coln),2)*1)*(Table1[Name]=Table5[[#This Row],[Name]])*Table1[Bnk]))),\"\")","v":""},{"$f":"IFERROR(INDEX(Table1[Pin],1/(1/SUMPRODUCT((Table1[Reps]=RIGHT(INDEX(Table5[#Headers],coln),2)*1)*(Table1[Name]=Table5[[#This Row],[Name]])*Table1[Bnk]))),\"\")","v":""},{"$f":"IFERROR(INDEX(Table1[Pin],1/(1/SUMPRODUCT((Table1[Reps]=RIGHT(INDEX(Table5[#Headers],coln),2)*1)*(Table1[Name]=Table5[[#This Row],[Name]])*Table1[Bnk]))),\"\")","v":""},{"$f":"IFERROR(INDEX(Table1[Pin],1/(1/SUMPRODUCT((Table1[Reps]=RIGHT(INDEX(Table5[#Headers],coln),2)*1)*(Table1[Name]=Table5[[#This Row],[Name]])*Table1[Bnk]))),\"\")","v":""},{"$f":"IFERROR(INDEX(Table1[Pin],1/(1/SUMPRODUCT((Table1[Reps]=RIGHT(INDEX(Table5[#Headers],coln),2)*1)*(Table1[Name]=Table5[[#This Row],[Name]])*Table1[Bnk]))),\"\")","v":""},{"$f":"IFERROR(INDEX(Table1[Pin],1/(1/SUMPRODUCT((Table1[Reps]=RIGHT(INDEX(Table5[#Headers],coln),2)*1)*(Table1[Name]=Table5[[#This Row],[Name]])*Table1[Bnk]))),\"\")","v":""},{"$f":"IFERROR(INDEX(Table1[Pin],1/(1/SUMPRODUCT((Table1[Reps]=RIGHT(INDEX(Table5[#Headers],coln),2)*1)*(Table1[Name]=Table5[[#This Row],[Name]])*Table1[Bnk]))),\"\")","v":""},{"$f":"IFERROR(INDEX(Table1[Pin],1/(1/SUMPRODUCT((Table1[Reps]=RIGHT(INDEX(Table5[#Headers],coln),2)*1)*(Table1[Name]=Table5[[#This Row],[Name]])*Table1[Bnk]))),\"\")","v":""},{"$f":"[Pin01]","v":"L3"},{"$f":"CONCATENATE([Pin14],IF([Pin02]=\"\",\"\",\", \"&[Pin02]))","v":"L3"},{"$f":"CONCATENATE([Pin15],IF([Pin03]=\"\",\"\",\", \"&[Pin03]))","v":"L3"},{"$f":"CONCATENATE([Pin16],IF([Pin04]=\"\",\"\",\", \"&[Pin04]))","v":"L3"},{"$f":"CONCATENATE([Pin17],IF([Pin05]=\"\",\"\",\", \"&[Pin05]))","v":"L3"},{"$f":"CONCATENATE([Pin18],IF([Pin06]=\"\",\"\",\", \"&[Pin06]))","v":"L3"},{"$f":"CONCATENATE([Pin19],IF([Pin07]=\"\",\"\",\", \"&[Pin07]))","v":"L3"},{"$f":"CONCATENATE([Pin20],IF([Pin08]=\"\",\"\",\", \"&[Pin08]))","v":"L3"},{"$f":"CONCATENATE([Pin21],IF([Pin09]=\"\",\"\",\", \"&[Pin09]))","v":"L3"},{"$f":"CONCATENATE([Pin22],IF([Pin10]=\"\",\"\",\", \"&[Pin10]))","v":"L3"},{"$f":"CONCATENATE([Pin23],IF([Pin11]=\"\",\"\",\", \"&[Pin11]))","v":"L3"},{"$f":"CONCATENATE([Pin24],IF([Pin12]=\"\",\"\",\", \"&[Pin12]))","v":"L3"},{"$f":"CONCATENATE([Pin25],IF([Pin13]=\"\",\"\",\", \"&[Pin13]))","v":"L3"},{"$f":"IFERROR(INDEX(Table1[InOut],1/(1/SUMPRODUCT((Table1[Reps]=1)*(Table1[Name]=Table5[[#This Row],[Name]])*Table1[Seq]))),\"\")","v":"I"},{"$f":"IFERROR(INDEX(Table1[Level],1/(1/SUMPRODUCT((Table1[Reps]=1)*(Table1[Name]=Table5[[#This Row],[Name]])*Table1[Seq]))),\"\")","v":"TTL"},{"$f":"IFERROR(INDEX(Table1[Func],1/(1/SUMPRODUCT((Table1[Reps]=1)*(Table1[Name]=Table5[[#This Row],[Name]])*Table1[Seq]))),\"\")","v":"UARTmodule0receive.WheninIrDAmode,thissignalhasIrDA"}]
[null,null,"K2","PG1","I/O","TTL","GPIOportGbit1.",{"$f":"COUNTIF(INDEX([Name],1):Table1[[#This Row],[Name]],[Name])","v":1},{"$f":"IF(ISTEXT([Pin]),[Seq],INDEX([Bnk],[Seq]-1))","v":98},98,null,null,"U0Tx",{"$f":"IFERROR(INDEX(Table1[Pin],1/(1/SUMPRODUCT((Table1[Reps]=RIGHT(INDEX(Table5[#Headers],coln),2)*1)*(Table1[Name]=Table5[[#This Row],[Name]])*Table1[Bnk]))),\"\")","v":"M3"},{"$f":"IFERROR(INDEX(Table1[Pin],1/(1/SUMPRODUCT((Table1[Reps]=RIGHT(INDEX(Table5[#Headers],coln),2)*1)*(Table1[Name]=Table5[[#This Row],[Name]])*Table1[Bnk]))),\"\")","v":""},{"$f":"IFERROR(INDEX(Table1[Pin],1/(1/SUMPRODUCT((Table1[Reps]=RIGHT(INDEX(Table5[#Headers],coln),2)*1)*(Table1[Name]=Table5[[#This Row],[Name]])*Table1[Bnk]))),\"\")","v":""},{"$f":"IFERROR(INDEX(Table1[Pin],1/(1/SUMPRODUCT((Table1[Reps]=RIGHT(INDEX(Table5[#Headers],coln),2)*1)*(Table1[Name]=Table5[[#This Row],[Name]])*Table1[Bnk]))),\"\")","v":""},{"$f":"IFERROR(INDEX(Table1[Pin],1/(1/SUMPRODUCT((Table1[Reps]=RIGHT(INDEX(Table5[#Headers],coln),2)*1)*(Table1[Name]=Table5[[#This Row],[Name]])*Table1[Bnk]))),\"\")","v":""},{"$f":"IFERROR(INDEX(Table1[Pin],1/(1/SUMPRODUCT((Table1[Reps]=RIGHT(INDEX(Table5[#Headers],coln),2)*1)*(Table1[Name]=Table5[[#This Row],[Name]])*Table1[Bnk]))),\"\")","v":""},{"$f":"IFERROR(INDEX(Table1[Pin],1/(1/SUMPRODUCT((Table1[Reps]=RIGHT(INDEX(Table5[#Headers],coln),2)*1)*(Table1[Name]=Table5[[#This Row],[Name]])*Table1[Bnk]))),\"\")","v":""},{"$f":"IFERROR(INDEX(Table1[Pin],1/(1/SUMPRODUCT((Table1[Reps]=RIGHT(INDEX(Table5[#Headers],coln),2)*1)*(Table1[Name]=Table5[[#This Row],[Name]])*Table1[Bnk]))),\"\")","v":""},{"$f":"IFERROR(INDEX(Table1[Pin],1/(1/SUMPRODUCT((Table1[Reps]=RIGHT(INDEX(Table5[#Headers],coln),2)*1)*(Table1[Name]=Table5[[#This Row],[Name]])*Table1[Bnk]))),\"\")","v":""},{"$f":"IFERROR(INDEX(Table1[Pin],1/(1/SUMPRODUCT((Table1[Reps]=RIGHT(INDEX(Table5[#Headers],coln),2)*1)*(Table1[Name]=Table5[[#This Row],[Name]])*Table1[Bnk]))),\"\")","v":""},{"$f":"IFERROR(INDEX(Table1[Pin],1/(1/SUMPRODUCT((Table1[Reps]=RIGHT(INDEX(Table5[#Headers],coln),2)*1)*(Table1[Name]=Table5[[#This Row],[Name]])*Table1[Bnk]))),\"\")","v":""},{"$f":"IFERROR(INDEX(Table1[Pin],1/(1/SUMPRODUCT((Table1[Reps]=RIGHT(INDEX(Table5[#Headers],coln),2)*1)*(Table1[Name]=Table5[[#This Row],[Name]])*Table1[Bnk]))),\"\")","v":""},{"$f":"IFERROR(INDEX(Table1[Pin],1/(1/SUMPRODUCT((Table1[Reps]=RIGHT(INDEX(Table5[#Headers],coln),2)*1)*(Table1[Name]=Table5[[#This Row],[Name]])*Table1[Bnk]))),\"\")","v":""},{"$f":"[Pin01]","v":"M3"},{"$f":"CONCATENATE([Pin14],IF([Pin02]=\"\",\"\",\", \"&[Pin02]))","v":"M3"},{"$f":"CONCATENATE([Pin15],IF([Pin03]=\"\",\"\",\", \"&[Pin03]))","v":"M3"},{"$f":"CONCATENATE([Pin16],IF([Pin04]=\"\",\"\",\", \"&[Pin04]))","v":"M3"},{"$f":"CONCATENATE([Pin17],IF([Pin05]=\"\",\"\",\", \"&[Pin05]))","v":"M3"},{"$f":"CONCATENATE([Pin18],IF([Pin06]=\"\",\"\",\", \"&[Pin06]))","v":"M3"},{"$f":"CONCATENATE([Pin19],IF([Pin07]=\"\",\"\",\", \"&[Pin07]))","v":"M3"},{"$f":"CONCATENATE([Pin20],IF([Pin08]=\"\",\"\",\", \"&[Pin08]))","v":"M3"},{"$f":"CONCATENATE([Pin21],IF([Pin09]=\"\",\"\",\", \"&[Pin09]))","v":"M3"},{"$f":"CONCATENATE([Pin22],IF([Pin10]=\"\",\"\",\", \"&[Pin10]))","v":"M3"},{"$f":"CONCATENATE([Pin23],IF([Pin11]=\"\",\"\",\", \"&[Pin11]))","v":"M3"},{"$f":"CONCATENATE([Pin24],IF([Pin12]=\"\",\"\",\", \"&[Pin12]))","v":"M3"},{"$f":"CONCATENATE([Pin25],IF([Pin13]=\"\",\"\",\", \"&[Pin13]))","v":"M3"},{"$f":"IFERROR(INDEX(Table1[InOut],1/(1/SUMPRODUCT((Table1[Reps]=1)*(Table1[Name]=Table5[[#This Row],[Name]])*Table1[Seq]))),\"\")","v":"O"},{"$f":"IFERROR(INDEX(Table1[Level],1/(1/SUMPRODUCT((Table1[Reps]=1)*(Table1[Name]=Table5[[#This Row],[Name]])*Table1[Seq]))),\"\")","v":"TTL"},{"$f":"IFERROR(INDEX(Table1[Func],1/(1/SUMPRODUCT((Table1[Reps]=1)*(Table1[Name]=Table5[[#This Row],[Name]])*Table1[Seq]))),\"\")","v":"UARTmodule0transmit.WheninIrDAmode,thissignalhasIrDA"}]
[null,null,"K3","ERBIAS","I","Analog","12.4-kOresistor(1%precision)usedinternallyforEthernetPHY.",{"$f":"COUNTIF(INDEX([Name],1):Table1[[#This Row],[Name]],[Name])","v":1},{"$f":"IF(ISTEXT([Pin]),[Seq],INDEX([Bnk],[Seq]-1))","v":99},99,null,null,"U1Rx",{"$f":"IFERROR(INDEX(Table1[Pin],1/(1/SUMPRODUCT((Table1[Reps]=RIGHT(INDEX(Table5[#Headers],coln),2)*1)*(Table1[Name]=Table5[[#This Row],[Name]])*Table1[Bnk]))),\"\")","v":"H2"},{"$f":"IFERROR(INDEX(Table1[Pin],1/(1/SUMPRODUCT((Table1[Reps]=RIGHT(INDEX(Table5[#Headers],coln),2)*1)*(Table1[Name]=Table5[[#This Row],[Name]])*Table1[Bnk]))),\"\")","v":""},{"$f":"IFERROR(INDEX(Table1[Pin],1/(1/SUMPRODUCT((Table1[Reps]=RIGHT(INDEX(Table5[#Headers],coln),2)*1)*(Table1[Name]=Table5[[#This Row],[Name]])*Table1[Bnk]))),\"\")","v":""},{"$f":"IFERROR(INDEX(Table1[Pin],1/(1/SUMPRODUCT((Table1[Reps]=RIGHT(INDEX(Table5[#Headers],coln),2)*1)*(Table1[Name]=Table5[[#This Row],[Name]])*Table1[Bnk]))),\"\")","v":""},{"$f":"IFERROR(INDEX(Table1[Pin],1/(1/SUMPRODUCT((Table1[Reps]=RIGHT(INDEX(Table5[#Headers],coln),2)*1)*(Table1[Name]=Table5[[#This Row],[Name]])*Table1[Bnk]))),\"\")","v":""},{"$f":"IFERROR(INDEX(Table1[Pin],1/(1/SUMPRODUCT((Table1[Reps]=RIGHT(INDEX(Table5[#Headers],coln),2)*1)*(Table1[Name]=Table5[[#This Row],[Name]])*Table1[Bnk]))),\"\")","v":""},{"$f":"IFERROR(INDEX(Table1[Pin],1/(1/SUMPRODUCT((Table1[Reps]=RIGHT(INDEX(Table5[#Headers],coln),2)*1)*(Table1[Name]=Table5[[#This Row],[Name]])*Table1[Bnk]))),\"\")","v":""},{"$f":"IFERROR(INDEX(Table1[Pin],1/(1/SUMPRODUCT((Table1[Reps]=RIGHT(INDEX(Table5[#Headers],coln),2)*1)*(Table1[Name]=Table5[[#This Row],[Name]])*Table1[Bnk]))),\"\")","v":""},{"$f":"IFERROR(INDEX(Table1[Pin],1/(1/SUMPRODUCT((Table1[Reps]=RIGHT(INDEX(Table5[#Headers],coln),2)*1)*(Table1[Name]=Table5[[#This Row],[Name]])*Table1[Bnk]))),\"\")","v":""},{"$f":"IFERROR(INDEX(Table1[Pin],1/(1/SUMPRODUCT((Table1[Reps]=RIGHT(INDEX(Table5[#Headers],coln),2)*1)*(Table1[Name]=Table5[[#This Row],[Name]])*Table1[Bnk]))),\"\")","v":""},{"$f":"IFERROR(INDEX(Table1[Pin],1/(1/SUMPRODUCT((Table1[Reps]=RIGHT(INDEX(Table5[#Headers],coln),2)*1)*(Table1[Name]=Table5[[#This Row],[Name]])*Table1[Bnk]))),\"\")","v":""},{"$f":"IFERROR(INDEX(Table1[Pin],1/(1/SUMPRODUCT((Table1[Reps]=RIGHT(INDEX(Table5[#Headers],coln),2)*1)*(Table1[Name]=Table5[[#This Row],[Name]])*Table1[Bnk]))),\"\")","v":""},{"$f":"IFERROR(INDEX(Table1[Pin],1/(1/SUMPRODUCT((Table1[Reps]=RIGHT(INDEX(Table5[#Headers],coln),2)*1)*(Table1[Name]=Table5[[#This Row],[Name]])*Table1[Bnk]))),\"\")","v":""},{"$f":"[Pin01]","v":"H2"},{"$f":"CONCATENATE([Pin14],IF([Pin02]=\"\",\"\",\", \"&[Pin02]))","v":"H2"},{"$f":"CONCATENATE([Pin15],IF([Pin03]=\"\",\"\",\", \"&[Pin03]))","v":"H2"},{"$f":"CONCATENATE([Pin16],IF([Pin04]=\"\",\"\",\", \"&[Pin04]))","v":"H2"},{"$f":"CONCATENATE([Pin17],IF([Pin05]=\"\",\"\",\", \"&[Pin05]))","v":"H2"},{"$f":"CONCATENATE([Pin18],IF([Pin06]=\"\",\"\",\", \"&[Pin06]))","v":"H2"},{"$f":"CONCATENATE([Pin19],IF([Pin07]=\"\",\"\",\", \"&[Pin07]))","v":"H2"},{"$f":"CONCATENATE([Pin20],IF([Pin08]=\"\",\"\",\", \"&[Pin08]))","v":"H2"},{"$f":"CONCATENATE([Pin21],IF([Pin09]=\"\",\"\",\", \"&[Pin09]))","v":"H2"},{"$f":"CONCATENATE([Pin22],IF([Pin10]=\"\",\"\",\", \"&[Pin10]))","v":"H2"},{"$f":"CONCATENATE([Pin23],IF([Pin11]=\"\",\"\",\", \"&[Pin11]))","v":"H2"},{"$f":"CONCATENATE([Pin24],IF([Pin12]=\"\",\"\",\", \"&[Pin12]))","v":"H2"},{"$f":"CONCATENATE([Pin25],IF([Pin13]=\"\",\"\",\", \"&[Pin13]))","v":"H2"},{"$f":"IFERROR(INDEX(Table1[InOut],1/(1/SUMPRODUCT((Table1[Reps]=1)*(Table1[Name]=Table5[[#This Row],[Name]])*Table1[Seq]))),\"\")","v":"I"},{"$f":"IFERROR(INDEX(Table1[Level],1/(1/SUMPRODUCT((Table1[Reps]=1)*(Table1[Name]=Table5[[#This Row],[Name]])*Table1[Seq]))),\"\")","v":"TTL"},{"$f":"IFERROR(INDEX(Table1[Func],1/(1/SUMPRODUCT((Table1[Reps]=1)*(Table1[Name]=Table5[[#This Row],[Name]])*Table1[Seq]))),\"\")","v":"UARTmodule1receive.WheninIrDAmode,thissignalhasIrDA"}]
[null,null,"K4","GNDPHY","-","Power","GNDoftheEthernetPHY.",{"$f":"COUNTIF(INDEX([Name],1):Table1[[#This Row],[Name]],[Name])","v":3},{"$f":"IF(ISTEXT([Pin]),[Seq],INDEX([Bnk],[Seq]-1))","v":100},100,null,null,"U1Tx",{"$f":"IFERROR(INDEX(Table1[Pin],1/(1/SUMPRODUCT((Table1[Reps]=RIGHT(INDEX(Table5[#Headers],coln),2)*1)*(Table1[Name]=Table5[[#This Row],[Name]])*Table1[Bnk]))),\"\")","v":"H1"},{"$f":"IFERROR(INDEX(Table1[Pin],1/(1/SUMPRODUCT((Table1[Reps]=RIGHT(INDEX(Table5[#Headers],coln),2)*1)*(Table1[Name]=Table5[[#This Row],[Name]])*Table1[Bnk]))),\"\")","v":""},{"$f":"IFERROR(INDEX(Table1[Pin],1/(1/SUMPRODUCT((Table1[Reps]=RIGHT(INDEX(Table5[#Headers],coln),2)*1)*(Table1[Name]=Table5[[#This Row],[Name]])*Table1[Bnk]))),\"\")","v":""},{"$f":"IFERROR(INDEX(Table1[Pin],1/(1/SUMPRODUCT((Table1[Reps]=RIGHT(INDEX(Table5[#Headers],coln),2)*1)*(Table1[Name]=Table5[[#This Row],[Name]])*Table1[Bnk]))),\"\")","v":""},{"$f":"IFERROR(INDEX(Table1[Pin],1/(1/SUMPRODUCT((Table1[Reps]=RIGHT(INDEX(Table5[#Headers],coln),2)*1)*(Table1[Name]=Table5[[#This Row],[Name]])*Table1[Bnk]))),\"\")","v":""},{"$f":"IFERROR(INDEX(Table1[Pin],1/(1/SUMPRODUCT((Table1[Reps]=RIGHT(INDEX(Table5[#Headers],coln),2)*1)*(Table1[Name]=Table5[[#This Row],[Name]])*Table1[Bnk]))),\"\")","v":""},{"$f":"IFERROR(INDEX(Table1[Pin],1/(1/SUMPRODUCT((Table1[Reps]=RIGHT(INDEX(Table5[#Headers],coln),2)*1)*(Table1[Name]=Table5[[#This Row],[Name]])*Table1[Bnk]))),\"\")","v":""},{"$f":"IFERROR(INDEX(Table1[Pin],1/(1/SUMPRODUCT((Table1[Reps]=RIGHT(INDEX(Table5[#Headers],coln),2)*1)*(Table1[Name]=Table5[[#This Row],[Name]])*Table1[Bnk]))),\"\")","v":""},{"$f":"IFERROR(INDEX(Table1[Pin],1/(1/SUMPRODUCT((Table1[Reps]=RIGHT(INDEX(Table5[#Headers],coln),2)*1)*(Table1[Name]=Table5[[#This Row],[Name]])*Table1[Bnk]))),\"\")","v":""},{"$f":"IFERROR(INDEX(Table1[Pin],1/(1/SUMPRODUCT((Table1[Reps]=RIGHT(INDEX(Table5[#Headers],coln),2)*1)*(Table1[Name]=Table5[[#This Row],[Name]])*Table1[Bnk]))),\"\")","v":""},{"$f":"IFERROR(INDEX(Table1[Pin],1/(1/SUMPRODUCT((Table1[Reps]=RIGHT(INDEX(Table5[#Headers],coln),2)*1)*(Table1[Name]=Table5[[#This Row],[Name]])*Table1[Bnk]))),\"\")","v":""},{"$f":"IFERROR(INDEX(Table1[Pin],1/(1/SUMPRODUCT((Table1[Reps]=RIGHT(INDEX(Table5[#Headers],coln),2)*1)*(Table1[Name]=Table5[[#This Row],[Name]])*Table1[Bnk]))),\"\")","v":""},{"$f":"IFERROR(INDEX(Table1[Pin],1/(1/SUMPRODUCT((Table1[Reps]=RIGHT(INDEX(Table5[#Headers],coln),2)*1)*(Table1[Name]=Table5[[#This Row],[Name]])*Table1[Bnk]))),\"\")","v":""},{"$f":"[Pin01]","v":"H1"},{"$f":"CONCATENATE([Pin14],IF([Pin02]=\"\",\"\",\", \"&[Pin02]))","v":"H1"},{"$f":"CONCATENATE([Pin15],IF([Pin03]=\"\",\"\",\", \"&[Pin03]))","v":"H1"},{"$f":"CONCATENATE([Pin16],IF([Pin04]=\"\",\"\",\", \"&[Pin04]))","v":"H1"},{"$f":"CONCATENATE([Pin17],IF([Pin05]=\"\",\"\",\", \"&[Pin05]))","v":"H1"},{"$f":"CONCATENATE([Pin18],IF([Pin06]=\"\",\"\",\", \"&[Pin06]))","v":"H1"},{"$f":"CONCATENATE([Pin19],IF([Pin07]=\"\",\"\",\", \"&[Pin07]))","v":"H1"},{"$f":"CONCATENATE([Pin20],IF([Pin08]=\"\",\"\",\", \"&[Pin08]))","v":"H1"},{"$f":"CONCATENATE([Pin21],IF([Pin09]=\"\",\"\",\", \"&[Pin09]))","v":"H1"},{"$f":"CONCATENATE([Pin22],IF([Pin10]=\"\",\"\",\", \"&[Pin10]))","v":"H1"},{"$f":"CONCATENATE([Pin23],IF([Pin11]=\"\",\"\",\", \"&[Pin11]))","v":"H1"},{"$f":"CONCATENATE([Pin24],IF([Pin12]=\"\",\"\",\", \"&[Pin12]))","v":"H1"},{"$f":"CONCATENATE([Pin25],IF([Pin13]=\"\",\"\",\", \"&[Pin13]))","v":"H1"},{"$f":"IFERROR(INDEX(Table1[InOut],1/(1/SUMPRODUCT((Table1[Reps]=1)*(Table1[Name]=Table5[[#This Row],[Name]])*Table1[Seq]))),\"\")","v":"O"},{"$f":"IFERROR(INDEX(Table1[Level],1/(1/SUMPRODUCT((Table1[Reps]=1)*(Table1[Name]=Table5[[#This Row],[Name]])*Table1[Seq]))),\"\")","v":"TTL"},{"$f":"IFERROR(INDEX(Table1[Func],1/(1/SUMPRODUCT((Table1[Reps]=1)*(Table1[Name]=Table5[[#This Row],[Name]])*Table1[Seq]))),\"\")","v":"UARTmodule1transmit.WheninIrDAmode,thissignalhasIrDA"}]
[null,null,"K5","GND","-","Power","GroundreferenceforlogicandI/Opins.",{"$f":"COUNTIF(INDEX([Name],1):Table1[[#This Row],[Name]],[Name])","v":10},{"$f":"IF(ISTEXT([Pin]),[Seq],INDEX([Bnk],[Seq]-1))","v":101},101,null,null,"VBAT",{"$f":"IFERROR(INDEX(Table1[Pin],1/(1/SUMPRODUCT((Table1[Reps]=RIGHT(INDEX(Table5[#Headers],coln),2)*1)*(Table1[Name]=Table5[[#This Row],[Name]])*Table1[Bnk]))),\"\")","v":"L12"},{"$f":"IFERROR(INDEX(Table1[Pin],1/(1/SUMPRODUCT((Table1[Reps]=RIGHT(INDEX(Table5[#Headers],coln),2)*1)*(Table1[Name]=Table5[[#This Row],[Name]])*Table1[Bnk]))),\"\")","v":""},{"$f":"IFERROR(INDEX(Table1[Pin],1/(1/SUMPRODUCT((Table1[Reps]=RIGHT(INDEX(Table5[#Headers],coln),2)*1)*(Table1[Name]=Table5[[#This Row],[Name]])*Table1[Bnk]))),\"\")","v":""},{"$f":"IFERROR(INDEX(Table1[Pin],1/(1/SUMPRODUCT((Table1[Reps]=RIGHT(INDEX(Table5[#Headers],coln),2)*1)*(Table1[Name]=Table5[[#This Row],[Name]])*Table1[Bnk]))),\"\")","v":""},{"$f":"IFERROR(INDEX(Table1[Pin],1/(1/SUMPRODUCT((Table1[Reps]=RIGHT(INDEX(Table5[#Headers],coln),2)*1)*(Table1[Name]=Table5[[#This Row],[Name]])*Table1[Bnk]))),\"\")","v":""},{"$f":"IFERROR(INDEX(Table1[Pin],1/(1/SUMPRODUCT((Table1[Reps]=RIGHT(INDEX(Table5[#Headers],coln),2)*1)*(Table1[Name]=Table5[[#This Row],[Name]])*Table1[Bnk]))),\"\")","v":""},{"$f":"IFERROR(INDEX(Table1[Pin],1/(1/SUMPRODUCT((Table1[Reps]=RIGHT(INDEX(Table5[#Headers],coln),2)*1)*(Table1[Name]=Table5[[#This Row],[Name]])*Table1[Bnk]))),\"\")","v":""},{"$f":"IFERROR(INDEX(Table1[Pin],1/(1/SUMPRODUCT((Table1[Reps]=RIGHT(INDEX(Table5[#Headers],coln),2)*1)*(Table1[Name]=Table5[[#This Row],[Name]])*Table1[Bnk]))),\"\")","v":""},{"$f":"IFERROR(INDEX(Table1[Pin],1/(1/SUMPRODUCT((Table1[Reps]=RIGHT(INDEX(Table5[#Headers],coln),2)*1)*(Table1[Name]=Table5[[#This Row],[Name]])*Table1[Bnk]))),\"\")","v":""},{"$f":"IFERROR(INDEX(Table1[Pin],1/(1/SUMPRODUCT((Table1[Reps]=RIGHT(INDEX(Table5[#Headers],coln),2)*1)*(Table1[Name]=Table5[[#This Row],[Name]])*Table1[Bnk]))),\"\")","v":""},{"$f":"IFERROR(INDEX(Table1[Pin],1/(1/SUMPRODUCT((Table1[Reps]=RIGHT(INDEX(Table5[#Headers],coln),2)*1)*(Table1[Name]=Table5[[#This Row],[Name]])*Table1[Bnk]))),\"\")","v":""},{"$f":"IFERROR(INDEX(Table1[Pin],1/(1/SUMPRODUCT((Table1[Reps]=RIGHT(INDEX(Table5[#Headers],coln),2)*1)*(Table1[Name]=Table5[[#This Row],[Name]])*Table1[Bnk]))),\"\")","v":""},{"$f":"IFERROR(INDEX(Table1[Pin],1/(1/SUMPRODUCT((Table1[Reps]=RIGHT(INDEX(Table5[#Headers],coln),2)*1)*(Table1[Name]=Table5[[#This Row],[Name]])*Table1[Bnk]))),\"\")","v":""},{"$f":"[Pin01]","v":"L12"},{"$f":"CONCATENATE([Pin14],IF([Pin02]=\"\",\"\",\", \"&[Pin02]))","v":"L12"},{"$f":"CONCATENATE([Pin15],IF([Pin03]=\"\",\"\",\", \"&[Pin03]))","v":"L12"},{"$f":"CONCATENATE([Pin16],IF([Pin04]=\"\",\"\",\", \"&[Pin04]))","v":"L12"},{"$f":"CONCATENATE([Pin17],IF([Pin05]=\"\",\"\",\", \"&[Pin05]))","v":"L12"},{"$f":"CONCATENATE([Pin18],IF([Pin06]=\"\",\"\",\", \"&[Pin06]))","v":"L12"},{"$f":"CONCATENATE([Pin19],IF([Pin07]=\"\",\"\",\", \"&[Pin07]))","v":"L12"},{"$f":"CONCATENATE([Pin20],IF([Pin08]=\"\",\"\",\", \"&[Pin08]))","v":"L12"},{"$f":"CONCATENATE([Pin21],IF([Pin09]=\"\",\"\",\", \"&[Pin09]))","v":"L12"},{"$f":"CONCATENATE([Pin22],IF([Pin10]=\"\",\"\",\", \"&[Pin10]))","v":"L12"},{"$f":"CONCATENATE([Pin23],IF([Pin11]=\"\",\"\",\", \"&[Pin11]))","v":"L12"},{"$f":"CONCATENATE([Pin24],IF([Pin12]=\"\",\"\",\", \"&[Pin12]))","v":"L12"},{"$f":"CONCATENATE([Pin25],IF([Pin13]=\"\",\"\",\", \"&[Pin13]))","v":"L12"},{"$f":"IFERROR(INDEX(Table1[InOut],1/(1/SUMPRODUCT((Table1[Reps]=1)*(Table1[Name]=Table5[[#This Row],[Name]])*Table1[Seq]))),\"\")","v":"-"},{"$f":"IFERROR(INDEX(Table1[Level],1/(1/SUMPRODUCT((Table1[Reps]=1)*(Table1[Name]=Table5[[#This Row],[Name]])*Table1[Seq]))),\"\")","v":"Power"},{"$f":"IFERROR(INDEX(Table1[Func],1/(1/SUMPRODUCT((Table1[Reps]=1)*(Table1[Name]=Table5[[#This Row],[Name]])*Table1[Seq]))),\"\")","v":"PowersourcefortheHibernationmodule.Itisnormallyconnected"}]
[null,null,"K6","GND","-","Power","GroundreferenceforlogicandI/Opins.",{"$f":"COUNTIF(INDEX([Name],1):Table1[[#This Row],[Name]],[Name])","v":11},{"$f":"IF(ISTEXT([Pin]),[Seq],INDEX([Bnk],[Seq]-1))","v":102},102,null,null,"VCCPHY",{"$f":"IFERROR(INDEX(Table1[Pin],1/(1/SUMPRODUCT((Table1[Reps]=RIGHT(INDEX(Table5[#Headers],coln),2)*1)*(Table1[Name]=Table5[[#This Row],[Name]])*Table1[Bnk]))),\"\")","v":"C10"},{"$f":"IFERROR(INDEX(Table1[Pin],1/(1/SUMPRODUCT((Table1[Reps]=RIGHT(INDEX(Table5[#Headers],coln),2)*1)*(Table1[Name]=Table5[[#This Row],[Name]])*Table1[Bnk]))),\"\")","v":"D10"},{"$f":"IFERROR(INDEX(Table1[Pin],1/(1/SUMPRODUCT((Table1[Reps]=RIGHT(INDEX(Table5[#Headers],coln),2)*1)*(Table1[Name]=Table5[[#This Row],[Name]])*Table1[Bnk]))),\"\")","v":"D11"},{"$f":"IFERROR(INDEX(Table1[Pin],1/(1/SUMPRODUCT((Table1[Reps]=RIGHT(INDEX(Table5[#Headers],coln),2)*1)*(Table1[Name]=Table5[[#This Row],[Name]])*Table1[Bnk]))),\"\")","v":""},{"$f":"IFERROR(INDEX(Table1[Pin],1/(1/SUMPRODUCT((Table1[Reps]=RIGHT(INDEX(Table5[#Headers],coln),2)*1)*(Table1[Name]=Table5[[#This Row],[Name]])*Table1[Bnk]))),\"\")","v":""},{"$f":"IFERROR(INDEX(Table1[Pin],1/(1/SUMPRODUCT((Table1[Reps]=RIGHT(INDEX(Table5[#Headers],coln),2)*1)*(Table1[Name]=Table5[[#This Row],[Name]])*Table1[Bnk]))),\"\")","v":""},{"$f":"IFERROR(INDEX(Table1[Pin],1/(1/SUMPRODUCT((Table1[Reps]=RIGHT(INDEX(Table5[#Headers],coln),2)*1)*(Table1[Name]=Table5[[#This Row],[Name]])*Table1[Bnk]))),\"\")","v":""},{"$f":"IFERROR(INDEX(Table1[Pin],1/(1/SUMPRODUCT((Table1[Reps]=RIGHT(INDEX(Table5[#Headers],coln),2)*1)*(Table1[Name]=Table5[[#This Row],[Name]])*Table1[Bnk]))),\"\")","v":""},{"$f":"IFERROR(INDEX(Table1[Pin],1/(1/SUMPRODUCT((Table1[Reps]=RIGHT(INDEX(Table5[#Headers],coln),2)*1)*(Table1[Name]=Table5[[#This Row],[Name]])*Table1[Bnk]))),\"\")","v":""},{"$f":"IFERROR(INDEX(Table1[Pin],1/(1/SUMPRODUCT((Table1[Reps]=RIGHT(INDEX(Table5[#Headers],coln),2)*1)*(Table1[Name]=Table5[[#This Row],[Name]])*Table1[Bnk]))),\"\")","v":""},{"$f":"IFERROR(INDEX(Table1[Pin],1/(1/SUMPRODUCT((Table1[Reps]=RIGHT(INDEX(Table5[#Headers],coln),2)*1)*(Table1[Name]=Table5[[#This Row],[Name]])*Table1[Bnk]))),\"\")","v":""},{"$f":"IFERROR(INDEX(Table1[Pin],1/(1/SUMPRODUCT((Table1[Reps]=RIGHT(INDEX(Table5[#Headers],coln),2)*1)*(Table1[Name]=Table5[[#This Row],[Name]])*Table1[Bnk]))),\"\")","v":""},{"$f":"IFERROR(INDEX(Table1[Pin],1/(1/SUMPRODUCT((Table1[Reps]=RIGHT(INDEX(Table5[#Headers],coln),2)*1)*(Table1[Name]=Table5[[#This Row],[Name]])*Table1[Bnk]))),\"\")","v":""},{"$f":"[Pin01]","v":"C10"},{"$f":"CONCATENATE([Pin14],IF([Pin02]=\"\",\"\",\", \"&[Pin02]))","v":"C10, D10"},{"$f":"CONCATENATE([Pin15],IF([Pin03]=\"\",\"\",\", \"&[Pin03]))","v":"C10, D10, D11"},{"$f":"CONCATENATE([Pin16],IF([Pin04]=\"\",\"\",\", \"&[Pin04]))","v":"C10, D10, D11"},{"$f":"CONCATENATE([Pin17],IF([Pin05]=\"\",\"\",\", \"&[Pin05]))","v":"C10, D10, D11"},{"$f":"CONCATENATE([Pin18],IF([Pin06]=\"\",\"\",\", \"&[Pin06]))","v":"C10, D10, D11"},{"$f":"CONCATENATE([Pin19],IF([Pin07]=\"\",\"\",\", \"&[Pin07]))","v":"C10, D10, D11"},{"$f":"CONCATENATE([Pin20],IF([Pin08]=\"\",\"\",\", \"&[Pin08]))","v":"C10, D10, D11"},{"$f":"CONCATENATE([Pin21],IF([Pin09]=\"\",\"\",\", \"&[Pin09]))","v":"C10, D10, D11"},{"$f":"CONCATENATE([Pin22],IF([Pin10]=\"\",\"\",\", \"&[Pin10]))","v":"C10, D10, D11"},{"$f":"CONCATENATE([Pin23],IF([Pin11]=\"\",\"\",\", \"&[Pin11]))","v":"C10, D10, D11"},{"$f":"CONCATENATE([Pin24],IF([Pin12]=\"\",\"\",\", \"&[Pin12]))","v":"C10, D10, D11"},{"$f":"CONCATENATE([Pin25],IF([Pin13]=\"\",\"\",\", \"&[Pin13]))","v":"C10, D10, D11"},{"$f":"IFERROR(INDEX(Table1[InOut],1/(1/SUMPRODUCT((Table1[Reps]=1)*(Table1[Name]=Table5[[#This Row],[Name]])*Table1[Seq]))),\"\")","v":"-"},{"$f":"IFERROR(INDEX(Table1[Level],1/(1/SUMPRODUCT((Table1[Reps]=1)*(Table1[Name]=Table5[[#This Row],[Name]])*Table1[Seq]))),\"\")","v":"Power"},{"$f":"IFERROR(INDEX(Table1[Func],1/(1/SUMPRODUCT((Table1[Reps]=1)*(Table1[Name]=Table5[[#This Row],[Name]])*Table1[Seq]))),\"\")","v":"VCCoftheEthernetPHY."}]
[null,null,"K7","VDD33","-","Power","PositivesupplyforI/Oandsomelogic.",{"$f":"COUNTIF(INDEX([Name],1):Table1[[#This Row],[Name]],[Name])","v":6},{"$f":"IF(ISTEXT([Pin]),[Seq],INDEX([Bnk],[Seq]-1))","v":103},103,null,null,"VDD25",{"$f":"IFERROR(INDEX(Table1[Pin],1/(1/SUMPRODUCT((Table1[Reps]=RIGHT(INDEX(Table5[#Headers],coln),2)*1)*(Table1[Name]=Table5[[#This Row],[Name]])*Table1[Bnk]))),\"\")","v":"C3"},{"$f":"IFERROR(INDEX(Table1[Pin],1/(1/SUMPRODUCT((Table1[Reps]=RIGHT(INDEX(Table5[#Headers],coln),2)*1)*(Table1[Name]=Table5[[#This Row],[Name]])*Table1[Bnk]))),\"\")","v":"D3"},{"$f":"IFERROR(INDEX(Table1[Pin],1/(1/SUMPRODUCT((Table1[Reps]=RIGHT(INDEX(Table5[#Headers],coln),2)*1)*(Table1[Name]=Table5[[#This Row],[Name]])*Table1[Bnk]))),\"\")","v":"F3"},{"$f":"IFERROR(INDEX(Table1[Pin],1/(1/SUMPRODUCT((Table1[Reps]=RIGHT(INDEX(Table5[#Headers],coln),2)*1)*(Table1[Name]=Table5[[#This Row],[Name]])*Table1[Bnk]))),\"\")","v":"G3"},{"$f":"IFERROR(INDEX(Table1[Pin],1/(1/SUMPRODUCT((Table1[Reps]=RIGHT(INDEX(Table5[#Headers],coln),2)*1)*(Table1[Name]=Table5[[#This Row],[Name]])*Table1[Bnk]))),\"\")","v":""},{"$f":"IFERROR(INDEX(Table1[Pin],1/(1/SUMPRODUCT((Table1[Reps]=RIGHT(INDEX(Table5[#Headers],coln),2)*1)*(Table1[Name]=Table5[[#This Row],[Name]])*Table1[Bnk]))),\"\")","v":""},{"$f":"IFERROR(INDEX(Table1[Pin],1/(1/SUMPRODUCT((Table1[Reps]=RIGHT(INDEX(Table5[#Headers],coln),2)*1)*(Table1[Name]=Table5[[#This Row],[Name]])*Table1[Bnk]))),\"\")","v":""},{"$f":"IFERROR(INDEX(Table1[Pin],1/(1/SUMPRODUCT((Table1[Reps]=RIGHT(INDEX(Table5[#Headers],coln),2)*1)*(Table1[Name]=Table5[[#This Row],[Name]])*Table1[Bnk]))),\"\")","v":""},{"$f":"IFERROR(INDEX(Table1[Pin],1/(1/SUMPRODUCT((Table1[Reps]=RIGHT(INDEX(Table5[#Headers],coln),2)*1)*(Table1[Name]=Table5[[#This Row],[Name]])*Table1[Bnk]))),\"\")","v":""},{"$f":"IFERROR(INDEX(Table1[Pin],1/(1/SUMPRODUCT((Table1[Reps]=RIGHT(INDEX(Table5[#Headers],coln),2)*1)*(Table1[Name]=Table5[[#This Row],[Name]])*Table1[Bnk]))),\"\")","v":""},{"$f":"IFERROR(INDEX(Table1[Pin],1/(1/SUMPRODUCT((Table1[Reps]=RIGHT(INDEX(Table5[#Headers],coln),2)*1)*(Table1[Name]=Table5[[#This Row],[Name]])*Table1[Bnk]))),\"\")","v":""},{"$f":"IFERROR(INDEX(Table1[Pin],1/(1/SUMPRODUCT((Table1[Reps]=RIGHT(INDEX(Table5[#Headers],coln),2)*1)*(Table1[Name]=Table5[[#This Row],[Name]])*Table1[Bnk]))),\"\")","v":""},{"$f":"IFERROR(INDEX(Table1[Pin],1/(1/SUMPRODUCT((Table1[Reps]=RIGHT(INDEX(Table5[#Headers],coln),2)*1)*(Table1[Name]=Table5[[#This Row],[Name]])*Table1[Bnk]))),\"\")","v":""},{"$f":"[Pin01]","v":"C3"},{"$f":"CONCATENATE([Pin14],IF([Pin02]=\"\",\"\",\", \"&[Pin02]))","v":"C3, D3"},{"$f":"CONCATENATE([Pin15],IF([Pin03]=\"\",\"\",\", \"&[Pin03]))","v":"C3, D3, F3"},{"$f":"CONCATENATE([Pin16],IF([Pin04]=\"\",\"\",\", \"&[Pin04]))","v":"C3, D3, F3, G3"},{"$f":"CONCATENATE([Pin17],IF([Pin05]=\"\",\"\",\", \"&[Pin05]))","v":"C3, D3, F3, G3"},{"$f":"CONCATENATE([Pin18],IF([Pin06]=\"\",\"\",\", \"&[Pin06]))","v":"C3, D3, F3, G3"},{"$f":"CONCATENATE([Pin19],IF([Pin07]=\"\",\"\",\", \"&[Pin07]))","v":"C3, D3, F3, G3"},{"$f":"CONCATENATE([Pin20],IF([Pin08]=\"\",\"\",\", \"&[Pin08]))","v":"C3, D3, F3, G3"},{"$f":"CONCATENATE([Pin21],IF([Pin09]=\"\",\"\",\", \"&[Pin09]))","v":"C3, D3, F3, G3"},{"$f":"CONCATENATE([Pin22],IF([Pin10]=\"\",\"\",\", \"&[Pin10]))","v":"C3, D3, F3, G3"},{"$f":"CONCATENATE([Pin23],IF([Pin11]=\"\",\"\",\", \"&[Pin11]))","v":"C3, D3, F3, G3"},{"$f":"CONCATENATE([Pin24],IF([Pin12]=\"\",\"\",\", \"&[Pin12]))","v":"C3, D3, F3, G3"},{"$f":"CONCATENATE([Pin25],IF([Pin13]=\"\",\"\",\", \"&[Pin13]))","v":"C3, D3, F3, G3"},{"$f":"IFERROR(INDEX(Table1[InOut],1/(1/SUMPRODUCT((Table1[Reps]=1)*(Table1[Name]=Table5[[#This Row],[Name]])*Table1[Seq]))),\"\")","v":"-"},{"$f":"IFERROR(INDEX(Table1[Level],1/(1/SUMPRODUCT((Table1[Reps]=1)*(Table1[Name]=Table5[[#This Row],[Name]])*Table1[Seq]))),\"\")","v":"Power"},{"$f":"IFERROR(INDEX(Table1[Func],1/(1/SUMPRODUCT((Table1[Reps]=1)*(Table1[Name]=Table5[[#This Row],[Name]])*Table1[Seq]))),\"\")","v":"Positivesupplyformostofthelogicfunction,includingthe"}]
[null,null,"K8","VDD33","-","Power","PositivesupplyforI/Oandsomelogic.",{"$f":"COUNTIF(INDEX([Name],1):Table1[[#This Row],[Name]],[Name])","v":7},{"$f":"IF(ISTEXT([Pin]),[Seq],INDEX([Bnk],[Seq]-1))","v":104},104,null,null,"VDD33",{"$f":"IFERROR(INDEX(Table1[Pin],1/(1/SUMPRODUCT((Table1[Reps]=RIGHT(INDEX(Table5[#Headers],coln),2)*1)*(Table1[Name]=Table5[[#This Row],[Name]])*Table1[Bnk]))),\"\")","v":"E10"},{"$f":"IFERROR(INDEX(Table1[Pin],1/(1/SUMPRODUCT((Table1[Reps]=RIGHT(INDEX(Table5[#Headers],coln),2)*1)*(Table1[Name]=Table5[[#This Row],[Name]])*Table1[Bnk]))),\"\")","v":"G10"},{"$f":"IFERROR(INDEX(Table1[Pin],1/(1/SUMPRODUCT((Table1[Reps]=RIGHT(INDEX(Table5[#Headers],coln),2)*1)*(Table1[Name]=Table5[[#This Row],[Name]])*Table1[Bnk]))),\"\")","v":"G11"},{"$f":"IFERROR(INDEX(Table1[Pin],1/(1/SUMPRODUCT((Table1[Reps]=RIGHT(INDEX(Table5[#Headers],coln),2)*1)*(Table1[Name]=Table5[[#This Row],[Name]])*Table1[Bnk]))),\"\")","v":"G12"},{"$f":"IFERROR(INDEX(Table1[Pin],1/(1/SUMPRODUCT((Table1[Reps]=RIGHT(INDEX(Table5[#Headers],coln),2)*1)*(Table1[Name]=Table5[[#This Row],[Name]])*Table1[Bnk]))),\"\")","v":"H10"},{"$f":"IFERROR(INDEX(Table1[Pin],1/(1/SUMPRODUCT((Table1[Reps]=RIGHT(INDEX(Table5[#Headers],coln),2)*1)*(Table1[Name]=Table5[[#This Row],[Name]])*Table1[Bnk]))),\"\")","v":"K7"},{"$f":"IFERROR(INDEX(Table1[Pin],1/(1/SUMPRODUCT((Table1[Reps]=RIGHT(INDEX(Table5[#Headers],coln),2)*1)*(Table1[Name]=Table5[[#This Row],[Name]])*Table1[Bnk]))),\"\")","v":"K8"},{"$f":"IFERROR(INDEX(Table1[Pin],1/(1/SUMPRODUCT((Table1[Reps]=RIGHT(INDEX(Table5[#Headers],coln),2)*1)*(Table1[Name]=Table5[[#This Row],[Name]])*Table1[Bnk]))),\"\")","v":"K9"},{"$f":"IFERROR(INDEX(Table1[Pin],1/(1/SUMPRODUCT((Table1[Reps]=RIGHT(INDEX(Table5[#Headers],coln),2)*1)*(Table1[Name]=Table5[[#This Row],[Name]])*Table1[Bnk]))),\"\")","v":""},{"$f":"IFERROR(INDEX(Table1[Pin],1/(1/SUMPRODUCT((Table1[Reps]=RIGHT(INDEX(Table5[#Headers],coln),2)*1)*(Table1[Name]=Table5[[#This Row],[Name]])*Table1[Bnk]))),\"\")","v":""},{"$f":"IFERROR(INDEX(Table1[Pin],1/(1/SUMPRODUCT((Table1[Reps]=RIGHT(INDEX(Table5[#Headers],coln),2)*1)*(Table1[Name]=Table5[[#This Row],[Name]])*Table1[Bnk]))),\"\")","v":""},{"$f":"IFERROR(INDEX(Table1[Pin],1/(1/SUMPRODUCT((Table1[Reps]=RIGHT(INDEX(Table5[#Headers],coln),2)*1)*(Table1[Name]=Table5[[#This Row],[Name]])*Table1[Bnk]))),\"\")","v":""},{"$f":"IFERROR(INDEX(Table1[Pin],1/(1/SUMPRODUCT((Table1[Reps]=RIGHT(INDEX(Table5[#Headers],coln),2)*1)*(Table1[Name]=Table5[[#This Row],[Name]])*Table1[Bnk]))),\"\")","v":""},{"$f":"[Pin01]","v":"E10"},{"$f":"CONCATENATE([Pin14],IF([Pin02]=\"\",\"\",\", \"&[Pin02]))","v":"E10, G10"},{"$f":"CONCATENATE([Pin15],IF([Pin03]=\"\",\"\",\", \"&[Pin03]))","v":"E10, G10, G11"},{"$f":"CONCATENATE([Pin16],IF([Pin04]=\"\",\"\",\", \"&[Pin04]))","v":"E10, G10, G11, G12"},{"$f":"CONCATENATE([Pin17],IF([Pin05]=\"\",\"\",\", \"&[Pin05]))","v":"E10, G10, G11, G12, H10"},{"$f":"CONCATENATE([Pin18],IF([Pin06]=\"\",\"\",\", \"&[Pin06]))","v":"E10, G10, G11, G12, H10, K7"},{"$f":"CONCATENATE([Pin19],IF([Pin07]=\"\",\"\",\", \"&[Pin07]))","v":"E10, G10, G11, G12, H10, K7, K8"},{"$f":"CONCATENATE([Pin20],IF([Pin08]=\"\",\"\",\", \"&[Pin08]))","v":"E10, G10, G11, G12, H10, K7, K8, K9"},{"$f":"CONCATENATE([Pin21],IF([Pin09]=\"\",\"\",\", \"&[Pin09]))","v":"E10, G10, G11, G12, H10, K7, K8, K9"},{"$f":"CONCATENATE([Pin22],IF([Pin10]=\"\",\"\",\", \"&[Pin10]))","v":"E10, G10, G11, G12, H10, K7, K8, K9"},{"$f":"CONCATENATE([Pin23],IF([Pin11]=\"\",\"\",\", \"&[Pin11]))","v":"E10, G10, G11, G12, H10, K7, K8, K9"},{"$f":"CONCATENATE([Pin24],IF([Pin12]=\"\",\"\",\", \"&[Pin12]))","v":"E10, G10, G11, G12, H10, K7, K8, K9"},{"$f":"CONCATENATE([Pin25],IF([Pin13]=\"\",\"\",\", \"&[Pin13]))","v":"E10, G10, G11, G12, H10, K7, K8, K9"},{"$f":"IFERROR(INDEX(Table1[InOut],1/(1/SUMPRODUCT((Table1[Reps]=1)*(Table1[Name]=Table5[[#This Row],[Name]])*Table1[Seq]))),\"\")","v":"-"},{"$f":"IFERROR(INDEX(Table1[Level],1/(1/SUMPRODUCT((Table1[Reps]=1)*(Table1[Name]=Table5[[#This Row],[Name]])*Table1[Seq]))),\"\")","v":"Power"},{"$f":"IFERROR(INDEX(Table1[Func],1/(1/SUMPRODUCT((Table1[Reps]=1)*(Table1[Name]=Table5[[#This Row],[Name]])*Table1[Seq]))),\"\")","v":"PositivesupplyforI/Oandsomelogic."}]
[null,null,"K9","VDD33","-","Power","PositivesupplyforI/Oandsomelogic.",{"$f":"COUNTIF(INDEX([Name],1):Table1[[#This Row],[Name]],[Name])","v":8},{"$f":"IF(ISTEXT([Pin]),[Seq],INDEX([Bnk],[Seq]-1))","v":105},105,null,null,"VDDA",{"$f":"IFERROR(INDEX(Table1[Pin],1/(1/SUMPRODUCT((Table1[Reps]=RIGHT(INDEX(Table5[#Headers],coln),2)*1)*(Table1[Name]=Table5[[#This Row],[Name]])*Table1[Bnk]))),\"\")","v":"C6"},{"$f":"IFERROR(INDEX(Table1[Pin],1/(1/SUMPRODUCT((Table1[Reps]=RIGHT(INDEX(Table5[#Headers],coln),2)*1)*(Table1[Name]=Table5[[#This Row],[Name]])*Table1[Bnk]))),\"\")","v":"C7"},{"$f":"IFERROR(INDEX(Table1[Pin],1/(1/SUMPRODUCT((Table1[Reps]=RIGHT(INDEX(Table5[#Headers],coln),2)*1)*(Table1[Name]=Table5[[#This Row],[Name]])*Table1[Bnk]))),\"\")","v":""},{"$f":"IFERROR(INDEX(Table1[Pin],1/(1/SUMPRODUCT((Table1[Reps]=RIGHT(INDEX(Table5[#Headers],coln),2)*1)*(Table1[Name]=Table5[[#This Row],[Name]])*Table1[Bnk]))),\"\")","v":""},{"$f":"IFERROR(INDEX(Table1[Pin],1/(1/SUMPRODUCT((Table1[Reps]=RIGHT(INDEX(Table5[#Headers],coln),2)*1)*(Table1[Name]=Table5[[#This Row],[Name]])*Table1[Bnk]))),\"\")","v":""},{"$f":"IFERROR(INDEX(Table1[Pin],1/(1/SUMPRODUCT((Table1[Reps]=RIGHT(INDEX(Table5[#Headers],coln),2)*1)*(Table1[Name]=Table5[[#This Row],[Name]])*Table1[Bnk]))),\"\")","v":""},{"$f":"IFERROR(INDEX(Table1[Pin],1/(1/SUMPRODUCT((Table1[Reps]=RIGHT(INDEX(Table5[#Headers],coln),2)*1)*(Table1[Name]=Table5[[#This Row],[Name]])*Table1[Bnk]))),\"\")","v":""},{"$f":"IFERROR(INDEX(Table1[Pin],1/(1/SUMPRODUCT((Table1[Reps]=RIGHT(INDEX(Table5[#Headers],coln),2)*1)*(Table1[Name]=Table5[[#This Row],[Name]])*Table1[Bnk]))),\"\")","v":""},{"$f":"IFERROR(INDEX(Table1[Pin],1/(1/SUMPRODUCT((Table1[Reps]=RIGHT(INDEX(Table5[#Headers],coln),2)*1)*(Table1[Name]=Table5[[#This Row],[Name]])*Table1[Bnk]))),\"\")","v":""},{"$f":"IFERROR(INDEX(Table1[Pin],1/(1/SUMPRODUCT((Table1[Reps]=RIGHT(INDEX(Table5[#Headers],coln),2)*1)*(Table1[Name]=Table5[[#This Row],[Name]])*Table1[Bnk]))),\"\")","v":""},{"$f":"IFERROR(INDEX(Table1[Pin],1/(1/SUMPRODUCT((Table1[Reps]=RIGHT(INDEX(Table5[#Headers],coln),2)*1)*(Table1[Name]=Table5[[#This Row],[Name]])*Table1[Bnk]))),\"\")","v":""},{"$f":"IFERROR(INDEX(Table1[Pin],1/(1/SUMPRODUCT((Table1[Reps]=RIGHT(INDEX(Table5[#Headers],coln),2)*1)*(Table1[Name]=Table5[[#This Row],[Name]])*Table1[Bnk]))),\"\")","v":""},{"$f":"IFERROR(INDEX(Table1[Pin],1/(1/SUMPRODUCT((Table1[Reps]=RIGHT(INDEX(Table5[#Headers],coln),2)*1)*(Table1[Name]=Table5[[#This Row],[Name]])*Table1[Bnk]))),\"\")","v":""},{"$f":"[Pin01]","v":"C6"},{"$f":"CONCATENATE([Pin14],IF([Pin02]=\"\",\"\",\", \"&[Pin02]))","v":"C6, C7"},{"$f":"CONCATENATE([Pin15],IF([Pin03]=\"\",\"\",\", \"&[Pin03]))","v":"C6, C7"},{"$f":"CONCATENATE([Pin16],IF([Pin04]=\"\",\"\",\", \"&[Pin04]))","v":"C6, C7"},{"$f":"CONCATENATE([Pin17],IF([Pin05]=\"\",\"\",\", \"&[Pin05]))","v":"C6, C7"},{"$f":"CONCATENATE([Pin18],IF([Pin06]=\"\",\"\",\", \"&[Pin06]))","v":"C6, C7"},{"$f":"CONCATENATE([Pin19],IF([Pin07]=\"\",\"\",\", \"&[Pin07]))","v":"C6, C7"},{"$f":"CONCATENATE([Pin20],IF([Pin08]=\"\",\"\",\", \"&[Pin08]))","v":"C6, C7"},{"$f":"CONCATENATE([Pin21],IF([Pin09]=\"\",\"\",\", \"&[Pin09]))","v":"C6, C7"},{"$f":"CONCATENATE([Pin22],IF([Pin10]=\"\",\"\",\", \"&[Pin10]))","v":"C6, C7"},{"$f":"CONCATENATE([Pin23],IF([Pin11]=\"\",\"\",\", \"&[Pin11]))","v":"C6, C7"},{"$f":"CONCATENATE([Pin24],IF([Pin12]=\"\",\"\",\", \"&[Pin12]))","v":"C6, C7"},{"$f":"CONCATENATE([Pin25],IF([Pin13]=\"\",\"\",\", \"&[Pin13]))","v":"C6, C7"},{"$f":"IFERROR(INDEX(Table1[InOut],1/(1/SUMPRODUCT((Table1[Reps]=1)*(Table1[Name]=Table5[[#This Row],[Name]])*Table1[Seq]))),\"\")","v":"-"},{"$f":"IFERROR(INDEX(Table1[Level],1/(1/SUMPRODUCT((Table1[Reps]=1)*(Table1[Name]=Table5[[#This Row],[Name]])*Table1[Seq]))),\"\")","v":"Power"},{"$f":"IFERROR(INDEX(Table1[Func],1/(1/SUMPRODUCT((Table1[Reps]=1)*(Table1[Name]=Table5[[#This Row],[Name]])*Table1[Seq]))),\"\")","v":"Thepositivesupply(3.3V)fortheanalogcircuits(ADC,Analog"}]
[null,null,"K10","GND","-","Power","GroundreferenceforlogicandI/Opins.",{"$f":"COUNTIF(INDEX([Name],1):Table1[[#This Row],[Name]],[Name])","v":12},{"$f":"IF(ISTEXT([Pin]),[Seq],INDEX([Bnk],[Seq]-1))","v":106},106,null,null,"WAKE",{"$f":"IFERROR(INDEX(Table1[Pin],1/(1/SUMPRODUCT((Table1[Reps]=RIGHT(INDEX(Table5[#Headers],coln),2)*1)*(Table1[Name]=Table5[[#This Row],[Name]])*Table1[Bnk]))),\"\")","v":"M10"},{"$f":"IFERROR(INDEX(Table1[Pin],1/(1/SUMPRODUCT((Table1[Reps]=RIGHT(INDEX(Table5[#Headers],coln),2)*1)*(Table1[Name]=Table5[[#This Row],[Name]])*Table1[Bnk]))),\"\")","v":""},{"$f":"IFERROR(INDEX(Table1[Pin],1/(1/SUMPRODUCT((Table1[Reps]=RIGHT(INDEX(Table5[#Headers],coln),2)*1)*(Table1[Name]=Table5[[#This Row],[Name]])*Table1[Bnk]))),\"\")","v":""},{"$f":"IFERROR(INDEX(Table1[Pin],1/(1/SUMPRODUCT((Table1[Reps]=RIGHT(INDEX(Table5[#Headers],coln),2)*1)*(Table1[Name]=Table5[[#This Row],[Name]])*Table1[Bnk]))),\"\")","v":""},{"$f":"IFERROR(INDEX(Table1[Pin],1/(1/SUMPRODUCT((Table1[Reps]=RIGHT(INDEX(Table5[#Headers],coln),2)*1)*(Table1[Name]=Table5[[#This Row],[Name]])*Table1[Bnk]))),\"\")","v":""},{"$f":"IFERROR(INDEX(Table1[Pin],1/(1/SUMPRODUCT((Table1[Reps]=RIGHT(INDEX(Table5[#Headers],coln),2)*1)*(Table1[Name]=Table5[[#This Row],[Name]])*Table1[Bnk]))),\"\")","v":""},{"$f":"IFERROR(INDEX(Table1[Pin],1/(1/SUMPRODUCT((Table1[Reps]=RIGHT(INDEX(Table5[#Headers],coln),2)*1)*(Table1[Name]=Table5[[#This Row],[Name]])*Table1[Bnk]))),\"\")","v":""},{"$f":"IFERROR(INDEX(Table1[Pin],1/(1/SUMPRODUCT((Table1[Reps]=RIGHT(INDEX(Table5[#Headers],coln),2)*1)*(Table1[Name]=Table5[[#This Row],[Name]])*Table1[Bnk]))),\"\")","v":""},{"$f":"IFERROR(INDEX(Table1[Pin],1/(1/SUMPRODUCT((Table1[Reps]=RIGHT(INDEX(Table5[#Headers],coln),2)*1)*(Table1[Name]=Table5[[#This Row],[Name]])*Table1[Bnk]))),\"\")","v":""},{"$f":"IFERROR(INDEX(Table1[Pin],1/(1/SUMPRODUCT((Table1[Reps]=RIGHT(INDEX(Table5[#Headers],coln),2)*1)*(Table1[Name]=Table5[[#This Row],[Name]])*Table1[Bnk]))),\"\")","v":""},{"$f":"IFERROR(INDEX(Table1[Pin],1/(1/SUMPRODUCT((Table1[Reps]=RIGHT(INDEX(Table5[#Headers],coln),2)*1)*(Table1[Name]=Table5[[#This Row],[Name]])*Table1[Bnk]))),\"\")","v":""},{"$f":"IFERROR(INDEX(Table1[Pin],1/(1/SUMPRODUCT((Table1[Reps]=RIGHT(INDEX(Table5[#Headers],coln),2)*1)*(Table1[Name]=Table5[[#This Row],[Name]])*Table1[Bnk]))),\"\")","v":""},{"$f":"IFERROR(INDEX(Table1[Pin],1/(1/SUMPRODUCT((Table1[Reps]=RIGHT(INDEX(Table5[#Headers],coln),2)*1)*(Table1[Name]=Table5[[#This Row],[Name]])*Table1[Bnk]))),\"\")","v":""},{"$f":"[Pin01]","v":"M10"},{"$f":"CONCATENATE([Pin14],IF([Pin02]=\"\",\"\",\", \"&[Pin02]))","v":"M10"},{"$f":"CONCATENATE([Pin15],IF([Pin03]=\"\",\"\",\", \"&[Pin03]))","v":"M10"},{"$f":"CONCATENATE([Pin16],IF([Pin04]=\"\",\"\",\", \"&[Pin04]))","v":"M10"},{"$f":"CONCATENATE([Pin17],IF([Pin05]=\"\",\"\",\", \"&[Pin05]))","v":"M10"},{"$f":"CONCATENATE([Pin18],IF([Pin06]=\"\",\"\",\", \"&[Pin06]))","v":"M10"},{"$f":"CONCATENATE([Pin19],IF([Pin07]=\"\",\"\",\", \"&[Pin07]))","v":"M10"},{"$f":"CONCATENATE([Pin20],IF([Pin08]=\"\",\"\",\", \"&[Pin08]))","v":"M10"},{"$f":"CONCATENATE([Pin21],IF([Pin09]=\"\",\"\",\", \"&[Pin09]))","v":"M10"},{"$f":"CONCATENATE([Pin22],IF([Pin10]=\"\",\"\",\", \"&[Pin10]))","v":"M10"},{"$f":"CONCATENATE([Pin23],IF([Pin11]=\"\",\"\",\", \"&[Pin11]))","v":"M10"},{"$f":"CONCATENATE([Pin24],IF([Pin12]=\"\",\"\",\", \"&[Pin12]))","v":"M10"},{"$f":"CONCATENATE([Pin25],IF([Pin13]=\"\",\"\",\", \"&[Pin13]))","v":"M10"},{"$f":"IFERROR(INDEX(Table1[InOut],1/(1/SUMPRODUCT((Table1[Reps]=1)*(Table1[Name]=Table5[[#This Row],[Name]])*Table1[Seq]))),\"\")","v":"I"},{"$f":"IFERROR(INDEX(Table1[Level],1/(1/SUMPRODUCT((Table1[Reps]=1)*(Table1[Name]=Table5[[#This Row],[Name]])*Table1[Seq]))),\"\")","v":"TTL"},{"$f":"IFERROR(INDEX(Table1[Func],1/(1/SUMPRODUCT((Table1[Reps]=1)*(Table1[Name]=Table5[[#This Row],[Name]])*Table1[Seq]))),\"\")","v":"AnexternalinputthatbringstheprocessoroutofHibernatemode"}]
[null,null,"K11","XOSC0","I","Analog","Hibernationmoduleoscillatorcrystalinputoranexternalclock",{"$f":"COUNTIF(INDEX([Name],1):Table1[[#This Row],[Name]],[Name])","v":1},{"$f":"IF(ISTEXT([Pin]),[Seq],INDEX([Bnk],[Seq]-1))","v":107},107,null,null,"XOSC0",{"$f":"IFERROR(INDEX(Table1[Pin],1/(1/SUMPRODUCT((Table1[Reps]=RIGHT(INDEX(Table5[#Headers],coln),2)*1)*(Table1[Name]=Table5[[#This Row],[Name]])*Table1[Bnk]))),\"\")","v":"K11"},{"$f":"IFERROR(INDEX(Table1[Pin],1/(1/SUMPRODUCT((Table1[Reps]=RIGHT(INDEX(Table5[#Headers],coln),2)*1)*(Table1[Name]=Table5[[#This Row],[Name]])*Table1[Bnk]))),\"\")","v":""},{"$f":"IFERROR(INDEX(Table1[Pin],1/(1/SUMPRODUCT((Table1[Reps]=RIGHT(INDEX(Table5[#Headers],coln),2)*1)*(Table1[Name]=Table5[[#This Row],[Name]])*Table1[Bnk]))),\"\")","v":""},{"$f":"IFERROR(INDEX(Table1[Pin],1/(1/SUMPRODUCT((Table1[Reps]=RIGHT(INDEX(Table5[#Headers],coln),2)*1)*(Table1[Name]=Table5[[#This Row],[Name]])*Table1[Bnk]))),\"\")","v":""},{"$f":"IFERROR(INDEX(Table1[Pin],1/(1/SUMPRODUCT((Table1[Reps]=RIGHT(INDEX(Table5[#Headers],coln),2)*1)*(Table1[Name]=Table5[[#This Row],[Name]])*Table1[Bnk]))),\"\")","v":""},{"$f":"IFERROR(INDEX(Table1[Pin],1/(1/SUMPRODUCT((Table1[Reps]=RIGHT(INDEX(Table5[#Headers],coln),2)*1)*(Table1[Name]=Table5[[#This Row],[Name]])*Table1[Bnk]))),\"\")","v":""},{"$f":"IFERROR(INDEX(Table1[Pin],1/(1/SUMPRODUCT((Table1[Reps]=RIGHT(INDEX(Table5[#Headers],coln),2)*1)*(Table1[Name]=Table5[[#This Row],[Name]])*Table1[Bnk]))),\"\")","v":""},{"$f":"IFERROR(INDEX(Table1[Pin],1/(1/SUMPRODUCT((Table1[Reps]=RIGHT(INDEX(Table5[#Headers],coln),2)*1)*(Table1[Name]=Table5[[#This Row],[Name]])*Table1[Bnk]))),\"\")","v":""},{"$f":"IFERROR(INDEX(Table1[Pin],1/(1/SUMPRODUCT((Table1[Reps]=RIGHT(INDEX(Table5[#Headers],coln),2)*1)*(Table1[Name]=Table5[[#This Row],[Name]])*Table1[Bnk]))),\"\")","v":""},{"$f":"IFERROR(INDEX(Table1[Pin],1/(1/SUMPRODUCT((Table1[Reps]=RIGHT(INDEX(Table5[#Headers],coln),2)*1)*(Table1[Name]=Table5[[#This Row],[Name]])*Table1[Bnk]))),\"\")","v":""},{"$f":"IFERROR(INDEX(Table1[Pin],1/(1/SUMPRODUCT((Table1[Reps]=RIGHT(INDEX(Table5[#Headers],coln),2)*1)*(Table1[Name]=Table5[[#This Row],[Name]])*Table1[Bnk]))),\"\")","v":""},{"$f":"IFERROR(INDEX(Table1[Pin],1/(1/SUMPRODUCT((Table1[Reps]=RIGHT(INDEX(Table5[#Headers],coln),2)*1)*(Table1[Name]=Table5[[#This Row],[Name]])*Table1[Bnk]))),\"\")","v":""},{"$f":"IFERROR(INDEX(Table1[Pin],1/(1/SUMPRODUCT((Table1[Reps]=RIGHT(INDEX(Table5[#Headers],coln),2)*1)*(Table1[Name]=Table5[[#This Row],[Name]])*Table1[Bnk]))),\"\")","v":""},{"$f":"[Pin01]","v":"K11"},{"$f":"CONCATENATE([Pin14],IF([Pin02]=\"\",\"\",\", \"&[Pin02]))","v":"K11"},{"$f":"CONCATENATE([Pin15],IF([Pin03]=\"\",\"\",\", \"&[Pin03]))","v":"K11"},{"$f":"CONCATENATE([Pin16],IF([Pin04]=\"\",\"\",\", \"&[Pin04]))","v":"K11"},{"$f":"CONCATENATE([Pin17],IF([Pin05]=\"\",\"\",\", \"&[Pin05]))","v":"K11"},{"$f":"CONCATENATE([Pin18],IF([Pin06]=\"\",\"\",\", \"&[Pin06]))","v":"K11"},{"$f":"CONCATENATE([Pin19],IF([Pin07]=\"\",\"\",\", \"&[Pin07]))","v":"K11"},{"$f":"CONCATENATE([Pin20],IF([Pin08]=\"\",\"\",\", \"&[Pin08]))","v":"K11"},{"$f":"CONCATENATE([Pin21],IF([Pin09]=\"\",\"\",\", \"&[Pin09]))","v":"K11"},{"$f":"CONCATENATE([Pin22],IF([Pin10]=\"\",\"\",\", \"&[Pin10]))","v":"K11"},{"$f":"CONCATENATE([Pin23],IF([Pin11]=\"\",\"\",\", \"&[Pin11]))","v":"K11"},{"$f":"CONCATENATE([Pin24],IF([Pin12]=\"\",\"\",\", \"&[Pin12]))","v":"K11"},{"$f":"CONCATENATE([Pin25],IF([Pin13]=\"\",\"\",\", \"&[Pin13]))","v":"K11"},{"$f":"IFERROR(INDEX(Table1[InOut],1/(1/SUMPRODUCT((Table1[Reps]=1)*(Table1[Name]=Table5[[#This Row],[Name]])*Table1[Seq]))),\"\")","v":"I"},{"$f":"IFERROR(INDEX(Table1[Level],1/(1/SUMPRODUCT((Table1[Reps]=1)*(Table1[Name]=Table5[[#This Row],[Name]])*Table1[Seq]))),\"\")","v":"Analog"},{"$f":"IFERROR(INDEX(Table1[Func],1/(1/SUMPRODUCT((Table1[Reps]=1)*(Table1[Name]=Table5[[#This Row],[Name]])*Table1[Seq]))),\"\")","v":"Hibernationmoduleoscillatorcrystalinputoranexternalclock"}]
[null,null,"K12","XOSC1","O","Analog","a32.768-kHzoscillatorfortheHibernationmoduleRTC.Seethe",{"$f":"COUNTIF(INDEX([Name],1):Table1[[#This Row],[Name]],[Name])","v":1},{"$f":"IF(ISTEXT([Pin]),[Seq],INDEX([Bnk],[Seq]-1))","v":108},108,null,null,"XOSC1",{"$f":"IFERROR(INDEX(Table1[Pin],1/(1/SUMPRODUCT((Table1[Reps]=RIGHT(INDEX(Table5[#Headers],coln),2)*1)*(Table1[Name]=Table5[[#This Row],[Name]])*Table1[Bnk]))),\"\")","v":"K12"},{"$f":"IFERROR(INDEX(Table1[Pin],1/(1/SUMPRODUCT((Table1[Reps]=RIGHT(INDEX(Table5[#Headers],coln),2)*1)*(Table1[Name]=Table5[[#This Row],[Name]])*Table1[Bnk]))),\"\")","v":""},{"$f":"IFERROR(INDEX(Table1[Pin],1/(1/SUMPRODUCT((Table1[Reps]=RIGHT(INDEX(Table5[#Headers],coln),2)*1)*(Table1[Name]=Table5[[#This Row],[Name]])*Table1[Bnk]))),\"\")","v":""},{"$f":"IFERROR(INDEX(Table1[Pin],1/(1/SUMPRODUCT((Table1[Reps]=RIGHT(INDEX(Table5[#Headers],coln),2)*1)*(Table1[Name]=Table5[[#This Row],[Name]])*Table1[Bnk]))),\"\")","v":""},{"$f":"IFERROR(INDEX(Table1[Pin],1/(1/SUMPRODUCT((Table1[Reps]=RIGHT(INDEX(Table5[#Headers],coln),2)*1)*(Table1[Name]=Table5[[#This Row],[Name]])*Table1[Bnk]))),\"\")","v":""},{"$f":"IFERROR(INDEX(Table1[Pin],1/(1/SUMPRODUCT((Table1[Reps]=RIGHT(INDEX(Table5[#Headers],coln),2)*1)*(Table1[Name]=Table5[[#This Row],[Name]])*Table1[Bnk]))),\"\")","v":""},{"$f":"IFERROR(INDEX(Table1[Pin],1/(1/SUMPRODUCT((Table1[Reps]=RIGHT(INDEX(Table5[#Headers],coln),2)*1)*(Table1[Name]=Table5[[#This Row],[Name]])*Table1[Bnk]))),\"\")","v":""},{"$f":"IFERROR(INDEX(Table1[Pin],1/(1/SUMPRODUCT((Table1[Reps]=RIGHT(INDEX(Table5[#Headers],coln),2)*1)*(Table1[Name]=Table5[[#This Row],[Name]])*Table1[Bnk]))),\"\")","v":""},{"$f":"IFERROR(INDEX(Table1[Pin],1/(1/SUMPRODUCT((Table1[Reps]=RIGHT(INDEX(Table5[#Headers],coln),2)*1)*(Table1[Name]=Table5[[#This Row],[Name]])*Table1[Bnk]))),\"\")","v":""},{"$f":"IFERROR(INDEX(Table1[Pin],1/(1/SUMPRODUCT((Table1[Reps]=RIGHT(INDEX(Table5[#Headers],coln),2)*1)*(Table1[Name]=Table5[[#This Row],[Name]])*Table1[Bnk]))),\"\")","v":""},{"$f":"IFERROR(INDEX(Table1[Pin],1/(1/SUMPRODUCT((Table1[Reps]=RIGHT(INDEX(Table5[#Headers],coln),2)*1)*(Table1[Name]=Table5[[#This Row],[Name]])*Table1[Bnk]))),\"\")","v":""},{"$f":"IFERROR(INDEX(Table1[Pin],1/(1/SUMPRODUCT((Table1[Reps]=RIGHT(INDEX(Table5[#Headers],coln),2)*1)*(Table1[Name]=Table5[[#This Row],[Name]])*Table1[Bnk]))),\"\")","v":""},{"$f":"IFERROR(INDEX(Table1[Pin],1/(1/SUMPRODUCT((Table1[Reps]=RIGHT(INDEX(Table5[#Headers],coln),2)*1)*(Table1[Name]=Table5[[#This Row],[Name]])*Table1[Bnk]))),\"\")","v":""},{"$f":"[Pin01]","v":"K12"},{"$f":"CONCATENATE([Pin14],IF([Pin02]=\"\",\"\",\", \"&[Pin02]))","v":"K12"},{"$f":"CONCATENATE([Pin15],IF([Pin03]=\"\",\"\",\", \"&[Pin03]))","v":"K12"},{"$f":"CONCATENATE([Pin16],IF([Pin04]=\"\",\"\",\", \"&[Pin04]))","v":"K12"},{"$f":"CONCATENATE([Pin17],IF([Pin05]=\"\",\"\",\", \"&[Pin05]))","v":"K12"},{"$f":"CONCATENATE([Pin18],IF([Pin06]=\"\",\"\",\", \"&[Pin06]))","v":"K12"},{"$f":"CONCATENATE([Pin19],IF([Pin07]=\"\",\"\",\", \"&[Pin07]))","v":"K12"},{"$f":"CONCATENATE([Pin20],IF([Pin08]=\"\",\"\",\", \"&[Pin08]))","v":"K12"},{"$f":"CONCATENATE([Pin21],IF([Pin09]=\"\",\"\",\", \"&[Pin09]))","v":"K12"},{"$f":"CONCATENATE([Pin22],IF([Pin10]=\"\",\"\",\", \"&[Pin10]))","v":"K12"},{"$f":"CONCATENATE([Pin23],IF([Pin11]=\"\",\"\",\", \"&[Pin11]))","v":"K12"},{"$f":"CONCATENATE([Pin24],IF([Pin12]=\"\",\"\",\", \"&[Pin12]))","v":"K12"},{"$f":"CONCATENATE([Pin25],IF([Pin13]=\"\",\"\",\", \"&[Pin13]))","v":"K12"},{"$f":"IFERROR(INDEX(Table1[InOut],1/(1/SUMPRODUCT((Table1[Reps]=1)*(Table1[Name]=Table5[[#This Row],[Name]])*Table1[Seq]))),\"\")","v":"O"},{"$f":"IFERROR(INDEX(Table1[Level],1/(1/SUMPRODUCT((Table1[Reps]=1)*(Table1[Name]=Table5[[#This Row],[Name]])*Table1[Seq]))),\"\")","v":"Analog"},{"$f":"IFERROR(INDEX(Table1[Func],1/(1/SUMPRODUCT((Table1[Reps]=1)*(Table1[Name]=Table5[[#This Row],[Name]])*Table1[Seq]))),\"\")","v":"a32.768-kHzoscillatorfortheHibernationmoduleRTC.Seethe"}]
[null,null,"L1","PC4","I/O","TTL","GPIOportCbit4.",{"$f":"COUNTIF(INDEX([Name],1):Table1[[#This Row],[Name]],[Name])","v":1},{"$f":"IF(ISTEXT([Pin]),[Seq],INDEX([Bnk],[Seq]-1))","v":109},109,null,null,"XTALNPHY",{"$f":"IFERROR(INDEX(Table1[Pin],1/(1/SUMPRODUCT((Table1[Reps]=RIGHT(INDEX(Table5[#Headers],coln),2)*1)*(Table1[Name]=Table5[[#This Row],[Name]])*Table1[Bnk]))),\"\")","v":"J1"},{"$f":"IFERROR(INDEX(Table1[Pin],1/(1/SUMPRODUCT((Table1[Reps]=RIGHT(INDEX(Table5[#Headers],coln),2)*1)*(Table1[Name]=Table5[[#This Row],[Name]])*Table1[Bnk]))),\"\")","v":""},{"$f":"IFERROR(INDEX(Table1[Pin],1/(1/SUMPRODUCT((Table1[Reps]=RIGHT(INDEX(Table5[#Headers],coln),2)*1)*(Table1[Name]=Table5[[#This Row],[Name]])*Table1[Bnk]))),\"\")","v":""},{"$f":"IFERROR(INDEX(Table1[Pin],1/(1/SUMPRODUCT((Table1[Reps]=RIGHT(INDEX(Table5[#Headers],coln),2)*1)*(Table1[Name]=Table5[[#This Row],[Name]])*Table1[Bnk]))),\"\")","v":""},{"$f":"IFERROR(INDEX(Table1[Pin],1/(1/SUMPRODUCT((Table1[Reps]=RIGHT(INDEX(Table5[#Headers],coln),2)*1)*(Table1[Name]=Table5[[#This Row],[Name]])*Table1[Bnk]))),\"\")","v":""},{"$f":"IFERROR(INDEX(Table1[Pin],1/(1/SUMPRODUCT((Table1[Reps]=RIGHT(INDEX(Table5[#Headers],coln),2)*1)*(Table1[Name]=Table5[[#This Row],[Name]])*Table1[Bnk]))),\"\")","v":""},{"$f":"IFERROR(INDEX(Table1[Pin],1/(1/SUMPRODUCT((Table1[Reps]=RIGHT(INDEX(Table5[#Headers],coln),2)*1)*(Table1[Name]=Table5[[#This Row],[Name]])*Table1[Bnk]))),\"\")","v":""},{"$f":"IFERROR(INDEX(Table1[Pin],1/(1/SUMPRODUCT((Table1[Reps]=RIGHT(INDEX(Table5[#Headers],coln),2)*1)*(Table1[Name]=Table5[[#This Row],[Name]])*Table1[Bnk]))),\"\")","v":""},{"$f":"IFERROR(INDEX(Table1[Pin],1/(1/SUMPRODUCT((Table1[Reps]=RIGHT(INDEX(Table5[#Headers],coln),2)*1)*(Table1[Name]=Table5[[#This Row],[Name]])*Table1[Bnk]))),\"\")","v":""},{"$f":"IFERROR(INDEX(Table1[Pin],1/(1/SUMPRODUCT((Table1[Reps]=RIGHT(INDEX(Table5[#Headers],coln),2)*1)*(Table1[Name]=Table5[[#This Row],[Name]])*Table1[Bnk]))),\"\")","v":""},{"$f":"IFERROR(INDEX(Table1[Pin],1/(1/SUMPRODUCT((Table1[Reps]=RIGHT(INDEX(Table5[#Headers],coln),2)*1)*(Table1[Name]=Table5[[#This Row],[Name]])*Table1[Bnk]))),\"\")","v":""},{"$f":"IFERROR(INDEX(Table1[Pin],1/(1/SUMPRODUCT((Table1[Reps]=RIGHT(INDEX(Table5[#Headers],coln),2)*1)*(Table1[Name]=Table5[[#This Row],[Name]])*Table1[Bnk]))),\"\")","v":""},{"$f":"IFERROR(INDEX(Table1[Pin],1/(1/SUMPRODUCT((Table1[Reps]=RIGHT(INDEX(Table5[#Headers],coln),2)*1)*(Table1[Name]=Table5[[#This Row],[Name]])*Table1[Bnk]))),\"\")","v":""},{"$f":"[Pin01]","v":"J1"},{"$f":"CONCATENATE([Pin14],IF([Pin02]=\"\",\"\",\", \"&[Pin02]))","v":"J1"},{"$f":"CONCATENATE([Pin15],IF([Pin03]=\"\",\"\",\", \"&[Pin03]))","v":"J1"},{"$f":"CONCATENATE([Pin16],IF([Pin04]=\"\",\"\",\", \"&[Pin04]))","v":"J1"},{"$f":"CONCATENATE([Pin17],IF([Pin05]=\"\",\"\",\", \"&[Pin05]))","v":"J1"},{"$f":"CONCATENATE([Pin18],IF([Pin06]=\"\",\"\",\", \"&[Pin06]))","v":"J1"},{"$f":"CONCATENATE([Pin19],IF([Pin07]=\"\",\"\",\", \"&[Pin07]))","v":"J1"},{"$f":"CONCATENATE([Pin20],IF([Pin08]=\"\",\"\",\", \"&[Pin08]))","v":"J1"},{"$f":"CONCATENATE([Pin21],IF([Pin09]=\"\",\"\",\", \"&[Pin09]))","v":"J1"},{"$f":"CONCATENATE([Pin22],IF([Pin10]=\"\",\"\",\", \"&[Pin10]))","v":"J1"},{"$f":"CONCATENATE([Pin23],IF([Pin11]=\"\",\"\",\", \"&[Pin11]))","v":"J1"},{"$f":"CONCATENATE([Pin24],IF([Pin12]=\"\",\"\",\", \"&[Pin12]))","v":"J1"},{"$f":"CONCATENATE([Pin25],IF([Pin13]=\"\",\"\",\", \"&[Pin13]))","v":"J1"},{"$f":"IFERROR(INDEX(Table1[InOut],1/(1/SUMPRODUCT((Table1[Reps]=1)*(Table1[Name]=Table5[[#This Row],[Name]])*Table1[Seq]))),\"\")","v":"O"},{"$f":"IFERROR(INDEX(Table1[Level],1/(1/SUMPRODUCT((Table1[Reps]=1)*(Table1[Name]=Table5[[#This Row],[Name]])*Table1[Seq]))),\"\")","v":"TTL"},{"$f":"IFERROR(INDEX(Table1[Func],1/(1/SUMPRODUCT((Table1[Reps]=1)*(Table1[Name]=Table5[[#This Row],[Name]])*Table1[Seq]))),\"\")","v":"XTALNoftheEthernetPHY.Whenusingasingle-ended25-"}]
[null,null,null,"CCP5","I/O","TTL","Capture/Compare/PWM5.",{"$f":"COUNTIF(INDEX([Name],1):Table1[[#This Row],[Name]],[Name])","v":1},{"$f":"IF(ISTEXT([Pin]),[Seq],INDEX([Bnk],[Seq]-1))","v":109},110,null,null,"XTALPPHY",{"$f":"IFERROR(INDEX(Table1[Pin],1/(1/SUMPRODUCT((Table1[Reps]=RIGHT(INDEX(Table5[#Headers],coln),2)*1)*(Table1[Name]=Table5[[#This Row],[Name]])*Table1[Bnk]))),\"\")","v":"J2"},{"$f":"IFERROR(INDEX(Table1[Pin],1/(1/SUMPRODUCT((Table1[Reps]=RIGHT(INDEX(Table5[#Headers],coln),2)*1)*(Table1[Name]=Table5[[#This Row],[Name]])*Table1[Bnk]))),\"\")","v":""},{"$f":"IFERROR(INDEX(Table1[Pin],1/(1/SUMPRODUCT((Table1[Reps]=RIGHT(INDEX(Table5[#Headers],coln),2)*1)*(Table1[Name]=Table5[[#This Row],[Name]])*Table1[Bnk]))),\"\")","v":""},{"$f":"IFERROR(INDEX(Table1[Pin],1/(1/SUMPRODUCT((Table1[Reps]=RIGHT(INDEX(Table5[#Headers],coln),2)*1)*(Table1[Name]=Table5[[#This Row],[Name]])*Table1[Bnk]))),\"\")","v":""},{"$f":"IFERROR(INDEX(Table1[Pin],1/(1/SUMPRODUCT((Table1[Reps]=RIGHT(INDEX(Table5[#Headers],coln),2)*1)*(Table1[Name]=Table5[[#This Row],[Name]])*Table1[Bnk]))),\"\")","v":""},{"$f":"IFERROR(INDEX(Table1[Pin],1/(1/SUMPRODUCT((Table1[Reps]=RIGHT(INDEX(Table5[#Headers],coln),2)*1)*(Table1[Name]=Table5[[#This Row],[Name]])*Table1[Bnk]))),\"\")","v":""},{"$f":"IFERROR(INDEX(Table1[Pin],1/(1/SUMPRODUCT((Table1[Reps]=RIGHT(INDEX(Table5[#Headers],coln),2)*1)*(Table1[Name]=Table5[[#This Row],[Name]])*Table1[Bnk]))),\"\")","v":""},{"$f":"IFERROR(INDEX(Table1[Pin],1/(1/SUMPRODUCT((Table1[Reps]=RIGHT(INDEX(Table5[#Headers],coln),2)*1)*(Table1[Name]=Table5[[#This Row],[Name]])*Table1[Bnk]))),\"\")","v":""},{"$f":"IFERROR(INDEX(Table1[Pin],1/(1/SUMPRODUCT((Table1[Reps]=RIGHT(INDEX(Table5[#Headers],coln),2)*1)*(Table1[Name]=Table5[[#This Row],[Name]])*Table1[Bnk]))),\"\")","v":""},{"$f":"IFERROR(INDEX(Table1[Pin],1/(1/SUMPRODUCT((Table1[Reps]=RIGHT(INDEX(Table5[#Headers],coln),2)*1)*(Table1[Name]=Table5[[#This Row],[Name]])*Table1[Bnk]))),\"\")","v":""},{"$f":"IFERROR(INDEX(Table1[Pin],1/(1/SUMPRODUCT((Table1[Reps]=RIGHT(INDEX(Table5[#Headers],coln),2)*1)*(Table1[Name]=Table5[[#This Row],[Name]])*Table1[Bnk]))),\"\")","v":""},{"$f":"IFERROR(INDEX(Table1[Pin],1/(1/SUMPRODUCT((Table1[Reps]=RIGHT(INDEX(Table5[#Headers],coln),2)*1)*(Table1[Name]=Table5[[#This Row],[Name]])*Table1[Bnk]))),\"\")","v":""},{"$f":"IFERROR(INDEX(Table1[Pin],1/(1/SUMPRODUCT((Table1[Reps]=RIGHT(INDEX(Table5[#Headers],coln),2)*1)*(Table1[Name]=Table5[[#This Row],[Name]])*Table1[Bnk]))),\"\")","v":""},{"$f":"[Pin01]","v":"J2"},{"$f":"CONCATENATE([Pin14],IF([Pin02]=\"\",\"\",\", \"&[Pin02]))","v":"J2"},{"$f":"CONCATENATE([Pin15],IF([Pin03]=\"\",\"\",\", \"&[Pin03]))","v":"J2"},{"$f":"CONCATENATE([Pin16],IF([Pin04]=\"\",\"\",\", \"&[Pin04]))","v":"J2"},{"$f":"CONCATENATE([Pin17],IF([Pin05]=\"\",\"\",\", \"&[Pin05]))","v":"J2"},{"$f":"CONCATENATE([Pin18],IF([Pin06]=\"\",\"\",\", \"&[Pin06]))","v":"J2"},{"$f":"CONCATENATE([Pin19],IF([Pin07]=\"\",\"\",\", \"&[Pin07]))","v":"J2"},{"$f":"CONCATENATE([Pin20],IF([Pin08]=\"\",\"\",\", \"&[Pin08]))","v":"J2"},{"$f":"CONCATENATE([Pin21],IF([Pin09]=\"\",\"\",\", \"&[Pin09]))","v":"J2"},{"$f":"CONCATENATE([Pin22],IF([Pin10]=\"\",\"\",\", \"&[Pin10]))","v":"J2"},{"$f":"CONCATENATE([Pin23],IF([Pin11]=\"\",\"\",\", \"&[Pin11]))","v":"J2"},{"$f":"CONCATENATE([Pin24],IF([Pin12]=\"\",\"\",\", \"&[Pin12]))","v":"J2"},{"$f":"CONCATENATE([Pin25],IF([Pin13]=\"\",\"\",\", \"&[Pin13]))","v":"J2"},{"$f":"IFERROR(INDEX(Table1[InOut],1/(1/SUMPRODUCT((Table1[Reps]=1)*(Table1[Name]=Table5[[#This Row],[Name]])*Table1[Seq]))),\"\")","v":"I"},{"$f":"IFERROR(INDEX(Table1[Level],1/(1/SUMPRODUCT((Table1[Reps]=1)*(Table1[Name]=Table5[[#This Row],[Name]])*Table1[Seq]))),\"\")","v":"TTL"},{"$f":"IFERROR(INDEX(Table1[Func],1/(1/SUMPRODUCT((Table1[Reps]=1)*(Table1[Name]=Table5[[#This Row],[Name]])*Table1[Seq]))),\"\")","v":"XTALPoftheEthernetPHY."}]
[null,null,"L2","PC7","I/O","TTL","GPIOportCbit7.",{"$f":"COUNTIF(INDEX([Name],1):Table1[[#This Row],[Name]],[Name])","v":1},{"$f":"IF(ISTEXT([Pin]),[Seq],INDEX([Bnk],[Seq]-1))","v":111},111]
[null,null,null,"CCP4","I/O","TTL","Capture/Compare/PWM4.",{"$f":"COUNTIF(INDEX([Name],1):Table1[[#This Row],[Name]],[Name])","v":1},{"$f":"IF(ISTEXT([Pin]),[Seq],INDEX([Bnk],[Seq]-1))","v":111},112]
[null,null,"L3","PA0","I/O","TTL","GPIOportAbit0.",{"$f":"COUNTIF(INDEX([Name],1):Table1[[#This Row],[Name]],[Name])","v":1},{"$f":"IF(ISTEXT([Pin]),[Seq],INDEX([Bnk],[Seq]-1))","v":113},113]
[null,null,null,"U0Rx","I","TTL","UARTmodule0receive.WheninIrDAmode,thissignalhasIrDA",{"$f":"COUNTIF(INDEX([Name],1):Table1[[#This Row],[Name]],[Name])","v":1},{"$f":"IF(ISTEXT([Pin]),[Seq],INDEX([Bnk],[Seq]-1))","v":113},114]
[null,null,"L4","PA3","I/O","TTL","GPIOportAbit3.",{"$f":"COUNTIF(INDEX([Name],1):Table1[[#This Row],[Name]],[Name])","v":1},{"$f":"IF(ISTEXT([Pin]),[Seq],INDEX([Bnk],[Seq]-1))","v":115},115]
[null,null,null,"SSI0Fss","I/O","TTL","SSImodule0frame.",{"$f":"COUNTIF(INDEX([Name],1):Table1[[#This Row],[Name]],[Name])","v":1},{"$f":"IF(ISTEXT([Pin]),[Seq],INDEX([Bnk],[Seq]-1))","v":115},116]
[null,null,"L5","PA4","I/O","TTL","GPIOportAbit4.",{"$f":"COUNTIF(INDEX([Name],1):Table1[[#This Row],[Name]],[Name])","v":1},{"$f":"IF(ISTEXT([Pin]),[Seq],INDEX([Bnk],[Seq]-1))","v":117},117]
[null,null,null,"SSI0Rx","I","TTL","SSImodule0receive.",{"$f":"COUNTIF(INDEX([Name],1):Table1[[#This Row],[Name]],[Name])","v":1},{"$f":"IF(ISTEXT([Pin]),[Seq],INDEX([Bnk],[Seq]-1))","v":117},118]
[null,null,"L6","PA6","I/O","TTL","GPIOportAbit6.",{"$f":"COUNTIF(INDEX([Name],1):Table1[[#This Row],[Name]],[Name])","v":1},{"$f":"IF(ISTEXT([Pin]),[Seq],INDEX([Bnk],[Seq]-1))","v":119},119]
[null,null,null,"CCP1","I/O","TTL","Capture/Compare/PWM1.",{"$f":"COUNTIF(INDEX([Name],1):Table1[[#This Row],[Name]],[Name])","v":1},{"$f":"IF(ISTEXT([Pin]),[Seq],INDEX([Bnk],[Seq]-1))","v":119},120]
[null,null,"L7","RXIN","I","Analog","RXINoftheEthernetPHY.",{"$f":"COUNTIF(INDEX([Name],1):Table1[[#This Row],[Name]],[Name])","v":1},{"$f":"IF(ISTEXT([Pin]),[Seq],INDEX([Bnk],[Seq]-1))","v":121},121]
[null,null,"L8","TXON","O","Analog","TXONoftheEthernetPHY.",{"$f":"COUNTIF(INDEX([Name],1):Table1[[#This Row],[Name]],[Name])","v":1},{"$f":"IF(ISTEXT([Pin]),[Seq],INDEX([Bnk],[Seq]-1))","v":122},122]
[null,null,"L9","MDIO","I/O","TTL","MDIOoftheEthernetPHY.",{"$f":"COUNTIF(INDEX([Name],1):Table1[[#This Row],[Name]],[Name])","v":1},{"$f":"IF(ISTEXT([Pin]),[Seq],INDEX([Bnk],[Seq]-1))","v":123},123]
[null,null,"L10","GND","-","Power","GroundreferenceforlogicandI/Opins.",{"$f":"COUNTIF(INDEX([Name],1):Table1[[#This Row],[Name]],[Name])","v":13},{"$f":"IF(ISTEXT([Pin]),[Seq],INDEX([Bnk],[Seq]-1))","v":124},124]
[null,null,"L11","OSC0","I","Analog","Mainoscillatorcrystalinputoranexternalclockreferenceinput",{"$f":"COUNTIF(INDEX([Name],1):Table1[[#This Row],[Name]],[Name])","v":1},{"$f":"IF(ISTEXT([Pin]),[Seq],INDEX([Bnk],[Seq]-1))","v":125},125]
[null,null,"L12","VBAT","-","Power","PowersourcefortheHibernationmodule.Itisnormallyconnected",{"$f":"COUNTIF(INDEX([Name],1):Table1[[#This Row],[Name]],[Name])","v":1},{"$f":"IF(ISTEXT([Pin]),[Seq],INDEX([Bnk],[Seq]-1))","v":126},126]
[null,null,"M1","PC5","I/O","TTL","GPIOportCbit5.",{"$f":"COUNTIF(INDEX([Name],1):Table1[[#This Row],[Name]],[Name])","v":1},{"$f":"IF(ISTEXT([Pin]),[Seq],INDEX([Bnk],[Seq]-1))","v":127},127]
[null,null,null,"C1+","I","Analog","Analogcomparator1positiveinput.",{"$f":"COUNTIF(INDEX([Name],1):Table1[[#This Row],[Name]],[Name])","v":1},{"$f":"IF(ISTEXT([Pin]),[Seq],INDEX([Bnk],[Seq]-1))","v":127},128]
[null,null,null,"C0o","O","TTL","Analogcomparator0output.",{"$f":"COUNTIF(INDEX([Name],1):Table1[[#This Row],[Name]],[Name])","v":1},{"$f":"IF(ISTEXT([Pin]),[Seq],INDEX([Bnk],[Seq]-1))","v":127},129]
[null,null,"M2","PC6","I/O","TTL","GPIOportCbit6.",{"$f":"COUNTIF(INDEX([Name],1):Table1[[#This Row],[Name]],[Name])","v":1},{"$f":"IF(ISTEXT([Pin]),[Seq],INDEX([Bnk],[Seq]-1))","v":130},130]
[null,null,null,"CCP3","I/O","TTL","Capture/Compare/PWM3.",{"$f":"COUNTIF(INDEX([Name],1):Table1[[#This Row],[Name]],[Name])","v":1},{"$f":"IF(ISTEXT([Pin]),[Seq],INDEX([Bnk],[Seq]-1))","v":130},131]
[null,null,"M3","PA1","I/O","TTL","GPIOportAbit1.",{"$f":"COUNTIF(INDEX([Name],1):Table1[[#This Row],[Name]],[Name])","v":1},{"$f":"IF(ISTEXT([Pin]),[Seq],INDEX([Bnk],[Seq]-1))","v":132},132]
[null,null,null,"U0Tx","O","TTL","UARTmodule0transmit.WheninIrDAmode,thissignalhasIrDA",{"$f":"COUNTIF(INDEX([Name],1):Table1[[#This Row],[Name]],[Name])","v":1},{"$f":"IF(ISTEXT([Pin]),[Seq],INDEX([Bnk],[Seq]-1))","v":132},133]
[null,null,"M4","PA2","I/O","TTL","GPIOportAbit2.",{"$f":"COUNTIF(INDEX([Name],1):Table1[[#This Row],[Name]],[Name])","v":1},{"$f":"IF(ISTEXT([Pin]),[Seq],INDEX([Bnk],[Seq]-1))","v":134},134]
[null,null,null,"SSI0Clk","I/O","TTL","SSImodule0clock.",{"$f":"COUNTIF(INDEX([Name],1):Table1[[#This Row],[Name]],[Name])","v":1},{"$f":"IF(ISTEXT([Pin]),[Seq],INDEX([Bnk],[Seq]-1))","v":134},135]
[null,null,"M5","PA5","I/O","TTL","GPIOportAbit5.",{"$f":"COUNTIF(INDEX([Name],1):Table1[[#This Row],[Name]],[Name])","v":1},{"$f":"IF(ISTEXT([Pin]),[Seq],INDEX([Bnk],[Seq]-1))","v":136},136]
[null,null,null,"SSI0Tx","O","TTL","SSImodule0transmit.",{"$f":"COUNTIF(INDEX([Name],1):Table1[[#This Row],[Name]],[Name])","v":1},{"$f":"IF(ISTEXT([Pin]),[Seq],INDEX([Bnk],[Seq]-1))","v":136},137]
[null,null,"M6","PA7","I/O","TTL","GPIOportAbit7.",{"$f":"COUNTIF(INDEX([Name],1):Table1[[#This Row],[Name]],[Name])","v":1},{"$f":"IF(ISTEXT([Pin]),[Seq],INDEX([Bnk],[Seq]-1))","v":138},138]
[null,null,null,"I2C1SDA","I/O","OD","2Cmodule1data.",{"$f":"COUNTIF(INDEX([Name],1):Table1[[#This Row],[Name]],[Name])","v":1},{"$f":"IF(ISTEXT([Pin]),[Seq],INDEX([Bnk],[Seq]-1))","v":138},139]
[null,null,"M7","RXIP","I","Analog","RXIPoftheEthernetPHY.",{"$f":"COUNTIF(INDEX([Name],1):Table1[[#This Row],[Name]],[Name])","v":1},{"$f":"IF(ISTEXT([Pin]),[Seq],INDEX([Bnk],[Seq]-1))","v":140},140]
[null,null,"M8","TXOP","O","Analog","TXOPoftheEthernetPHY.",{"$f":"COUNTIF(INDEX([Name],1):Table1[[#This Row],[Name]],[Name])","v":1},{"$f":"IF(ISTEXT([Pin]),[Seq],INDEX([Bnk],[Seq]-1))","v":141},141]
[null,null,"M9","PF0","I/O","TTL","GPIOportFbit0.",{"$f":"COUNTIF(INDEX([Name],1):Table1[[#This Row],[Name]],[Name])","v":1},{"$f":"IF(ISTEXT([Pin]),[Seq],INDEX([Bnk],[Seq]-1))","v":142},142]
[null,null,"M10","WAKE","I","TTL","AnexternalinputthatbringstheprocessoroutofHibernatemode",{"$f":"COUNTIF(INDEX([Name],1):Table1[[#This Row],[Name]],[Name])","v":1},{"$f":"IF(ISTEXT([Pin]),[Seq],INDEX([Bnk],[Seq]-1))","v":143},143]
[null,null,"M11","OSC1","O","Analog","Mainoscillatorcrystaloutput.",{"$f":"COUNTIF(INDEX([Name],1):Table1[[#This Row],[Name]],[Name])","v":1},{"$f":"IF(ISTEXT([Pin]),[Seq],INDEX([Bnk],[Seq]-1))","v":144},144]
[null,null,"M12","HIB","O","OD","Anopen-drainoutputwithinternalpull-upthatindicatesthe",{"$f":"COUNTIF(INDEX([Name],1):Table1[[#This Row],[Name]],[Name])","v":1},{"$f":"IF(ISTEXT([Pin]),[Seq],INDEX([Bnk],[Seq]-1))","v":145},145]

{"sheet":"Layout","index":1,"n_rows":64,"n_cols":26,"rows_kept":64,"cut":false,"hidden":false,"merged":[]}
[]
[]
[null,null,1,null,2,null,3,null,4,null,5,null,6,null,7,null,8,null,9,null,10,null,11,null,12]
[]
[null,null,{"$f":"IF(ISBLANK(INDEX(Table1[Pin],MATCH(INDEX(BinA,rown+1)&BinB,Table1[Pin],0)+1)),INDEX(Table1[Name],MATCH(INDEX(BinA,rown+1)&BinB,Table1[Pin],0)+1),\"\")","v":""},null,{"$f":"IF(ISBLANK(INDEX(Table1[Pin],MATCH(INDEX(BinA,rown+1)&BinB,Table1[Pin],0)+1)),INDEX(Table1[Name],MATCH(INDEX(BinA,rown+1)&BinB,Table1[Pin],0)+1),\"\")","v":""},null,{"$f":"IF(ISBLANK(INDEX(Table1[Pin],MATCH(INDEX(BinA,rown+1)&BinB,Table1[Pin],0)+1)),INDEX(Table1[Name],MATCH(INDEX(BinA,rown+1)&BinB,Table1[Pin],0)+1),\"\")","v":""},null,{"$f":"IF(ISBLANK(INDEX(Table1[Pin],MATCH(INDEX(BinA,rown+1)&BinB,Table1[Pin],0)+1)),INDEX(Table1[Name],MATCH(INDEX(BinA,rown+1)&BinB,Table1[Pin],0)+1),\"\")","v":""},null,{"$f":"IF(ISBLANK(INDEX(Table1[Pin],MATCH(INDEX(BinA,rown+1)&BinB,Table1[Pin],0)+1)),INDEX(Table1[Name],MATCH(INDEX(BinA,rown+1)&BinB,Table1[Pin],0)+1),\"\")","v":""},null,{"$f":"IF(ISBLANK(INDEX(Table1[Pin],MATCH(INDEX(BinA,rown+1)&BinB,Table1[Pin],0)+1)),INDEX(Table1[Name],MATCH(INDEX(BinA,rown+1)&BinB,Table1[Pin],0)+1),\"\")","v":"C0-"},null,{"$f":"IF(ISBLANK(INDEX(Table1[Pin],MATCH(INDEX(BinA,rown+1)&BinB,Table1[Pin],0)+1)),INDEX(Table1[Name],MATCH(INDEX(BinA,rown+1)&BinB,Table1[Pin],0)+1),\"\")","v":"C0+"},null,{"$f":"IF(ISBLANK(INDEX(Table1[Pin],MATCH(INDEX(BinA,rown+1)&BinB,Table1[Pin],0)+1)),INDEX(Table1[Name],MATCH(INDEX(BinA,rown+1)&BinB,Table1[Pin],0)+1),\"\")","v":"TRST"},null,{"$f":"IF(ISBLANK(INDEX(Table1[Pin],MATCH(INDEX(BinA,rown+1)&BinB,Table1[Pin],0)+1)),INDEX(Table1[Name],MATCH(INDEX(BinA,rown+1)&BinB,Table1[Pin],0)+1),\"\")","v":"TCK"},null,{"$f":"IF(ISBLANK(INDEX(Table1[Pin],MATCH(INDEX(BinA,rown+1)&BinB,Table1[Pin],0)+1)),INDEX(Table1[Name],MATCH(INDEX(BinA,rown+1)&BinB,Table1[Pin],0)+1),\"\")","v":"TDO"},null,{"$f":"IF(ISBLANK(INDEX(Table1[Pin],MATCH(INDEX(BinA,rown+1)&BinB,Table1[Pin],0)+1)),INDEX(Table1[Name],MATCH(INDEX(BinA,rown+1)&BinB,Table1[Pin],0)+1),\"\")","v":"SSI1Clk"},null,{"$f":"IF(ISBLANK(INDEX(Table1[Pin],MATCH(INDEX(BinA,rown+1)&BinB,Table1[Pin],0)+1)),INDEX(Table1[Name],MATCH(INDEX(BinA,rown+1)&BinB,Table1[Pin],0)+1),\"\")","v":"SSI1Tx"}]
[null,"A",{"$f":"INDEX(Table1[Name],MATCH(BinA&BinB,Table1[Pin],0))","v":"ADC1"},null,{"$f":"INDEX(Table1[Name],MATCH(BinA&BinB,Table1[Pin],0))","v":"ADC4"},null,{"$f":"INDEX(Table1[Name],MATCH(BinA&BinB,Table1[Pin],0))","v":"ADC5"},null,{"$f":"INDEX(Table1[Name],MATCH(BinA&BinB,Table1[Pin],0))","v":"ADC7"},null,{"$f":"INDEX(Table1[Name],MATCH(BinA&BinB,Table1[Pin],0))","v":"GNDA"},null,{"$f":"INDEX(Table1[Name],MATCH(BinA&BinB,Table1[Pin],0))","v":"PB4"},null,{"$f":"INDEX(Table1[Name],MATCH(BinA&BinB,Table1[Pin],0))","v":"PB6"},null,{"$f":"INDEX(Table1[Name],MATCH(BinA&BinB,Table1[Pin],0))","v":"PB7"},null,{"$f":"INDEX(Table1[Name],MATCH(BinA&BinB,Table1[Pin],0))","v":"PC0"},null,{"$f":"INDEX(Table1[Name],MATCH(BinA&BinB,Table1[Pin],0))","v":"PC3"},null,{"$f":"INDEX(Table1[Name],MATCH(BinA&BinB,Table1[Pin],0))","v":"PE0"},null,{"$f":"INDEX(Table1[Name],MATCH(BinA&BinB,Table1[Pin],0))","v":"PE3"},"A"]
[null,null,{"$f":"IF((C5<>\"\")*ISBLANK(INDEX(Table1[Pin],MATCH(INDEX(BinA,rown-1)&BinB,Table1[Pin],0)+2)),INDEX(Table1[Name],MATCH(INDEX(BinA,rown-1)&BinB,Table1[Pin],0)+2),\"\")","v":""},null,{"$f":"IF((E5<>\"\")*ISBLANK(INDEX(Table1[Pin],MATCH(INDEX(BinA,rown-1)&BinB,Table1[Pin],0)+2)),INDEX(Table1[Name],MATCH(INDEX(BinA,rown-1)&BinB,Table1[Pin],0)+2),\"\")","v":""},null,{"$f":"IF((G5<>\"\")*ISBLANK(INDEX(Table1[Pin],MATCH(INDEX(BinA,rown-1)&BinB,Table1[Pin],0)+2)),INDEX(Table1[Name],MATCH(INDEX(BinA,rown-1)&BinB,Table1[Pin],0)+2),\"\")","v":""},null,{"$f":"IF((I5<>\"\")*ISBLANK(INDEX(Table1[Pin],MATCH(INDEX(BinA,rown-1)&BinB,Table1[Pin],0)+2)),INDEX(Table1[Name],MATCH(INDEX(BinA,rown-1)&BinB,Table1[Pin],0)+2),\"\")","v":""},null,{"$f":"IF((K5<>\"\")*ISBLANK(INDEX(Table1[Pin],MATCH(INDEX(BinA,rown-1)&BinB,Table1[Pin],0)+2)),INDEX(Table1[Name],MATCH(INDEX(BinA,rown-1)&BinB,Table1[Pin],0)+2),\"\")","v":""},null,{"$f":"IF((M5<>\"\")*ISBLANK(INDEX(Table1[Pin],MATCH(INDEX(BinA,rown-1)&BinB,Table1[Pin],0)+2)),INDEX(Table1[Name],MATCH(INDEX(BinA,rown-1)&BinB,Table1[Pin],0)+2),\"\")","v":""},null,{"$f":"IF((O5<>\"\")*ISBLANK(INDEX(Table1[Pin],MATCH(INDEX(BinA,rown-1)&BinB,Table1[Pin],0)+2)),INDEX(Table1[Name],MATCH(INDEX(BinA,rown-1)&BinB,Table1[Pin],0)+2),\"\")","v":""},null,{"$f":"IF((Q5<>\"\")*ISBLANK(INDEX(Table1[Pin],MATCH(INDEX(BinA,rown-1)&BinB,Table1[Pin],0)+2)),INDEX(Table1[Name],MATCH(INDEX(BinA,rown-1)&BinB,Table1[Pin],0)+2),\"\")","v":""},null,{"$f":"IF((S5<>\"\")*ISBLANK(INDEX(Table1[Pin],MATCH(INDEX(BinA,rown-1)&BinB,Table1[Pin],0)+2)),INDEX(Table1[Name],MATCH(INDEX(BinA,rown-1)&BinB,Table1[Pin],0)+2),\"\")","v":"SWCLK"},null,{"$f":"IF((U5<>\"\")*ISBLANK(INDEX(Table1[Pin],MATCH(INDEX(BinA,rown-1)&BinB,Table1[Pin],0)+2)),INDEX(Table1[Name],MATCH(INDEX(BinA,rown-1)&BinB,Table1[Pin],0)+2),\"\")","v":"SWO"},null,{"$f":"IF((W5<>\"\")*ISBLANK(INDEX(Table1[Pin],MATCH(INDEX(BinA,rown-1)&BinB,Table1[Pin],0)+2)),INDEX(Table1[Name],MATCH(INDEX(BinA,rown-1)&BinB,Table1[Pin],0)+2),\"\")","v":""},null,{"$f":"IF((Y5<>\"\")*ISBLANK(INDEX(Table1[Pin],MATCH(INDEX(BinA,rown-1)&BinB,Table1[Pin],0)+2)),INDEX(Table1[Name],MATCH(INDEX(BinA,rown-1)&BinB,Table1[Pin],0)+2),\"\")","v":""}]
[]
[]
[null,null,{"$f":"IF(ISBLANK(INDEX(Table1[Pin],MATCH(INDEX(BinA,rown+1)&BinB,Table1[Pin],0)+1)),INDEX(Table1[Name],MATCH(INDEX(BinA,rown+1)&BinB,Table1[Pin],0)+1),\"\")","v":""},null,{"$f":"IF(ISBLANK(INDEX(Table1[Pin],MATCH(INDEX(BinA,rown+1)&BinB,Table1[Pin],0)+1)),INDEX(Table1[Name],MATCH(INDEX(BinA,rown+1)&BinB,Table1[Pin],0)+1),\"\")","v":""},null,{"$f":"IF(ISBLANK(INDEX(Table1[Pin],MATCH(INDEX(BinA,rown+1)&BinB,Table1[Pin],0)+1)),INDEX(Table1[Name],MATCH(INDEX(BinA,rown+1)&BinB,Table1[Pin],0)+1),\"\")","v":""},null,{"$f":"IF(ISBLANK(INDEX(Table1[Pin],MATCH(INDEX(BinA,rown+1)&BinB,Table1[Pin],0)+1)),INDEX(Table1[Name],MATCH(INDEX(BinA,rown+1)&BinB,Table1[Pin],0)+1),\"\")","v":""},null,{"$f":"IF(ISBLANK(INDEX(Table1[Pin],MATCH(INDEX(BinA,rown+1)&BinB,Table1[Pin],0)+1)),INDEX(Table1[Name],MATCH(INDEX(BinA,rown+1)&BinB,Table1[Pin],0)+1),\"\")","v":""},null,{"$f":"IF(ISBLANK(INDEX(Table1[Pin],MATCH(INDEX(BinA,rown+1)&BinB,Table1[Pin],0)+1)),INDEX(Table1[Name],MATCH(INDEX(BinA,rown+1)&BinB,Table1[Pin],0)+1),\"\")","v":""},null,{"$f":"IF(ISBLANK(INDEX(Table1[Pin],MATCH(INDEX(BinA,rown+1)&BinB,Table1[Pin],0)+1)),INDEX(Table1[Name],MATCH(INDEX(BinA,rown+1)&BinB,Table1[Pin],0)+1),\"\")","v":"C1-"},null,{"$f":"IF(ISBLANK(INDEX(Table1[Pin],MATCH(INDEX(BinA,rown+1)&BinB,Table1[Pin],0)+1)),INDEX(Table1[Name],MATCH(INDEX(BinA,rown+1)&BinB,Table1[Pin],0)+1),\"\")","v":"TDI"},null,{"$f":"IF(ISBLANK(INDEX(Table1[Pin],MATCH(INDEX(BinA,rown+1)&BinB,Table1[Pin],0)+1)),INDEX(Table1[Name],MATCH(INDEX(BinA,rown+1)&BinB,Table1[Pin],0)+1),\"\")","v":"TMS"},null,{"$f":"IF(ISBLANK(INDEX(Table1[Pin],MATCH(INDEX(BinA,rown+1)&BinB,Table1[Pin],0)+1)),INDEX(Table1[Name],MATCH(INDEX(BinA,rown+1)&BinB,Table1[Pin],0)+1),\"\")","v":""},null,{"$f":"IF(ISBLANK(INDEX(Table1[Pin],MATCH(INDEX(BinA,rown+1)&BinB,Table1[Pin],0)+1)),INDEX(Table1[Name],MATCH(INDEX(BinA,rown+1)&BinB,Table1[Pin],0)+1),\"\")","v":"SSI1Rx"},null,{"$f":"IF(ISBLANK(INDEX(Table1[Pin],MATCH(INDEX(BinA,rown+1)&BinB,Table1[Pin],0)+1)),INDEX(Table1[Name],MATCH(INDEX(BinA,rown+1)&BinB,Table1[Pin],0)+1),\"\")","v":"SSI1Fss"}]
[null,"B",{"$f":"INDEX(Table1[Name],MATCH(BinA&BinB,Table1[Pin],0))","v":"ADC0"},null,{"$f":"INDEX(Table1[Name],MATCH(BinA&BinB,Table1[Pin],0))","v":"ADC3"},null,{"$f":"INDEX(Table1[Name],MATCH(BinA&BinB,Table1[Pin],0))","v":"ADC2"},null,{"$f":"INDEX(Table1[Name],MATCH(BinA&BinB,Table1[Pin],0))","v":"ADC6"},null,{"$f":"INDEX(Table1[Name],MATCH(BinA&BinB,Table1[Pin],0))","v":"GNDA"},null,{"$f":"INDEX(Table1[Name],MATCH(BinA&BinB,Table1[Pin],0))","v":"GND"},null,{"$f":"INDEX(Table1[Name],MATCH(BinA&BinB,Table1[Pin],0))","v":"PB5"},null,{"$f":"INDEX(Table1[Name],MATCH(BinA&BinB,Table1[Pin],0))","v":"PC2"},null,{"$f":"INDEX(Table1[Name],MATCH(BinA&BinB,Table1[Pin],0))","v":"PC1"},null,{"$f":"INDEX(Table1[Name],MATCH(BinA&BinB,Table1[Pin],0))","v":"CMOD1"},null,{"$f":"INDEX(Table1[Name],MATCH(BinA&BinB,Table1[Pin],0))","v":"PE2"},null,{"$f":"INDEX(Table1[Name],MATCH(BinA&BinB,Table1[Pin],0))","v":"PE1"},"B"]
[null,null,{"$f":"IF((C10<>\"\")*ISBLANK(INDEX(Table1[Pin],MATCH(INDEX(BinA,rown-1)&BinB,Table1[Pin],0)+2)),INDEX(Table1[Name],MATCH(INDEX(BinA,rown-1)&BinB,Table1[Pin],0)+2),\"\")","v":""},null,{"$f":"IF((E10<>\"\")*ISBLANK(INDEX(Table1[Pin],MATCH(INDEX(BinA,rown-1)&BinB,Table1[Pin],0)+2)),INDEX(Table1[Name],MATCH(INDEX(BinA,rown-1)&BinB,Table1[Pin],0)+2),\"\")","v":""},null,{"$f":"IF((G10<>\"\")*ISBLANK(INDEX(Table1[Pin],MATCH(INDEX(BinA,rown-1)&BinB,Table1[Pin],0)+2)),INDEX(Table1[Name],MATCH(INDEX(BinA,rown-1)&BinB,Table1[Pin],0)+2),\"\")","v":""},null,{"$f":"IF((I10<>\"\")*ISBLANK(INDEX(Table1[Pin],MATCH(INDEX(BinA,rown-1)&BinB,Table1[Pin],0)+2)),INDEX(Table1[Name],MATCH(INDEX(BinA,rown-1)&BinB,Table1[Pin],0)+2),\"\")","v":""},null,{"$f":"IF((K10<>\"\")*ISBLANK(INDEX(Table1[Pin],MATCH(INDEX(BinA,rown-1)&BinB,Table1[Pin],0)+2)),INDEX(Table1[Name],MATCH(INDEX(BinA,rown-1)&BinB,Table1[Pin],0)+2),\"\")","v":""},null,{"$f":"IF((M10<>\"\")*ISBLANK(INDEX(Table1[Pin],MATCH(INDEX(BinA,rown-1)&BinB,Table1[Pin],0)+2)),INDEX(Table1[Name],MATCH(INDEX(BinA,rown-1)&BinB,Table1[Pin],0)+2),\"\")","v":""},null,{"$f":"IF((O10<>\"\")*ISBLANK(INDEX(Table1[Pin],MATCH(INDEX(BinA,rown-1)&BinB,Table1[Pin],0)+2)),INDEX(Table1[Name],MATCH(INDEX(BinA,rown-1)&BinB,Table1[Pin],0)+2),\"\")","v":""},null,{"$f":"IF((Q10<>\"\")*ISBLANK(INDEX(Table1[Pin],MATCH(INDEX(BinA,rown-1)&BinB,Table1[Pin],0)+2)),INDEX(Table1[Name],MATCH(INDEX(BinA,rown-1)&BinB,Table1[Pin],0)+2),\"\")","v":""},null,{"$f":"IF((S10<>\"\")*ISBLANK(INDEX(Table1[Pin],MATCH(INDEX(BinA,rown-1)&BinB,Table1[Pin],0)+2)),INDEX(Table1[Name],MATCH(INDEX(BinA,rown-1)&BinB,Table1[Pin],0)+2),\"\")","v":"SWDIO"},null,{"$f":"IF((U10<>\"\")*ISBLANK(INDEX(Table1[Pin],MATCH(INDEX(BinA,rown-1)&BinB,Table1[Pin],0)+2)),INDEX(Table1[Name],MATCH(INDEX(BinA,rown-1)&BinB,Table1[Pin],0)+2),\"\")","v":""},null,{"$f":"IF((W10<>\"\")*ISBLANK(INDEX(Table1[Pin],MATCH(INDEX(BinA,rown-1)&BinB,Table1[Pin],0)+2)),INDEX(Table1[Name],MATCH(INDEX(BinA,rown-1)&BinB,Table1[Pin],0)+2),\"\")","v":""},null,{"$f":"IF((Y10<>\"\")*ISBLANK(INDEX(Table1[Pin],MATCH(INDEX(BinA,rown-1)&BinB,Table1[Pin],0)+2)),INDEX(Table1[Name],MATCH(INDEX(BinA,rown-1)&BinB,Table1[Pin],0)+2),\"\")","v":""}]
[]
[]
[null,null,{"$f":"IF(ISBLANK(INDEX(Table1[Pin],MATCH(INDEX(BinA,rown+1)&BinB,Table1[Pin],0)+1)),INDEX(Table1[Name],MATCH(INDEX(BinA,rown+1)&BinB,Table1[Pin],0)+1),\"\")","v":""},null,{"$f":"IF(ISBLANK(INDEX(Table1[Pin],MATCH(INDEX(BinA,rown+1)&BinB,Table1[Pin],0)+1)),INDEX(Table1[Name],MATCH(INDEX(BinA,rown+1)&BinB,Table1[Pin],0)+1),\"\")","v":""},null,{"$f":"IF(ISBLANK(INDEX(Table1[Pin],MATCH(INDEX(BinA,rown+1)&BinB,Table1[Pin],0)+1)),INDEX(Table1[Name],MATCH(INDEX(BinA,rown+1)&BinB,Table1[Pin],0)+1),\"\")","v":""},null,{"$f":"IF(ISBLANK(INDEX(Table1[Pin],MATCH(INDEX(BinA,rown+1)&BinB,Table1[Pin],0)+1)),INDEX(Table1[Name],MATCH(INDEX(BinA,rown+1)&BinB,Table1[Pin],0)+1),\"\")","v":""},null,{"$f":"IF(ISBLANK(INDEX(Table1[Pin],MATCH(INDEX(BinA,rown+1)&BinB,Table1[Pin],0)+1)),INDEX(Table1[Name],MATCH(INDEX(BinA,rown+1)&BinB,Table1[Pin],0)+1),\"\")","v":""},null,{"$f":"IF(ISBLANK(INDEX(Table1[Pin],MATCH(INDEX(BinA,rown+1)&BinB,Table1[Pin],0)+1)),INDEX(Table1[Name],MATCH(INDEX(BinA,rown+1)&BinB,Table1[Pin],0)+1),\"\")","v":""},null,{"$f":"IF(ISBLANK(INDEX(Table1[Pin],MATCH(INDEX(BinA,rown+1)&BinB,Table1[Pin],0)+1)),INDEX(Table1[Name],MATCH(INDEX(BinA,rown+1)&BinB,Table1[Pin],0)+1),\"\")","v":""},null,{"$f":"IF(ISBLANK(INDEX(Table1[Pin],MATCH(INDEX(BinA,rown+1)&BinB,Table1[Pin],0)+1)),INDEX(Table1[Name],MATCH(INDEX(BinA,rown+1)&BinB,Table1[Pin],0)+1),\"\")","v":""},null,{"$f":"IF(ISBLANK(INDEX(Table1[Pin],MATCH(INDEX(BinA,rown+1)&BinB,Table1[Pin],0)+1)),INDEX(Table1[Name],MATCH(INDEX(BinA,rown+1)&BinB,Table1[Pin],0)+1),\"\")","v":""},null,{"$f":"IF(ISBLANK(INDEX(Table1[Pin],MATCH(INDEX(BinA,rown+1)&BinB,Table1[Pin],0)+1)),INDEX(Table1[Name],MATCH(INDEX(BinA,rown+1)&BinB,Table1[Pin],0)+1),\"\")","v":""},null,{"$f":"IF(ISBLANK(INDEX(Table1[Pin],MATCH(INDEX(BinA,rown+1)&BinB,Table1[Pin],0)+1)),INDEX(Table1[Name],MATCH(INDEX(BinA,rown+1)&BinB,Table1[Pin],0)+1),\"\")","v":"I2C0SCL"},null,{"$f":"IF(ISBLANK(INDEX(Table1[Pin],MATCH(INDEX(BinA,rown+1)&BinB,Table1[Pin],0)+1)),INDEX(Table1[Name],MATCH(INDEX(BinA,rown+1)&BinB,Table1[Pin],0)+1),\"\")","v":"I2C0SDA"}]
[null,"C",{"$f":"INDEX(Table1[Name],MATCH(BinA&BinB,Table1[Pin],0))","v":"NC"},null,{"$f":"INDEX(Table1[Name],MATCH(BinA&BinB,Table1[Pin],0))","v":"NC"},null,{"$f":"INDEX(Table1[Name],MATCH(BinA&BinB,Table1[Pin],0))","v":"VDD25"},null,{"$f":"INDEX(Table1[Name],MATCH(BinA&BinB,Table1[Pin],0))","v":"GND"},null,{"$f":"INDEX(Table1[Name],MATCH(BinA&BinB,Table1[Pin],0))","v":"GND"},null,{"$f":"INDEX(Table1[Name],MATCH(BinA&BinB,Table1[Pin],0))","v":"VDDA"},null,{"$f":"INDEX(Table1[Name],MATCH(BinA&BinB,Table1[Pin],0))","v":"VDDA"},null,{"$f":"INDEX(Table1[Name],MATCH(BinA&BinB,Table1[Pin],0))","v":"GNDPHY"},null,{"$f":"INDEX(Table1[Name],MATCH(BinA&BinB,Table1[Pin],0))","v":"GNDPHY"},null,{"$f":"INDEX(Table1[Name],MATCH(BinA&BinB,Table1[Pin],0))","v":"VCCPHY"},null,{"$f":"INDEX(Table1[Name],MATCH(BinA&BinB,Table1[Pin],0))","v":"PB2"},null,{"$f":"INDEX(Table1[Name],MATCH(BinA&BinB,Table1[Pin],0))","v":"PB3"},"C"]
[null,null,{"$f":"IF((C15<>\"\")*ISBLANK(INDEX(Table1[Pin],MATCH(INDEX(BinA,rown-1)&BinB,Table1[Pin],0)+2)),INDEX(Table1[Name],MATCH(INDEX(BinA,rown-1)&BinB,Table1[Pin],0)+2),\"\")","v":""},null,{"$f":"IF((E15<>\"\")*ISBLANK(INDEX(Table1[Pin],MATCH(INDEX(BinA,rown-1)&BinB,Table1[Pin],0)+2)),INDEX(Table1[Name],MATCH(INDEX(BinA,rown-1)&BinB,Table1[Pin],0)+2),\"\")","v":""},null,{"$f":"IF((G15<>\"\")*ISBLANK(INDEX(Table1[Pin],MATCH(INDEX(BinA,rown-1)&BinB,Table1[Pin],0)+2)),INDEX(Table1[Name],MATCH(INDEX(BinA,rown-1)&BinB,Table1[Pin],0)+2),\"\")","v":""},null,{"$f":"IF((I15<>\"\")*ISBLANK(INDEX(Table1[Pin],MATCH(INDEX(BinA,rown-1)&BinB,Table1[Pin],0)+2)),INDEX(Table1[Name],MATCH(INDEX(BinA,rown-1)&BinB,Table1[Pin],0)+2),\"\")","v":""},null,{"$f":"IF((K15<>\"\")*ISBLANK(INDEX(Table1[Pin],MATCH(INDEX(BinA,rown-1)&BinB,Table1[Pin],0)+2)),INDEX(Table1[Name],MATCH(INDEX(BinA,rown-1)&BinB,Table1[Pin],0)+2),\"\")","v":""},null,{"$f":"IF((M15<>\"\")*ISBLANK(INDEX(Table1[Pin],MATCH(INDEX(BinA,rown-1)&BinB,Table1[Pin],0)+2)),INDEX(Table1[Name],MATCH(INDEX(BinA,rown-1)&BinB,Table1[Pin],0)+2),\"\")","v":""},null,{"$f":"IF((O15<>\"\")*ISBLANK(INDEX(Table1[Pin],MATCH(INDEX(BinA,rown-1)&BinB,Table1[Pin],0)+2)),INDEX(Table1[Name],MATCH(INDEX(BinA,rown-1)&BinB,Table1[Pin],0)+2),\"\")","v":""},null,{"$f":"IF((Q15<>\"\")*ISBLANK(INDEX(Table1[Pin],MATCH(INDEX(BinA,rown-1)&BinB,Table1[Pin],0)+2)),INDEX(Table1[Name],MATCH(INDEX(BinA,rown-1)&BinB,Table1[Pin],0)+2),\"\")","v":""},null,{"$f":"IF((S15<>\"\")*ISBLANK(INDEX(Table1[Pin],MATCH(INDEX(BinA,rown-1)&BinB,Table1[Pin],0)+2)),INDEX(Table1[Name],MATCH(INDEX(BinA,rown-1)&BinB,Table1[Pin],0)+2),\"\")","v":""},null,{"$f":"IF((U15<>\"\")*ISBLANK(INDEX(Table1[Pin],MATCH(INDEX(BinA,rown-1)&BinB,Table1[Pin],0)+2)),INDEX(Table1[Name],MATCH(INDEX(BinA,rown-1)&BinB,Table1[Pin],0)+2),\"\")","v":""},null,{"$f":"IF((W15<>\"\")*ISBLANK(INDEX(Table1[Pin],MATCH(INDEX(BinA,rown-1)&BinB,Table1[Pin],0)+2)),INDEX(Table1[Name],MATCH(INDEX(BinA,rown-1)&BinB,Table1[Pin],0)+2),\"\")","v":""},null,{"$f":"IF((Y15<>\"\")*ISBLANK(INDEX(Table1[Pin],MATCH(INDEX(BinA,rown-1)&BinB,Table1[Pin],0)+2)),INDEX(Table1[Name],MATCH(INDEX(BinA,rown-1)&BinB,Table1[Pin],0)+2),\"\")","v":""}]
[]
[]
[null,null,{"$f":"IF(ISBLANK(INDEX(Table1[Pin],MATCH(INDEX(BinA,rown+1)&BinB,Table1[Pin],0)+1)),INDEX(Table1[Name],MATCH(INDEX(BinA,rown+1)&BinB,Table1[Pin],0)+1),\"\")","v":""},null,{"$f":"IF(ISBLANK(INDEX(Table1[Pin],MATCH(INDEX(BinA,rown+1)&BinB,Table1[Pin],0)+1)),INDEX(Table1[Name],MATCH(INDEX(BinA,rown+1)&BinB,Table1[Pin],0)+1),\"\")","v":""},null,{"$f":"IF(ISBLANK(INDEX(Table1[Pin],MATCH(INDEX(BinA,rown+1)&BinB,Table1[Pin],0)+1)),INDEX(Table1[Name],MATCH(INDEX(BinA,rown+1)&BinB,Table1[Pin],0)+1),\"\")","v":""},null,null,null,null,null,null,null,null,null,null,null,null,null,{"$f":"IF(ISBLANK(INDEX(Table1[Pin],MATCH(INDEX(BinA,rown+1)&BinB,Table1[Pin],0)+1)),INDEX(Table1[Name],MATCH(INDEX(BinA,rown+1)&BinB,Table1[Pin],0)+1),\"\")","v":""},null,{"$f":"IF(ISBLANK(INDEX(Table1[Pin],MATCH(INDEX(BinA,rown+1)&BinB,Table1[Pin],0)+1)),INDEX(Table1[Name],MATCH(INDEX(BinA,rown+1)&BinB,Table1[Pin],0)+1),\"\")","v":""},null,{"$f":"IF(ISBLANK(INDEX(Table1[Pin],MATCH(INDEX(BinA,rown+1)&BinB,Table1[Pin],0)+1)),INDEX(Table1[Name],MATCH(INDEX(BinA,rown+1)&BinB,Table1[Pin],0)+1),\"\")","v":"CCP2"}]
[null,"D",{"$f":"INDEX(Table1[Name],MATCH(BinA&BinB,Table1[Pin],0))","v":"NC"},null,{"$f":"INDEX(Table1[Name],MATCH(BinA&BinB,Table1[Pin],0))","v":"NC"},null,{"$f":"INDEX(Table1[Name],MATCH(BinA&BinB,Table1[Pin],0))","v":"VDD25"},null,null,null,null,null,null,null,null,null,null,null,null,null,{"$f":"INDEX(Table1[Name],MATCH(BinA&BinB,Table1[Pin],0))","v":"VCCPHY"},null,{"$f":"INDEX(Table1[Name],MATCH(BinA&BinB,Table1[Pin],0))","v":"VCCPHY"},null,{"$f":"INDEX(Table1[Name],MATCH(BinA&BinB,Table1[Pin],0))","v":"PB1"},"D"]
[null,null,{"$f":"IF((C20<>\"\")*ISBLANK(INDEX(Table1[Pin],MATCH(INDEX(BinA,rown-1)&BinB,Table1[Pin],0)+2)),INDEX(Table1[Name],MATCH(INDEX(BinA,rown-1)&BinB,Table1[Pin],0)+2),\"\")","v":""},null,{"$f":"IF((E20<>\"\")*ISBLANK(INDEX(Table1[Pin],MATCH(INDEX(BinA,rown-1)&BinB,Table1[Pin],0)+2)),INDEX(Table1[Name],MATCH(INDEX(BinA,rown-1)&BinB,Table1[Pin],0)+2),\"\")","v":""},null,{"$f":"IF((G20<>\"\")*ISBLANK(INDEX(Table1[Pin],MATCH(INDEX(BinA,rown-1)&BinB,Table1[Pin],0)+2)),INDEX(Table1[Name],MATCH(INDEX(BinA,rown-1)&BinB,Table1[Pin],0)+2),\"\")","v":""},null,null,null,null,null,null,null,null,null,null,null,null,null,{"$f":"IF((U20<>\"\")*ISBLANK(INDEX(Table1[Pin],MATCH(INDEX(BinA,rown-1)&BinB,Table1[Pin],0)+2)),INDEX(Table1[Name],MATCH(INDEX(BinA,rown-1)&BinB,Table1[Pin],0)+2),\"\")","v":""},null,{"$f":"IF((W20<>\"\")*ISBLANK(INDEX(Table1[Pin],MATCH(INDEX(BinA,rown-1)&BinB,Table1[Pin],0)+2)),INDEX(Table1[Name],MATCH(INDEX(BinA,rown-1)&BinB,Table1[Pin],0)+2),\"\")","v":""},null,{"$f":"IF((Y20<>\"\")*ISBLANK(INDEX(Table1[Pin],MATCH(INDEX(BinA,rown-1)&BinB,Table1[Pin],0)+2)),INDEX(Table1[Name],MATCH(INDEX(BinA,rown-1)&BinB,Table1[Pin],0)+2),\"\")","v":""}]
[]
[]
[null,null,{"$f":"IF(ISBLANK(INDEX(Table1[Pin],MATCH(INDEX(BinA,rown+1)&BinB,Table1[Pin],0)+1)),INDEX(Table1[Name],MATCH(INDEX(BinA,rown+1)&BinB,Table1[Pin],0)+1),\"\")","v":""},null,{"$f":"IF(ISBLANK(INDEX(Table1[Pin],MATCH(INDEX(BinA,rown+1)&BinB,Table1[Pin],0)+1)),INDEX(Table1[Name],MATCH(INDEX(BinA,rown+1)&BinB,Table1[Pin],0)+1),\"\")","v":""},null,{"$f":"IF(ISBLANK(INDEX(Table1[Pin],MATCH(INDEX(BinA,rown+1)&BinB,Table1[Pin],0)+1)),INDEX(Table1[Name],MATCH(INDEX(BinA,rown+1)&BinB,Table1[Pin],0)+1),\"\")","v":""},null,null,null,null,null,null,null,null,null,null,null,null,null,{"$f":"IF(ISBLANK(INDEX(Table1[Pin],MATCH(INDEX(BinA,rown+1)&BinB,Table1[Pin],0)+1)),INDEX(Table1[Name],MATCH(INDEX(BinA,rown+1)&BinB,Table1[Pin],0)+1),\"\")","v":""},null,{"$f":"IF(ISBLANK(INDEX(Table1[Pin],MATCH(INDEX(BinA,rown+1)&BinB,Table1[Pin],0)+1)),INDEX(Table1[Name],MATCH(INDEX(BinA,rown+1)&BinB,Table1[Pin],0)+1),\"\")","v":""},null,{"$f":"IF(ISBLANK(INDEX(Table1[Pin],MATCH(INDEX(BinA,rown+1)&BinB,Table1[Pin],0)+1)),INDEX(Table1[Name],MATCH(INDEX(BinA,rown+1)&BinB,Table1[Pin],0)+1),\"\")","v":"CCP0"}]
[null,"E",{"$f":"INDEX(Table1[Name],MATCH(BinA&BinB,Table1[Pin],0))","v":"NC"},null,{"$f":"INDEX(Table1[Name],MATCH(BinA&BinB,Table1[Pin],0))","v":"NC"},null,{"$f":"INDEX(Table1[Name],MATCH(BinA&BinB,Table1[Pin],0))","v":"LDO"},null,null,null,null,null,null,null,null,null,null,null,null,null,{"$f":"INDEX(Table1[Name],MATCH(BinA&BinB,Table1[Pin],0))","v":"VDD33"},null,{"$f":"INDEX(Table1[Name],MATCH(BinA&BinB,Table1[Pin],0))","v":"CMOD0"},null,{"$f":"INDEX(Table1[Name],MATCH(BinA&BinB,Table1[Pin],0))","v":"PB0"},"E"]
[null,null,{"$f":"IF((C25<>\"\")*ISBLANK(INDEX(Table1[Pin],MATCH(INDEX(BinA,rown-1)&BinB,Table1[Pin],0)+2)),INDEX(Table1[Name],MATCH(INDEX(BinA,rown-1)&BinB,Table1[Pin],0)+2),\"\")","v":""},null,{"$f":"IF((E25<>\"\")*ISBLANK(INDEX(Table1[Pin],MATCH(INDEX(BinA,rown-1)&BinB,Table1[Pin],0)+2)),INDEX(Table1[Name],MATCH(INDEX(BinA,rown-1)&BinB,Table1[Pin],0)+2),\"\")","v":""},null,{"$f":"IF((G25<>\"\")*ISBLANK(INDEX(Table1[Pin],MATCH(INDEX(BinA,rown-1)&BinB,Table1[Pin],0)+2)),INDEX(Table1[Name],MATCH(INDEX(BinA,rown-1)&BinB,Table1[Pin],0)+2),\"\")","v":""},null,null,null,null,null,null,null,null,null,null,null,null,null,{"$f":"IF((U25<>\"\")*ISBLANK(INDEX(Table1[Pin],MATCH(INDEX(BinA,rown-1)&BinB,Table1[Pin],0)+2)),INDEX(Table1[Name],MATCH(INDEX(BinA,rown-1)&BinB,Table1[Pin],0)+2),\"\")","v":""},null,{"$f":"IF((W25<>\"\")*ISBLANK(INDEX(Table1[Pin],MATCH(INDEX(BinA,rown-1)&BinB,Table1[Pin],0)+2)),INDEX(Table1[Name],MATCH(INDEX(BinA,rown-1)&BinB,Table1[Pin],0)+2),\"\")","v":""},null,{"$f":"IF((Y25<>\"\")*ISBLANK(INDEX(Table1[Pin],MATCH(INDEX(BinA,rown-1)&BinB,Table1[Pin],0)+2)),INDEX(Table1[Name],MATCH(INDEX(BinA,rown-1)&BinB,Table1[Pin],0)+2),\"\")","v":""}]
[]
[]
[null,null,{"$f":"IF(ISBLANK(INDEX(Table1[Pin],MATCH(INDEX(BinA,rown+1)&BinB,Table1[Pin],0)+1)),INDEX(Table1[Name],MATCH(INDEX(BinA,rown+1)&BinB,Table1[Pin],0)+1),\"\")","v":""},null,{"$f":"IF(ISBLANK(INDEX(Table1[Pin],MATCH(INDEX(BinA,rown+1)&BinB,Table1[Pin],0)+1)),INDEX(Table1[Name],MATCH(INDEX(BinA,rown+1)&BinB,Table1[Pin],0)+1),\"\")","v":""},null,{"$f":"IF(ISBLANK(INDEX(Table1[Pin],MATCH(INDEX(BinA,rown+1)&BinB,Table1[Pin],0)+1)),INDEX(Table1[Name],MATCH(INDEX(BinA,rown+1)&BinB,Table1[Pin],0)+1),\"\")","v":""},null,null,null,null,null,null,null,null,null,null,null,null,null,{"$f":"IF(ISBLANK(INDEX(Table1[Pin],MATCH(INDEX(BinA,rown+1)&BinB,Table1[Pin],0)+1)),INDEX(Table1[Name],MATCH(INDEX(BinA,rown+1)&BinB,Table1[Pin],0)+1),\"\")","v":""},null,{"$f":"IF(ISBLANK(INDEX(Table1[Pin],MATCH(INDEX(BinA,rown+1)&BinB,Table1[Pin],0)+1)),INDEX(Table1[Name],MATCH(INDEX(BinA,rown+1)&BinB,Table1[Pin],0)+1),\"\")","v":""},null,{"$f":"IF(ISBLANK(INDEX(Table1[Pin],MATCH(INDEX(BinA,rown+1)&BinB,Table1[Pin],0)+1)),INDEX(Table1[Name],MATCH(INDEX(BinA,rown+1)&BinB,Table1[Pin],0)+1),\"\")","v":""}]
[null,"F",{"$f":"INDEX(Table1[Name],MATCH(BinA&BinB,Table1[Pin],0))","v":"NC"},null,{"$f":"INDEX(Table1[Name],MATCH(BinA&BinB,Table1[Pin],0))","v":"NC"},null,{"$f":"INDEX(Table1[Name],MATCH(BinA&BinB,Table1[Pin],0))","v":"VDD25"},null,null,null,null,null,null,null,null,null,null,null,null,null,{"$f":"INDEX(Table1[Name],MATCH(BinA&BinB,Table1[Pin],0))","v":"GND"},null,{"$f":"INDEX(Table1[Name],MATCH(BinA&BinB,Table1[Pin],0))","v":"GND"},null,{"$f":"INDEX(Table1[Name],MATCH(BinA&BinB,Table1[Pin],0))","v":"GND"},"F"]
[null,null,{"$f":"IF((C30<>\"\")*ISBLANK(INDEX(Table1[Pin],MATCH(INDEX(BinA,rown-1)&BinB,Table1[Pin],0)+2)),INDEX(Table1[Name],MATCH(INDEX(BinA,rown-1)&BinB,Table1[Pin],0)+2),\"\")","v":""},null,{"$f":"IF((E30<>\"\")*ISBLANK(INDEX(Table1[Pin],MATCH(INDEX(BinA,rown-1)&BinB,Table1[Pin],0)+2)),INDEX(Table1[Name],MATCH(INDEX(BinA,rown-1)&BinB,Table1[Pin],0)+2),\"\")","v":""},null,{"$f":"IF((G30<>\"\")*ISBLANK(INDEX(Table1[Pin],MATCH(INDEX(BinA,rown-1)&BinB,Table1[Pin],0)+2)),INDEX(Table1[Name],MATCH(INDEX(BinA,rown-1)&BinB,Table1[Pin],0)+2),\"\")","v":""},null,null,null,null,null,null,null,null,null,null,null,null,null,{"$f":"IF((U30<>\"\")*ISBLANK(INDEX(Table1[Pin],MATCH(INDEX(BinA,rown-1)&BinB,Table1[Pin],0)+2)),INDEX(Table1[Name],MATCH(INDEX(BinA,rown-1)&BinB,Table1[Pin],0)+2),\"\")","v":""},null,{"$f":"IF((W30<>\"\")*ISBLANK(INDEX(Table1[Pin],MATCH(INDEX(BinA,rown-1)&BinB,Table1[Pin],0)+2)),INDEX(Table1[Name],MATCH(INDEX(BinA,rown-1)&BinB,Table1[Pin],0)+2),\"\")","v":""},null,{"$f":"IF((Y30<>\"\")*ISBLANK(INDEX(Table1[Pin],MATCH(INDEX(BinA,rown-1)&BinB,Table1[Pin],0)+2)),INDEX(Table1[Name],MATCH(INDEX(BinA,rown-1)&BinB,Table1[Pin],0)+2),\"\")","v":""}]
[]
[]
[null,null,{"$f":"IF(ISBLANK(INDEX(Table1[Pin],MATCH(INDEX(BinA,rown+1)&BinB,Table1[Pin],0)+1)),INDEX(Table1[Name],MATCH(INDEX(BinA,rown+1)&BinB,Table1[Pin],0)+1),\"\")","v":""},null,{"$f":"IF(ISBLANK(INDEX(Table1[Pin],MATCH(INDEX(BinA,rown+1)&BinB,Table1[Pin],0)+1)),INDEX(Table1[Name],MATCH(INDEX(BinA,rown+1)&BinB,Table1[Pin],0)+1),\"\")","v":""},null,{"$f":"IF(ISBLANK(INDEX(Table1[Pin],MATCH(INDEX(BinA,rown+1)&BinB,Table1[Pin],0)+1)),INDEX(Table1[Name],MATCH(INDEX(BinA,rown+1)&BinB,Table1[Pin],0)+1),\"\")","v":""},null,null,null,null,null,null,null,null,null,null,null,null,null,{"$f":"IF(ISBLANK(INDEX(Table1[Pin],MATCH(INDEX(BinA,rown+1)&BinB,Table1[Pin],0)+1)),INDEX(Table1[Name],MATCH(INDEX(BinA,rown+1)&BinB,Table1[Pin],0)+1),\"\")","v":""},null,{"$f":"IF(ISBLANK(INDEX(Table1[Pin],MATCH(INDEX(BinA,rown+1)&BinB,Table1[Pin],0)+1)),INDEX(Table1[Name],MATCH(INDEX(BinA,rown+1)&BinB,Table1[Pin],0)+1),\"\")","v":""},null,{"$f":"IF(ISBLANK(INDEX(Table1[Pin],MATCH(INDEX(BinA,rown+1)&BinB,Table1[Pin],0)+1)),INDEX(Table1[Name],MATCH(INDEX(BinA,rown+1)&BinB,Table1[Pin],0)+1),\"\")","v":""}]
[null,"G",{"$f":"INDEX(Table1[Name],MATCH(BinA&BinB,Table1[Pin],0))","v":"PD0"},null,{"$f":"INDEX(Table1[Name],MATCH(BinA&BinB,Table1[Pin],0))","v":"PD1"},null,{"$f":"INDEX(Table1[Name],MATCH(BinA&BinB,Table1[Pin],0))","v":"VDD25"},null,null,null,null,null,null,null,null,null,null,null,null,null,{"$f":"INDEX(Table1[Name],MATCH(BinA&BinB,Table1[Pin],0))","v":"VDD33"},null,{"$f":"INDEX(Table1[Name],MATCH(BinA&BinB,Table1[Pin],0))","v":"VDD33"},null,{"$f":"INDEX(Table1[Name],MATCH(BinA&BinB,Table1[Pin],0))","v":"VDD33"},"G"]
[null,null,{"$f":"IF((C35<>\"\")*ISBLANK(INDEX(Table1[Pin],MATCH(INDEX(BinA,rown-1)&BinB,Table1[Pin],0)+2)),INDEX(Table1[Name],MATCH(INDEX(BinA,rown-1)&BinB,Table1[Pin],0)+2),\"\")","v":""},null,{"$f":"IF((E35<>\"\")*ISBLANK(INDEX(Table1[Pin],MATCH(INDEX(BinA,rown-1)&BinB,Table1[Pin],0)+2)),INDEX(Table1[Name],MATCH(INDEX(BinA,rown-1)&BinB,Table1[Pin],0)+2),\"\")","v":""},null,{"$f":"IF((G35<>\"\")*ISBLANK(INDEX(Table1[Pin],MATCH(INDEX(BinA,rown-1)&BinB,Table1[Pin],0)+2)),INDEX(Table1[Name],MATCH(INDEX(BinA,rown-1)&BinB,Table1[Pin],0)+2),\"\")","v":""},null,null,null,null,null,null,null,null,null,null,null,null,null,{"$f":"IF((U35<>\"\")*ISBLANK(INDEX(Table1[Pin],MATCH(INDEX(BinA,rown-1)&BinB,Table1[Pin],0)+2)),INDEX(Table1[Name],MATCH(INDEX(BinA,rown-1)&BinB,Table1[Pin],0)+2),\"\")","v":""},null,{"$f":"IF((W35<>\"\")*ISBLANK(INDEX(Table1[Pin],MATCH(INDEX(BinA,rown-1)&BinB,Table1[Pin],0)+2)),INDEX(Table1[Name],MATCH(INDEX(BinA,rown-1)&BinB,Table1[Pin],0)+2),\"\")","v":""},null,{"$f":"IF((Y35<>\"\")*ISBLANK(INDEX(Table1[Pin],MATCH(INDEX(BinA,rown-1)&BinB,Table1[Pin],0)+2)),INDEX(Table1[Name],MATCH(INDEX(BinA,rown-1)&BinB,Table1[Pin],0)+2),\"\")","v":""}]
[]
[]
[null,null,{"$f":"IF(ISBLANK(INDEX(Table1[Pin],MATCH(INDEX(BinA,rown+1)&BinB,Table1[Pin],0)+1)),INDEX(Table1[Name],MATCH(INDEX(BinA,rown+1)&BinB,Table1[Pin],0)+1),\"\")","v":"U1Tx"},null,{"$f":"IF(ISBLANK(INDEX(Table1[Pin],MATCH(INDEX(BinA,rown+1)&BinB,Table1[Pin],0)+1)),INDEX(Table1[Name],MATCH(INDEX(BinA,rown+1)&BinB,Table1[Pin],0)+1),\"\")","v":"U1Rx"},null,{"$f":"IF(ISBLANK(INDEX(Table1[Pin],MATCH(INDEX(BinA,rown+1)&BinB,Table1[Pin],0)+1)),INDEX(Table1[Name],MATCH(INDEX(BinA,rown+1)&BinB,Table1[Pin],0)+1),\"\")","v":""},null,null,null,null,null,null,null,null,null,null,null,null,null,{"$f":"IF(ISBLANK(INDEX(Table1[Pin],MATCH(INDEX(BinA,rown+1)&BinB,Table1[Pin],0)+1)),INDEX(Table1[Name],MATCH(INDEX(BinA,rown+1)&BinB,Table1[Pin],0)+1),\"\")","v":""},null,{"$f":"IF(ISBLANK(INDEX(Table1[Pin],MATCH(INDEX(BinA,rown+1)&BinB,Table1[Pin],0)+1)),INDEX(Table1[Name],MATCH(INDEX(BinA,rown+1)&BinB,Table1[Pin],0)+1),\"\")","v":""},null,{"$f":"IF(ISBLANK(INDEX(Table1[Pin],MATCH(INDEX(BinA,rown+1)&BinB,Table1[Pin],0)+1)),INDEX(Table1[Name],MATCH(INDEX(BinA,rown+1)&BinB,Table1[Pin],0)+1),\"\")","v":""}]
[null,"H",{"$f":"INDEX(Table1[Name],MATCH(BinA&BinB,Table1[Pin],0))","v":"PD3"},null,{"$f":"INDEX(Table1[Name],MATCH(BinA&BinB,Table1[Pin],0))","v":"PD2"},null,{"$f":"INDEX(Table1[Name],MATCH(BinA&BinB,Table1[Pin],0))","v":"GND"},null,null,null,null,null,null,null,null,null,null,null,null,null,{"$f":"INDEX(Table1[Name],MATCH(BinA&BinB,Table1[Pin],0))","v":"VDD33"},null,{"$f":"INDEX(Table1[Name],MATCH(BinA&BinB,Table1[Pin],0))","v":"RST"},null,{"$f":"INDEX(Table1[Name],MATCH(BinA&BinB,Table1[Pin],0))","v":"PF1"},"H"]
[null,null,{"$f":"IF((C40<>\"\")*ISBLANK(INDEX(Table1[Pin],MATCH(INDEX(BinA,rown-1)&BinB,Table1[Pin],0)+2)),INDEX(Table1[Name],MATCH(INDEX(BinA,rown-1)&BinB,Table1[Pin],0)+2),\"\")","v":""},null,{"$f":"IF((E40<>\"\")*ISBLANK(INDEX(Table1[Pin],MATCH(INDEX(BinA,rown-1)&BinB,Table1[Pin],0)+2)),INDEX(Table1[Name],MATCH(INDEX(BinA,rown-1)&BinB,Table1[Pin],0)+2),\"\")","v":""},null,{"$f":"IF((G40<>\"\")*ISBLANK(INDEX(Table1[Pin],MATCH(INDEX(BinA,rown-1)&BinB,Table1[Pin],0)+2)),INDEX(Table1[Name],MATCH(INDEX(BinA,rown-1)&BinB,Table1[Pin],0)+2),\"\")","v":""},null,null,null,null,null,null,null,null,null,null,null,null,null,{"$f":"IF((U40<>\"\")*ISBLANK(INDEX(Table1[Pin],MATCH(INDEX(BinA,rown-1)&BinB,Table1[Pin],0)+2)),INDEX(Table1[Name],MATCH(INDEX(BinA,rown-1)&BinB,Table1[Pin],0)+2),\"\")","v":""},null,{"$f":"IF((W40<>\"\")*ISBLANK(INDEX(Table1[Pin],MATCH(INDEX(BinA,rown-1)&BinB,Table1[Pin],0)+2)),INDEX(Table1[Name],MATCH(INDEX(BinA,rown-1)&BinB,Table1[Pin],0)+2),\"\")","v":""},null,{"$f":"IF((Y40<>\"\")*ISBLANK(INDEX(Table1[Pin],MATCH(INDEX(BinA,rown-1)&BinB,Table1[Pin],0)+2)),INDEX(Table1[Name],MATCH(INDEX(BinA,rown-1)&BinB,Table1[Pin],0)+2),\"\")","v":""}]
[]
[]
[null,null,{"$f":"IF(ISBLANK(INDEX(Table1[Pin],MATCH(INDEX(BinA,rown+1)&BinB,Table1[Pin],0)+1)),INDEX(Table1[Name],MATCH(INDEX(BinA,rown+1)&BinB,Table1[Pin],0)+1),\"\")","v":""},null,{"$f":"IF(ISBLANK(INDEX(Table1[Pin],MATCH(INDEX(BinA,rown+1)&BinB,Table1[Pin],0)+1)),INDEX(Table1[Name],MATCH(INDEX(BinA,rown+1)&BinB,Table1[Pin],0)+1),\"\")","v":""},null,{"$f":"IF(ISBLANK(INDEX(Table1[Pin],MATCH(INDEX(BinA,rown+1)&BinB,Table1[Pin],0)+1)),INDEX(Table1[Name],MATCH(INDEX(BinA,rown+1)&BinB,Table1[Pin],0)+1),\"\")","v":""},null,null,null,null,null,null,null,null,null,null,null,null,null,{"$f":"IF(ISBLANK(INDEX(Table1[Pin],MATCH(INDEX(BinA,rown+1)&BinB,Table1[Pin],0)+1)),INDEX(Table1[Name],MATCH(INDEX(BinA,rown+1)&BinB,Table1[Pin],0)+1),\"\")","v":""},null,{"$f":"IF(ISBLANK(INDEX(Table1[Pin],MATCH(INDEX(BinA,rown+1)&BinB,Table1[Pin],0)+1)),INDEX(Table1[Name],MATCH(INDEX(BinA,rown+1)&BinB,Table1[Pin],0)+1),\"\")","v":"LED1"},null,{"$f":"IF(ISBLANK(INDEX(Table1[Pin],MATCH(INDEX(BinA,rown+1)&BinB,Table1[Pin],0)+1)),INDEX(Table1[Name],MATCH(INDEX(BinA,rown+1)&BinB,Table1[Pin],0)+1),\"\")","v":"LED0"}]
[null,"J",{"$f":"INDEX(Table1[Name],MATCH(BinA&BinB,Table1[Pin],0))","v":"XTALNPHY"},null,{"$f":"INDEX(Table1[Name],MATCH(BinA&BinB,Table1[Pin],0))","v":"XTALPPHY"},null,{"$f":"INDEX(Table1[Name],MATCH(BinA&BinB,Table1[Pin],0))","v":"GND"},null,null,null,null,null,null,null,null,null,null,null,null,null,{"$f":"INDEX(Table1[Name],MATCH(BinA&BinB,Table1[Pin],0))","v":"GND"},null,{"$f":"INDEX(Table1[Name],MATCH(BinA&BinB,Table1[Pin],0))","v":"PF2"},null,{"$f":"INDEX(Table1[Name],MATCH(BinA&BinB,Table1[Pin],0))","v":"PF3"},"J"]
[null,null,{"$f":"IF((C45<>\"\")*ISBLANK(INDEX(Table1[Pin],MATCH(INDEX(BinA,rown-1)&BinB,Table1[Pin],0)+2)),INDEX(Table1[Name],MATCH(INDEX(BinA,rown-1)&BinB,Table1[Pin],0)+2),\"\")","v":""},null,{"$f":"IF((E45<>\"\")*ISBLANK(INDEX(Table1[Pin],MATCH(INDEX(BinA,rown-1)&BinB,Table1[Pin],0)+2)),INDEX(Table1[Name],MATCH(INDEX(BinA,rown-1)&BinB,Table1[Pin],0)+2),\"\")","v":""},null,{"$f":"IF((G45<>\"\")*ISBLANK(INDEX(Table1[Pin],MATCH(INDEX(BinA,rown-1)&BinB,Table1[Pin],0)+2)),INDEX(Table1[Name],MATCH(INDEX(BinA,rown-1)&BinB,Table1[Pin],0)+2),\"\")","v":""},null,null,null,null,null,null,null,null,null,null,null,null,null,{"$f":"IF((U45<>\"\")*ISBLANK(INDEX(Table1[Pin],MATCH(INDEX(BinA,rown-1)&BinB,Table1[Pin],0)+2)),INDEX(Table1[Name],MATCH(INDEX(BinA,rown-1)&BinB,Table1[Pin],0)+2),\"\")","v":""},null,{"$f":"IF((W45<>\"\")*ISBLANK(INDEX(Table1[Pin],MATCH(INDEX(BinA,rown-1)&BinB,Table1[Pin],0)+2)),INDEX(Table1[Name],MATCH(INDEX(BinA,rown-1)&BinB,Table1[Pin],0)+2),\"\")","v":""},null,{"$f":"IF((Y45<>\"\")*ISBLANK(INDEX(Table1[Pin],MATCH(INDEX(BinA,rown-1)&BinB,Table1[Pin],0)+2)),INDEX(Table1[Name],MATCH(INDEX(BinA,rown-1)&BinB,Table1[Pin],0)+2),\"\")","v":""}]
[]
[]
[null,null,{"$f":"IF(ISBLANK(INDEX(Table1[Pin],MATCH(INDEX(BinA,rown+1)&BinB,Table1[Pin],0)+1)),INDEX(Table1[Name],MATCH(INDEX(BinA,rown+1)&BinB,Table1[Pin],0)+1),\"\")","v":"I2C1SCL"},null,{"$f":"IF(ISBLANK(INDEX(Table1[Pin],MATCH(INDEX(BinA,rown+1)&BinB,Table1[Pin],0)+1)),INDEX(Table1[Name],MATCH(INDEX(BinA,rown+1)&BinB,Table1[Pin],0)+1),\"\")","v":""},null,{"$f":"IF(ISBLANK(INDEX(Table1[Pin],MATCH(INDEX(BinA,rown+1)&BinB,Table1[Pin],0)+1)),INDEX(Table1[Name],MATCH(INDEX(BinA,rown+1)&BinB,Table1[Pin],0)+1),\"\")","v":""},null,{"$f":"IF(ISBLANK(INDEX(Table1[Pin],MATCH(INDEX(BinA,rown+1)&BinB,Table1[Pin],0)+1)),INDEX(Table1[Name],MATCH(INDEX(BinA,rown+1)&BinB,Table1[Pin],0)+1),\"\")","v":""},null,{"$f":"IF(ISBLANK(INDEX(Table1[Pin],MATCH(INDEX(BinA,rown+1)&BinB,Table1[Pin],0)+1)),INDEX(Table1[Name],MATCH(INDEX(BinA,rown+1)&BinB,Table1[Pin],0)+1),\"\")","v":""},null,{"$f":"IF(ISBLANK(INDEX(Table1[Pin],MATCH(INDEX(BinA,rown+1)&BinB,Table1[Pin],0)+1)),INDEX(Table1[Name],MATCH(INDEX(BinA,rown+1)&BinB,Table1[Pin],0)+1),\"\")","v":""},null,{"$f":"IF(ISBLANK(INDEX(Table1[Pin],MATCH(INDEX(BinA,rown+1)&BinB,Table1[Pin],0)+1)),INDEX(Table1[Name],MATCH(INDEX(BinA,rown+1)&BinB,Table1[Pin],0)+1),\"\")","v":""},null,{"$f":"IF(ISBLANK(INDEX(Table1[Pin],MATCH(INDEX(BinA,rown+1)&BinB,Table1[Pin],0)+1)),INDEX(Table1[Name],MATCH(INDEX(BinA,rown+1)&BinB,Table1[Pin],0)+1),\"\")","v":""},null,{"$f":"IF(ISBLANK(INDEX(Table1[Pin],MATCH(INDEX(BinA,rown+1)&BinB,Table1[Pin],0)+1)),INDEX(Table1[Name],MATCH(INDEX(BinA,rown+1)&BinB,Table1[Pin],0)+1),\"\")","v":""},null,{"$f":"IF(ISBLANK(INDEX(Table1[Pin],MATCH(INDEX(BinA,rown+1)&BinB,Table1[Pin],0)+1)),INDEX(Table1[Name],MATCH(INDEX(BinA,rown+1)&BinB,Table1[Pin],0)+1),\"\")","v":""},null,{"$f":"IF(ISBLANK(INDEX(Table1[Pin],MATCH(INDEX(BinA,rown+1)&BinB,Table1[Pin],0)+1)),INDEX(Table1[Name],MATCH(INDEX(BinA,rown+1)&BinB,Table1[Pin],0)+1),\"\")","v":""},null,{"$f":"IF(ISBLANK(INDEX(Table1[Pin],MATCH(INDEX(BinA,rown+1)&BinB,Table1[Pin],0)+1)),INDEX(Table1[Name],MATCH(INDEX(BinA,rown+1)&BinB,Table1[Pin],0)+1),\"\")","v":""}]
[null,"K","PD3",null,{"$f":"INDEX(Table1[Name],MATCH(BinA&BinB,Table1[Pin],0))","v":"PG1"},null,{"$f":"INDEX(Table1[Name],MATCH(BinA&BinB,Table1[Pin],0))","v":"ERBIAS"},null,{"$f":"INDEX(Table1[Name],MATCH(BinA&BinB,Table1[Pin],0))","v":"GNDPHY"},null,{"$f":"INDEX(Table1[Name],MATCH(BinA&BinB,Table1[Pin],0))","v":"GND"},null,{"$f":"INDEX(Table1[Name],MATCH(BinA&BinB,Table1[Pin],0))","v":"GND"},null,{"$f":"INDEX(Table1[Name],MATCH(BinA&BinB,Table1[Pin],0))","v":"VDD33"},null,{"$f":"INDEX(Table1[Name],MATCH(BinA&BinB,Table1[Pin],0))","v":"VDD33"},null,{"$f":"INDEX(Table1[Name],MATCH(BinA&BinB,Table1[Pin],0))","v":"VDD33"},null,{"$f":"INDEX(Table1[Name],MATCH(BinA&BinB,Table1[Pin],0))","v":"GND"},null,{"$f":"INDEX(Table1[Name],MATCH(BinA&BinB,Table1[Pin],0))","v":"XOSC0"},null,{"$f":"INDEX(Table1[Name],MATCH(BinA&BinB,Table1[Pin],0))","v":"XOSC1"},"K"]
[null,null,"",null,{"$f":"IF((E50<>\"\")*ISBLANK(INDEX(Table1[Pin],MATCH(INDEX(BinA,rown-1)&BinB,Table1[Pin],0)+2)),INDEX(Table1[Name],MATCH(INDEX(BinA,rown-1)&BinB,Table1[Pin],0)+2),\"\")","v":""},null,{"$f":"IF((G50<>\"\")*ISBLANK(INDEX(Table1[Pin],MATCH(INDEX(BinA,rown-1)&BinB,Table1[Pin],0)+2)),INDEX(Table1[Name],MATCH(INDEX(BinA,rown-1)&BinB,Table1[Pin],0)+2),\"\")","v":""},null,{"$f":"IF((I50<>\"\")*ISBLANK(INDEX(Table1[Pin],MATCH(INDEX(BinA,rown-1)&BinB,Table1[Pin],0)+2)),INDEX(Table1[Name],MATCH(INDEX(BinA,rown-1)&BinB,Table1[Pin],0)+2),\"\")","v":""},null,{"$f":"IF((K50<>\"\")*ISBLANK(INDEX(Table1[Pin],MATCH(INDEX(BinA,rown-1)&BinB,Table1[Pin],0)+2)),INDEX(Table1[Name],MATCH(INDEX(BinA,rown-1)&BinB,Table1[Pin],0)+2),\"\")","v":""},null,{"$f":"IF((M50<>\"\")*ISBLANK(INDEX(Table1[Pin],MATCH(INDEX(BinA,rown-1)&BinB,Table1[Pin],0)+2)),INDEX(Table1[Name],MATCH(INDEX(BinA,rown-1)&BinB,Table1[Pin],0)+2),\"\")","v":""},null,{"$f":"IF((O50<>\"\")*ISBLANK(INDEX(Table1[Pin],MATCH(INDEX(BinA,rown-1)&BinB,Table1[Pin],0)+2)),INDEX(Table1[Name],MATCH(INDEX(BinA,rown-1)&BinB,Table1[Pin],0)+2),\"\")","v":""},null,{"$f":"IF((Q50<>\"\")*ISBLANK(INDEX(Table1[Pin],MATCH(INDEX(BinA,rown-1)&BinB,Table1[Pin],0)+2)),INDEX(Table1[Name],MATCH(INDEX(BinA,rown-1)&BinB,Table1[Pin],0)+2),\"\")","v":""},null,{"$f":"IF((S50<>\"\")*ISBLANK(INDEX(Table1[Pin],MATCH(INDEX(BinA,rown-1)&BinB,Table1[Pin],0)+2)),INDEX(Table1[Name],MATCH(INDEX(BinA,rown-1)&BinB,Table1[Pin],0)+2),\"\")","v":""},null,{"$f":"IF((U50<>\"\")*ISBLANK(INDEX(Table1[Pin],MATCH(INDEX(BinA,rown-1)&BinB,Table1[Pin],0)+2)),INDEX(Table1[Name],MATCH(INDEX(BinA,rown-1)&BinB,Table1[Pin],0)+2),\"\")","v":""},null,{"$f":"IF((W50<>\"\")*ISBLANK(INDEX(Table1[Pin],MATCH(INDEX(BinA,rown-1)&BinB,Table1[Pin],0)+2)),INDEX(Table1[Name],MATCH(INDEX(BinA,rown-1)&BinB,Table1[Pin],0)+2),\"\")","v":""},null,{"$f":"IF((Y50<>\"\")*ISBLANK(INDEX(Table1[Pin],MATCH(INDEX(BinA,rown-1)&BinB,Table1[Pin],0)+2)),INDEX(Table1[Name],MATCH(INDEX(BinA,rown-1)&BinB,Table1[Pin],0)+2),\"\")","v":""}]
[]
[]
[null,null,{"$f":"IF(ISBLANK(INDEX(Table1[Pin],MATCH(INDEX(BinA,rown+1)&BinB,Table1[Pin],0)+1)),INDEX(Table1[Name],MATCH(INDEX(BinA,rown+1)&BinB,Table1[Pin],0)+1),\"\")","v":"CCP5"},null,{"$f":"IF(ISBLANK(INDEX(Table1[Pin],MATCH(INDEX(BinA,rown+1)&BinB,Table1[Pin],0)+1)),INDEX(Table1[Name],MATCH(INDEX(BinA,rown+1)&BinB,Table1[Pin],0)+1),\"\")","v":"CCP4"},null,{"$f":"IF(ISBLANK(INDEX(Table1[Pin],MATCH(INDEX(BinA,rown+1)&BinB,Table1[Pin],0)+1)),INDEX(Table1[Name],MATCH(INDEX(BinA,rown+1)&BinB,Table1[Pin],0)+1),\"\")","v":"U0Rx"},null,{"$f":"IF(ISBLANK(INDEX(Table1[Pin],MATCH(INDEX(BinA,rown+1)&BinB,Table1[Pin],0)+1)),INDEX(Table1[Name],MATCH(INDEX(BinA,rown+1)&BinB,Table1[Pin],0)+1),\"\")","v":"SSI0Fss"},null,{"$f":"IF(ISBLANK(INDEX(Table1[Pin],MATCH(INDEX(BinA,rown+1)&BinB,Table1[Pin],0)+1)),INDEX(Table1[Name],MATCH(INDEX(BinA,rown+1)&BinB,Table1[Pin],0)+1),\"\")","v":"SSI0Rx"},null,{"$f":"IF(ISBLANK(INDEX(Table1[Pin],MATCH(INDEX(BinA,rown+1)&BinB,Table1[Pin],0)+1)),INDEX(Table1[Name],MATCH(INDEX(BinA,rown+1)&BinB,Table1[Pin],0)+1),\"\")","v":"CCP1"},null,{"$f":"IF(ISBLANK(INDEX(Table1[Pin],MATCH(INDEX(BinA,rown+1)&BinB,Table1[Pin],0)+1)),INDEX(Table1[Name],MATCH(INDEX(BinA,rown+1)&BinB,Table1[Pin],0)+1),\"\")","v":""},null,{"$f":"IF(ISBLANK(INDEX(Table1[Pin],MATCH(INDEX(BinA,rown+1)&BinB,Table1[Pin],0)+1)),INDEX(Table1[Name],MATCH(INDEX(BinA,rown+1)&BinB,Table1[Pin],0)+1),\"\")","v":""},null,{"$f":"IF(ISBLANK(INDEX(Table1[Pin],MATCH(INDEX(BinA,rown+1)&BinB,Table1[Pin],0)+1)),INDEX(Table1[Name],MATCH(INDEX(BinA,rown+1)&BinB,Table1[Pin],0)+1),\"\")","v":""},null,{"$f":"IF(ISBLANK(INDEX(Table1[Pin],MATCH(INDEX(BinA,rown+1)&BinB,Table1[Pin],0)+1)),INDEX(Table1[Name],MATCH(INDEX(BinA,rown+1)&BinB,Table1[Pin],0)+1),\"\")","v":""},null,{"$f":"IF(ISBLANK(INDEX(Table1[Pin],MATCH(INDEX(BinA,rown+1)&BinB,Table1[Pin],0)+1)),INDEX(Table1[Name],MATCH(INDEX(BinA,rown+1)&BinB,Table1[Pin],0)+1),\"\")","v":""},null,{"$f":"IF(ISBLANK(INDEX(Table1[Pin],MATCH(INDEX(BinA,rown+1)&BinB,Table1[Pin],0)+1)),INDEX(Table1[Name],MATCH(INDEX(BinA,rown+1)&BinB,Table1[Pin],0)+1),\"\")","v":""}]
[null,"L",{"$f":"INDEX(Table1[Name],MATCH(BinA&BinB,Table1[Pin],0))","v":"PC4"},null,{"$f":"INDEX(Table1[Name],MATCH(BinA&BinB,Table1[Pin],0))","v":"PC7"},null,{"$f":"INDEX(Table1[Name],MATCH(BinA&BinB,Table1[Pin],0))","v":"PA0"},null,{"$f":"INDEX(Table1[Name],MATCH(BinA&BinB,Table1[Pin],0))","v":"PA3"},null,{"$f":"INDEX(Table1[Name],MATCH(BinA&BinB,Table1[Pin],0))","v":"PA4"},null,{"$f":"INDEX(Table1[Name],MATCH(BinA&BinB,Table1[Pin],0))","v":"PA6"},null,{"$f":"INDEX(Table1[Name],MATCH(BinA&BinB,Table1[Pin],0))","v":"RXIN"},null,{"$f":"INDEX(Table1[Name],MATCH(BinA&BinB,Table1[Pin],0))","v":"TXON"},null,{"$f":"INDEX(Table1[Name],MATCH(BinA&BinB,Table1[Pin],0))","v":"MDIO"},null,{"$f":"INDEX(Table1[Name],MATCH(BinA&BinB,Table1[Pin],0))","v":"GND"},null,{"$f":"INDEX(Table1[Name],MATCH(BinA&BinB,Table1[Pin],0))","v":"OSC0"},null,{"$f":"INDEX(Table1[Name],MATCH(BinA&BinB,Table1[Pin],0))","v":"VBAT"},"L"]
[null,null,{"$f":"IF((C55<>\"\")*ISBLANK(INDEX(Table1[Pin],MATCH(INDEX(BinA,rown-1)&BinB,Table1[Pin],0)+2)),INDEX(Table1[Name],MATCH(INDEX(BinA,rown-1)&BinB,Table1[Pin],0)+2),\"\")","v":""},null,{"$f":"IF((E55<>\"\")*ISBLANK(INDEX(Table1[Pin],MATCH(INDEX(BinA,rown-1)&BinB,Table1[Pin],0)+2)),INDEX(Table1[Name],MATCH(INDEX(BinA,rown-1)&BinB,Table1[Pin],0)+2),\"\")","v":""},null,{"$f":"IF((G55<>\"\")*ISBLANK(INDEX(Table1[Pin],MATCH(INDEX(BinA,rown-1)&BinB,Table1[Pin],0)+2)),INDEX(Table1[Name],MATCH(INDEX(BinA,rown-1)&BinB,Table1[Pin],0)+2),\"\")","v":""},null,{"$f":"IF((I55<>\"\")*ISBLANK(INDEX(Table1[Pin],MATCH(INDEX(BinA,rown-1)&BinB,Table1[Pin],0)+2)),INDEX(Table1[Name],MATCH(INDEX(BinA,rown-1)&BinB,Table1[Pin],0)+2),\"\")","v":""},null,{"$f":"IF((K55<>\"\")*ISBLANK(INDEX(Table1[Pin],MATCH(INDEX(BinA,rown-1)&BinB,Table1[Pin],0)+2)),INDEX(Table1[Name],MATCH(INDEX(BinA,rown-1)&BinB,Table1[Pin],0)+2),\"\")","v":""},null,{"$f":"IF((M55<>\"\")*ISBLANK(INDEX(Table1[Pin],MATCH(INDEX(BinA,rown-1)&BinB,Table1[Pin],0)+2)),INDEX(Table1[Name],MATCH(INDEX(BinA,rown-1)&BinB,Table1[Pin],0)+2),\"\")","v":""},null,{"$f":"IF((O55<>\"\")*ISBLANK(INDEX(Table1[Pin],MATCH(INDEX(BinA,rown-1)&BinB,Table1[Pin],0)+2)),INDEX(Table1[Name],MATCH(INDEX(BinA,rown-1)&BinB,Table1[Pin],0)+2),\"\")","v":""},null,{"$f":"IF((Q55<>\"\")*ISBLANK(INDEX(Table1[Pin],MATCH(INDEX(BinA,rown-1)&BinB,Table1[Pin],0)+2)),INDEX(Table1[Name],MATCH(INDEX(BinA,rown-1)&BinB,Table1[Pin],0)+2),\"\")","v":""},null,{"$f":"IF((S55<>\"\")*ISBLANK(INDEX(Table1[Pin],MATCH(INDEX(BinA,rown-1)&BinB,Table1[Pin],0)+2)),INDEX(Table1[Name],MATCH(INDEX(BinA,rown-1)&BinB,Table1[Pin],0)+2),\"\")","v":""},null,{"$f":"IF((U55<>\"\")*ISBLANK(INDEX(Table1[Pin],MATCH(INDEX(BinA,rown-1)&BinB,Table1[Pin],0)+2)),INDEX(Table1[Name],MATCH(INDEX(BinA,rown-1)&BinB,Table1[Pin],0)+2),\"\")","v":""},null,{"$f":"IF((W55<>\"\")*ISBLANK(INDEX(Table1[Pin],MATCH(INDEX(BinA,rown-1)&BinB,Table1[Pin],0)+2)),INDEX(Table1[Name],MATCH(INDEX(BinA,rown-1)&BinB,Table1[Pin],0)+2),\"\")","v":""},null,{"$f":"IF((Y55<>\"\")*ISBLANK(INDEX(Table1[Pin],MATCH(INDEX(BinA,rown-1)&BinB,Table1[Pin],0)+2)),INDEX(Table1[Name],MATCH(INDEX(BinA,rown-1)&BinB,Table1[Pin],0)+2),\"\")","v":""}]
[]
[]
[null,null,{"$f":"IF(ISBLANK(INDEX(Table1[Pin],MATCH(INDEX(BinA,rown+1)&BinB,Table1[Pin],0)+1)),INDEX(Table1[Name],MATCH(INDEX(BinA,rown+1)&BinB,Table1[Pin],0)+1),\"\")","v":"C1+"},null,{"$f":"IF(ISBLANK(INDEX(Table1[Pin],MATCH(INDEX(BinA,rown+1)&BinB,Table1[Pin],0)+1)),INDEX(Table1[Name],MATCH(INDEX(BinA,rown+1)&BinB,Table1[Pin],0)+1),\"\")","v":"CCP3"},null,{"$f":"IF(ISBLANK(INDEX(Table1[Pin],MATCH(INDEX(BinA,rown+1)&BinB,Table1[Pin],0)+1)),INDEX(Table1[Name],MATCH(INDEX(BinA,rown+1)&BinB,Table1[Pin],0)+1),\"\")","v":"U0Tx"},null,{"$f":"IF(ISBLANK(INDEX(Table1[Pin],MATCH(INDEX(BinA,rown+1)&BinB,Table1[Pin],0)+1)),INDEX(Table1[Name],MATCH(INDEX(BinA,rown+1)&BinB,Table1[Pin],0)+1),\"\")","v":"SSI0Clk"},null,{"$f":"IF(ISBLANK(INDEX(Table1[Pin],MATCH(INDEX(BinA,rown+1)&BinB,Table1[Pin],0)+1)),INDEX(Table1[Name],MATCH(INDEX(BinA,rown+1)&BinB,Table1[Pin],0)+1),\"\")","v":"SSI0Tx"},null,{"$f":"IF(ISBLANK(INDEX(Table1[Pin],MATCH(INDEX(BinA,rown+1)&BinB,Table1[Pin],0)+1)),INDEX(Table1[Name],MATCH(INDEX(BinA,rown+1)&BinB,Table1[Pin],0)+1),\"\")","v":"I2C1SDA"},null,{"$f":"IF(ISBLANK(INDEX(Table1[Pin],MATCH(INDEX(BinA,rown+1)&BinB,Table1[Pin],0)+1)),INDEX(Table1[Name],MATCH(INDEX(BinA,rown+1)&BinB,Table1[Pin],0)+1),\"\")","v":""},null,{"$f":"IF(ISBLANK(INDEX(Table1[Pin],MATCH(INDEX(BinA,rown+1)&BinB,Table1[Pin],0)+1)),INDEX(Table1[Name],MATCH(INDEX(BinA,rown+1)&BinB,Table1[Pin],0)+1),\"\")","v":""},null,{"$f":"IF(ISBLANK(INDEX(Table1[Pin],MATCH(INDEX(BinA,rown+1)&BinB,Table1[Pin],0)+1)),INDEX(Table1[Name],MATCH(INDEX(BinA,rown+1)&BinB,Table1[Pin],0)+1),\"\")","v":""},null,{"$f":"IF(ISBLANK(INDEX(Table1[Pin],MATCH(INDEX(BinA,rown+1)&BinB,Table1[Pin],0)+1)),INDEX(Table1[Name],MATCH(INDEX(BinA,rown+1)&BinB,Table1[Pin],0)+1),\"\")","v":""},null,{"$f":"IF(ISBLANK(INDEX(Table1[Pin],MATCH(INDEX(BinA,rown+1)&BinB,Table1[Pin],0)+1)),INDEX(Table1[Name],MATCH(INDEX(BinA,rown+1)&BinB,Table1[Pin],0)+1),\"\")","v":""},null,{"$f":"IF(ISBLANK(INDEX(Table1[Pin],MATCH(INDEX(BinA,rown+1)&BinB,Table1[Pin],0)+1)),INDEX(Table1[Name],MATCH(INDEX(BinA,rown+1)&BinB,Table1[Pin],0)+1),\"\")","v":""}]
[null,"M",{"$f":"INDEX(Table1[Name],MATCH(BinA&BinB,Table1[Pin],0))","v":"PC5"},null,{"$f":"INDEX(Table1[Name],MATCH(BinA&BinB,Table1[Pin],0))","v":"PC6"},null,{"$f":"INDEX(Table1[Name],MATCH(BinA&BinB,Table1[Pin],0))","v":"PA1"},null,{"$f":"INDEX(Table1[Name],MATCH(BinA&BinB,Table1[Pin],0))","v":"PA2"},null,{"$f":"INDEX(Table1[Name],MATCH(BinA&BinB,Table1[Pin],0))","v":"PA5"},null,{"$f":"INDEX(Table1[Name],MATCH(BinA&BinB,Table1[Pin],0))","v":"PA7"},null,{"$f":"INDEX(Table1[Name],MATCH(BinA&BinB,Table1[Pin],0))","v":"RXIP"},null,{"$f":"INDEX(Table1[Name],MATCH(BinA&BinB,Table1[Pin],0))","v":"TXOP"},null,{"$f":"INDEX(Table1[Name],MATCH(BinA&BinB,Table1[Pin],0))","v":"PF0"},null,{"$f":"INDEX(Table1[Name],MATCH(BinA&BinB,Table1[Pin],0))","v":"WAKE"},null,{"$f":"INDEX(Table1[Name],MATCH(BinA&BinB,Table1[Pin],0))","v":"OSC1"},null,{"$f":"INDEX(Table1[Name],MATCH(BinA&BinB,Table1[Pin],0))","v":"HIB"},"M"]
[null,null,{"$f":"IF((C60<>\"\")*ISBLANK(INDEX(Table1[Pin],MATCH(INDEX(BinA,rown-1)&BinB,Table1[Pin],0)+2)),INDEX(Table1[Name],MATCH(INDEX(BinA,rown-1)&BinB,Table1[Pin],0)+2),\"\")","v":"C0o"},null,{"$f":"IF((E60<>\"\")*ISBLANK(INDEX(Table1[Pin],MATCH(INDEX(BinA,rown-1)&BinB,Table1[Pin],0)+2)),INDEX(Table1[Name],MATCH(INDEX(BinA,rown-1)&BinB,Table1[Pin],0)+2),\"\")","v":""},null,{"$f":"IF((G60<>\"\")*ISBLANK(INDEX(Table1[Pin],MATCH(INDEX(BinA,rown-1)&BinB,Table1[Pin],0)+2)),INDEX(Table1[Name],MATCH(INDEX(BinA,rown-1)&BinB,Table1[Pin],0)+2),\"\")","v":""},null,{"$f":"IF((I60<>\"\")*ISBLANK(INDEX(Table1[Pin],MATCH(INDEX(BinA,rown-1)&BinB,Table1[Pin],0)+2)),INDEX(Table1[Name],MATCH(INDEX(BinA,rown-1)&BinB,Table1[Pin],0)+2),\"\")","v":""},null,{"$f":"IF((K60<>\"\")*ISBLANK(INDEX(Table1[Pin],MATCH(INDEX(BinA,rown-1)&BinB,Table1[Pin],0)+2)),INDEX(Table1[Name],MATCH(INDEX(BinA,rown-1)&BinB,Table1[Pin],0)+2),\"\")","v":""},null,{"$f":"IF((M60<>\"\")*ISBLANK(INDEX(Table1[Pin],MATCH(INDEX(BinA,rown-1)&BinB,Table1[Pin],0)+2)),INDEX(Table1[Name],MATCH(INDEX(BinA,rown-1)&BinB,Table1[Pin],0)+2),\"\")","v":""},null,{"$f":"IF((O60<>\"\")*ISBLANK(INDEX(Table1[Pin],MATCH(INDEX(BinA,rown-1)&BinB,Table1[Pin],0)+2)),INDEX(Table1[Name],MATCH(INDEX(BinA,rown-1)&BinB,Table1[Pin],0)+2),\"\")","v":""},null,{"$f":"IF((Q60<>\"\")*ISBLANK(INDEX(Table1[Pin],MATCH(INDEX(BinA,rown-1)&BinB,Table1[Pin],0)+2)),INDEX(Table1[Name],MATCH(INDEX(BinA,rown-1)&BinB,Table1[Pin],0)+2),\"\")","v":""},null,{"$f":"IF((S60<>\"\")*ISBLANK(INDEX(Table1[Pin],MATCH(INDEX(BinA,rown-1)&BinB,Table1[Pin],0)+2)),INDEX(Table1[Name],MATCH(INDEX(BinA,rown-1)&BinB,Table1[Pin],0)+2),\"\")","v":""},null,{"$f":"IF((U60<>\"\")*ISBLANK(INDEX(Table1[Pin],MATCH(INDEX(BinA,rown-1)&BinB,Table1[Pin],0)+2)),INDEX(Table1[Name],MATCH(INDEX(BinA,rown-1)&BinB,Table1[Pin],0)+2),\"\")","v":""},null,{"$f":"IF((W60<>\"\")*ISBLANK(INDEX(Table1[Pin],MATCH(INDEX(BinA,rown-1)&BinB,Table1[Pin],0)+2)),INDEX(Table1[Name],MATCH(INDEX(BinA,rown-1)&BinB,Table1[Pin],0)+2),\"\")","v":""},null,{"$f":"IF((Y60<>\"\")*ISBLANK(INDEX(Table1[Pin],MATCH(INDEX(BinA,rown-1)&BinB,Table1[Pin],0)+2)),INDEX(Table1[Name],MATCH(INDEX(BinA,rown-1)&BinB,Table1[Pin],0)+2),\"\")","v":""}]
[]
[null,null,1,null,2,null,3,null,4,null,5,null,6,null,7,null,8,null,9,null,10,null,11,null,12]

{"sheet":"Original","index":2,"n_rows":0,"n_cols":0,"rows_kept":0,"cut":false,"hidden":false,"merged":[]}

{"sheet":"Help","index":3,"n_rows":36,"n_cols":2,"rows_kept":36,"cut":false,"hidden":false,"merged":[]}
[]
[]
[]
[]
[]
[]
[]
[]
[]
[]
[]
[]
[]
[]
[]
[]
[]
[]
[]
[]
[]
[]
[]
[]
[]
[]
[]
[]
[]
[null,"Shapes > Format > Arrange > Align > Snap to Grid"]
[]
[null,"Do not group shapes"]
[]
[null,"Observe row/column width"]
[]
[null,"Do Align, then Sort&LabelA, the Sort&LabelB"]