{"text_format":"1","workbook":"xlsx","n_sheets":3,"sheets":["Data","Colors","Test"],"not_rendered":{"charts":1,"images":0,"macros":1,"external_links":0,"defined_names":4,"comments":0,"pivot_tables":1},"unopened":[],"bounds":{"document_bytes":16777216,"sheet_cells":100000,"rows_first":2000,"rows_last":500,"rows_between":2000,"halvings":0,"cell_chars":16384,"cell_head_chars":4096},"cells_cut":0,"cells_raw":0,"read":"whole","date_system":"1900"}

{"sheet":"Data","index":0,"n_rows":99,"n_cols":12,"rows_kept":99,"cut":false,"hidden":false,"merged":[]}
[]
[]
[]
[null,null,"DDate","Player","Team","N","Value",null,null,"DDate","Team","Sum of Value"]
[null,null,{"$f":"TODAY()-RANDBETWEEN(1,7)","v":"2010-03-04"},{"$f":"INDEX(INDIRECT(\"Table1[Team\"&[N]&\"]\"),RANDBETWEEN(1,9))","v":"Thompson"},{"$f":"\"Team\"&[N]","v":"Team2"},{"$f":"MOD(RANDBETWEEN(0,1)+Table2[[#This Row],[DDate]],4)+1","v":2},{"$f":"RANDBETWEEN(1000,9999)/100*[N]","v":192.78},null,null,"2010-02-28",null,1804.3]
[null,null,{"$f":"TODAY()-RANDBETWEEN(1,7)","v":"2010-03-03"},{"$f":"INDEX(INDIRECT(\"Table1[Team\"&[N]&\"]\"),RANDBETWEEN(1,9))","v":"White"},{"$f":"\"Team\"&[N]","v":"Team2"},{"$f":"MOD(RANDBETWEEN(0,1)+Table2[[#This Row],[DDate]],4)+1","v":2},{"$f":"RANDBETWEEN(1000,9999)/100*[N]","v":79.3},null,null,null,"Team3",1391.22]
[null,null,{"$f":"TODAY()-RANDBETWEEN(1,7)","v":"2010-03-04"},{"$f":"INDEX(INDIRECT(\"Table1[Team\"&[N]&\"]\"),RANDBETWEEN(1,9))","v":"Rodriguez"},{"$f":"\"Team\"&[N]","v":"Team3"},{"$f":"MOD(RANDBETWEEN(0,1)+Table2[[#This Row],[DDate]],4)+1","v":3},{"$f":"RANDBETWEEN(1000,9999)/100*[N]","v":252.66},null,null,null,"Team2",413.08]
[null,null,{"$f":"TODAY()-RANDBETWEEN(1,7)","v":"2010-03-03"},{"$f":"INDEX(INDIRECT(\"Table1[Team\"&[N]&\"]\"),RANDBETWEEN(1,9))","v":"Davis"},{"$f":"\"Team\"&[N]","v":"Team1"},{"$f":"MOD(RANDBETWEEN(0,1)+Table2[[#This Row],[DDate]],4)+1","v":1},{"$f":"RANDBETWEEN(1000,9999)/100*[N]","v":98.8},null,null,"2010-03-01",null,2360.5]
[null,null,{"$f":"TODAY()-RANDBETWEEN(1,7)","v":"2010-03-04"},{"$f":"INDEX(INDIRECT(\"Table1[Team\"&[N]&\"]\"),RANDBETWEEN(1,9))","v":"Taylor"},{"$f":"\"Team\"&[N]","v":"Team2"},{"$f":"MOD(RANDBETWEEN(0,1)+Table2[[#This Row],[DDate]],4)+1","v":2},{"$f":"RANDBETWEEN(1000,9999)/100*[N]","v":145.47999999999999},null,null,null,"Team4",1247.08]
[null,null,{"$f":"TODAY()-RANDBETWEEN(1,7)","v":"2010-03-01"},{"$f":"INDEX(INDIRECT(\"Table1[Team\"&[N]&\"]\"),RANDBETWEEN(1,9))","v":"Lewis"},{"$f":"\"Team\"&[N]","v":"Team3"},{"$f":"MOD(RANDBETWEEN(0,1)+Table2[[#This Row],[DDate]],4)+1","v":3},{"$f":"RANDBETWEEN(1000,9999)/100*[N]","v":94.11},null,null,null,"Team3",1113.4199999999998]
[null,null,{"$f":"TODAY()-RANDBETWEEN(1,7)","v":"2010-03-04"},{"$f":"INDEX(INDIRECT(\"Table1[Team\"&[N]&\"]\"),RANDBETWEEN(1,9))","v":"Clark"},{"$f":"\"Team\"&[N]","v":"Team3"},{"$f":"MOD(RANDBETWEEN(0,1)+Table2[[#This Row],[DDate]],4)+1","v":3},{"$f":"RANDBETWEEN(1000,9999)/100*[N]","v":199.35000000000002},null,null,"2010-03-02",null,1511.53]
[null,null,{"$f":"TODAY()-RANDBETWEEN(1,7)","v":"2010-03-01"},{"$f":"INDEX(INDIRECT(\"Table1[Team\"&[N]&\"]\"),RANDBETWEEN(1,9))","v":"Hall"},{"$f":"\"Team\"&[N]","v":"Team3"},{"$f":"MOD(RANDBETWEEN(0,1)+Table2[[#This Row],[DDate]],4)+1","v":3},{"$f":"RANDBETWEEN(1000,9999)/100*[N]","v":266.15999999999997},null,null,null,"Team4",1138.08]
[null,null,{"$f":"TODAY()-RANDBETWEEN(1,7)","v":"2010-03-04"},{"$f":"INDEX(INDIRECT(\"Table1[Team\"&[N]&\"]\"),RANDBETWEEN(1,9))","v":"Lewis"},{"$f":"\"Team\"&[N]","v":"Team3"},{"$f":"MOD(RANDBETWEEN(0,1)+Table2[[#This Row],[DDate]],4)+1","v":3},{"$f":"RANDBETWEEN(1000,9999)/100*[N]","v":268.35000000000002},null,null,null,"Team1",373.45000000000005]
[null,null,{"$f":"TODAY()-RANDBETWEEN(1,7)","v":"2010-03-03"},{"$f":"INDEX(INDIRECT(\"Table1[Team\"&[N]&\"]\"),RANDBETWEEN(1,9))","v":"Moore"},{"$f":"\"Team\"&[N]","v":"Team1"},{"$f":"MOD(RANDBETWEEN(0,1)+Table2[[#This Row],[DDate]],4)+1","v":1},{"$f":"RANDBETWEEN(1000,9999)/100*[N]","v":41.46},null,null,"2010-03-03",null,1059.7999999999997]
[null,null,{"$f":"TODAY()-RANDBETWEEN(1,7)","v":"2010-02-28"},{"$f":"INDEX(INDIRECT(\"Table1[Team\"&[N]&\"]\"),RANDBETWEEN(1,9))","v":"Thomas"},{"$f":"\"Team\"&[N]","v":"Team2"},{"$f":"MOD(RANDBETWEEN(0,1)+Table2[[#This Row],[DDate]],4)+1","v":2},{"$f":"RANDBETWEEN(1000,9999)/100*[N]","v":57.66},null,null,null,"Team2",662.61999999999989]
[null,null,{"$f":"TODAY()-RANDBETWEEN(1,7)","v":"2010-03-05"},{"$f":"INDEX(INDIRECT(\"Table1[Team\"&[N]&\"]\"),RANDBETWEEN(1,9))","v":"Adams"},{"$f":"\"Team\"&[N]","v":"Team4"},{"$f":"MOD(RANDBETWEEN(0,1)+Table2[[#This Row],[DDate]],4)+1","v":4},{"$f":"RANDBETWEEN(1000,9999)/100*[N]","v":235.88},null,null,null,"Team1",397.17999999999995]
[null,null,{"$f":"TODAY()-RANDBETWEEN(1,7)","v":"2010-03-04"},{"$f":"INDEX(INDIRECT(\"Table1[Team\"&[N]&\"]\"),RANDBETWEEN(1,9))","v":"Lewis"},{"$f":"\"Team\"&[N]","v":"Team3"},{"$f":"MOD(RANDBETWEEN(0,1)+Table2[[#This Row],[DDate]],4)+1","v":3},{"$f":"RANDBETWEEN(1000,9999)/100*[N]","v":249.24},null,null,"2010-03-04",null,2690.25]
[null,null,{"$f":"TODAY()-RANDBETWEEN(1,7)","v":"2010-03-04"},{"$f":"INDEX(INDIRECT(\"Table1[Team\"&[N]&\"]\"),RANDBETWEEN(1,9))","v":"Harris"},{"$f":"\"Team\"&[N]","v":"Team2"},{"$f":"MOD(RANDBETWEEN(0,1)+Table2[[#This Row],[DDate]],4)+1","v":2},{"$f":"RANDBETWEEN(1000,9999)/100*[N]","v":177.48},null,null,null,"Team3",1938.63]
[null,null,{"$f":"TODAY()-RANDBETWEEN(1,7)","v":"2010-03-05"},{"$f":"INDEX(INDIRECT(\"Table1[Team\"&[N]&\"]\"),RANDBETWEEN(1,9))","v":"Rodriguez"},{"$f":"\"Team\"&[N]","v":"Team3"},{"$f":"MOD(RANDBETWEEN(0,1)+Table2[[#This Row],[DDate]],4)+1","v":3},{"$f":"RANDBETWEEN(1000,9999)/100*[N]","v":178.92000000000002},null,null,null,"Team2",751.62]
[null,null,{"$f":"TODAY()-RANDBETWEEN(1,7)","v":"2010-03-01"},{"$f":"INDEX(INDIRECT(\"Table1[Team\"&[N]&\"]\"),RANDBETWEEN(1,9))","v":"Rodriguez"},{"$f":"\"Team\"&[N]","v":"Team3"},{"$f":"MOD(RANDBETWEEN(0,1)+Table2[[#This Row],[DDate]],4)+1","v":3},{"$f":"RANDBETWEEN(1000,9999)/100*[N]","v":117.69},null,null,"2010-03-05",null,2012.7199999999998]
[null,null,{"$f":"TODAY()-RANDBETWEEN(1,7)","v":"2010-03-04"},{"$f":"INDEX(INDIRECT(\"Table1[Team\"&[N]&\"]\"),RANDBETWEEN(1,9))","v":"Young"},{"$f":"\"Team\"&[N]","v":"Team3"},{"$f":"MOD(RANDBETWEEN(0,1)+Table2[[#This Row],[DDate]],4)+1","v":3},{"$f":"RANDBETWEEN(1000,9999)/100*[N]","v":158.49},null,null,null,"Team4",1223.5999999999999]
[null,null,{"$f":"TODAY()-RANDBETWEEN(1,7)","v":"2010-03-05"},{"$f":"INDEX(INDIRECT(\"Table1[Team\"&[N]&\"]\"),RANDBETWEEN(1,9))","v":"Lewis"},{"$f":"\"Team\"&[N]","v":"Team3"},{"$f":"MOD(RANDBETWEEN(0,1)+Table2[[#This Row],[DDate]],4)+1","v":3},{"$f":"RANDBETWEEN(1000,9999)/100*[N]","v":179.97},null,null,null,"Team3",789.12]
[null,null,{"$f":"TODAY()-RANDBETWEEN(1,7)","v":"2010-03-05"},{"$f":"INDEX(INDIRECT(\"Table1[Team\"&[N]&\"]\"),RANDBETWEEN(1,9))","v":"Lewis"},{"$f":"\"Team\"&[N]","v":"Team3"},{"$f":"MOD(RANDBETWEEN(0,1)+Table2[[#This Row],[DDate]],4)+1","v":3},{"$f":"RANDBETWEEN(1000,9999)/100*[N]","v":253.14},null,null,"2010-03-06",null,1784.6200000000001]
[null,null,{"$f":"TODAY()-RANDBETWEEN(1,7)","v":"2010-03-06"},{"$f":"INDEX(INDIRECT(\"Table1[Team\"&[N]&\"]\"),RANDBETWEEN(1,9))","v":"Baker"},{"$f":"\"Team\"&[N]","v":"Team4"},{"$f":"MOD(RANDBETWEEN(0,1)+Table2[[#This Row],[DDate]],4)+1","v":4},{"$f":"RANDBETWEEN(1000,9999)/100*[N]","v":316.16000000000003},null,null,null,"Team4",1058.8000000000002]
[null,null,{"$f":"TODAY()-RANDBETWEEN(1,7)","v":"2010-03-04"},{"$f":"INDEX(INDIRECT(\"Table1[Team\"&[N]&\"]\"),RANDBETWEEN(1,9))","v":"White"},{"$f":"\"Team\"&[N]","v":"Team2"},{"$f":"MOD(RANDBETWEEN(0,1)+Table2[[#This Row],[DDate]],4)+1","v":2},{"$f":"RANDBETWEEN(1000,9999)/100*[N]","v":109.18},null,null,null,"Team1",725.81999999999994]
[null,null,{"$f":"TODAY()-RANDBETWEEN(1,7)","v":"2010-03-06"},{"$f":"INDEX(INDIRECT(\"Table1[Team\"&[N]&\"]\"),RANDBETWEEN(1,9))","v":"Wright"},{"$f":"\"Team\"&[N]","v":"Team4"},{"$f":"MOD(RANDBETWEEN(0,1)+Table2[[#This Row],[DDate]],4)+1","v":4},{"$f":"RANDBETWEEN(1000,9999)/100*[N]","v":210.88},null,null,"Grand Total",null,13223.720000000001]
[null,null,{"$f":"TODAY()-RANDBETWEEN(1,7)","v":"2010-03-04"},{"$f":"INDEX(INDIRECT(\"Table1[Team\"&[N]&\"]\"),RANDBETWEEN(1,9))","v":"Harris"},{"$f":"\"Team\"&[N]","v":"Team2"},{"$f":"MOD(RANDBETWEEN(0,1)+Table2[[#This Row],[DDate]],4)+1","v":2},{"$f":"RANDBETWEEN(1000,9999)/100*[N]","v":151.80000000000001}]
[null,null,{"$f":"TODAY()-RANDBETWEEN(1,7)","v":"2010-03-01"},{"$f":"INDEX(INDIRECT(\"Table1[Team\"&[N]&\"]\"),RANDBETWEEN(1,9))","v":"Lopez"},{"$f":"\"Team\"&[N]","v":"Team4"},{"$f":"MOD(RANDBETWEEN(0,1)+Table2[[#This Row],[DDate]],4)+1","v":4},{"$f":"RANDBETWEEN(1000,9999)/100*[N]","v":273.32}]
[null,null,{"$f":"TODAY()-RANDBETWEEN(1,7)","v":"2010-03-04"},{"$f":"INDEX(INDIRECT(\"Table1[Team\"&[N]&\"]\"),RANDBETWEEN(1,9))","v":"Hall"},{"$f":"\"Team\"&[N]","v":"Team3"},{"$f":"MOD(RANDBETWEEN(0,1)+Table2[[#This Row],[DDate]],4)+1","v":3},{"$f":"RANDBETWEEN(1000,9999)/100*[N]","v":85.41}]
[null,null,{"$f":"TODAY()-RANDBETWEEN(1,7)","v":"2010-03-05"},{"$f":"INDEX(INDIRECT(\"Table1[Team\"&[N]&\"]\"),RANDBETWEEN(1,9))","v":"Allen"},{"$f":"\"Team\"&[N]","v":"Team3"},{"$f":"MOD(RANDBETWEEN(0,1)+Table2[[#This Row],[DDate]],4)+1","v":3},{"$f":"RANDBETWEEN(1000,9999)/100*[N]","v":186.81}]
[null,null,{"$f":"TODAY()-RANDBETWEEN(1,7)","v":"2010-02-28"},{"$f":"INDEX(INDIRECT(\"Table1[Team\"&[N]&\"]\"),RANDBETWEEN(1,9))","v":"Rodriguez"},{"$f":"\"Team\"&[N]","v":"Team3"},{"$f":"MOD(RANDBETWEEN(0,1)+Table2[[#This Row],[DDate]],4)+1","v":3},{"$f":"RANDBETWEEN(1000,9999)/100*[N]","v":36.57}]
[null,null,{"$f":"TODAY()-RANDBETWEEN(1,7)","v":"2010-03-04"},{"$f":"INDEX(INDIRECT(\"Table1[Team\"&[N]&\"]\"),RANDBETWEEN(1,9))","v":"Garcia"},{"$f":"\"Team\"&[N]","v":"Team2"},{"$f":"MOD(RANDBETWEEN(0,1)+Table2[[#This Row],[DDate]],4)+1","v":2},{"$f":"RANDBETWEEN(1000,9999)/100*[N]","v":136.94}]
[null,null,{"$f":"TODAY()-RANDBETWEEN(1,7)","v":"2010-03-04"},{"$f":"INDEX(INDIRECT(\"Table1[Team\"&[N]&\"]\"),RANDBETWEEN(1,9))","v":"Jackson"},{"$f":"\"Team\"&[N]","v":"Team2"},{"$f":"MOD(RANDBETWEEN(0,1)+Table2[[#This Row],[DDate]],4)+1","v":2},{"$f":"RANDBETWEEN(1000,9999)/100*[N]","v":128.97999999999999}]
[null,null,{"$f":"TODAY()-RANDBETWEEN(1,7)","v":"2010-03-04"},{"$f":"INDEX(INDIRECT(\"Table1[Team\"&[N]&\"]\"),RANDBETWEEN(1,9))","v":"Hall"},{"$f":"\"Team\"&[N]","v":"Team3"},{"$f":"MOD(RANDBETWEEN(0,1)+Table2[[#This Row],[DDate]],4)+1","v":3},{"$f":"RANDBETWEEN(1000,9999)/100*[N]","v":247.02}]
[null,null,{"$f":"TODAY()-RANDBETWEEN(1,7)","v":"2010-03-05"},{"$f":"INDEX(INDIRECT(\"Table1[Team\"&[N]&\"]\"),RANDBETWEEN(1,9))","v":"Hill"},{"$f":"\"Team\"&[N]","v":"Team4"},{"$f":"MOD(RANDBETWEEN(0,1)+Table2[[#This Row],[DDate]],4)+1","v":4},{"$f":"RANDBETWEEN(1000,9999)/100*[N]","v":227.64}]
[null,null,{"$f":"TODAY()-RANDBETWEEN(1,7)","v":"2010-03-01"},{"$f":"INDEX(INDIRECT(\"Table1[Team\"&[N]&\"]\"),RANDBETWEEN(1,9))","v":"Gonzalez"},{"$f":"\"Team\"&[N]","v":"Team4"},{"$f":"MOD(RANDBETWEEN(0,1)+Table2[[#This Row],[DDate]],4)+1","v":4},{"$f":"RANDBETWEEN(1000,9999)/100*[N]","v":149.72}]
[null,null,{"$f":"TODAY()-RANDBETWEEN(1,7)","v":"2010-03-03"},{"$f":"INDEX(INDIRECT(\"Table1[Team\"&[N]&\"]\"),RANDBETWEEN(1,9))","v":"Thompson"},{"$f":"\"Team\"&[N]","v":"Team2"},{"$f":"MOD(RANDBETWEEN(0,1)+Table2[[#This Row],[DDate]],4)+1","v":2},{"$f":"RANDBETWEEN(1000,9999)/100*[N]","v":45.78}]
[null,null,{"$f":"TODAY()-RANDBETWEEN(1,7)","v":"2010-02-28"},{"$f":"INDEX(INDIRECT(\"Table1[Team\"&[N]&\"]\"),RANDBETWEEN(1,9))","v":"Hall"},{"$f":"\"Team\"&[N]","v":"Team3"},{"$f":"MOD(RANDBETWEEN(0,1)+Table2[[#This Row],[DDate]],4)+1","v":3},{"$f":"RANDBETWEEN(1000,9999)/100*[N]","v":235.41}]
[null,null,{"$f":"TODAY()-RANDBETWEEN(1,7)","v":"2010-03-01"},{"$f":"INDEX(INDIRECT(\"Table1[Team\"&[N]&\"]\"),RANDBETWEEN(1,9))","v":"Lewis"},{"$f":"\"Team\"&[N]","v":"Team3"},{"$f":"MOD(RANDBETWEEN(0,1)+Table2[[#This Row],[DDate]],4)+1","v":3},{"$f":"RANDBETWEEN(1000,9999)/100*[N]","v":40.950000000000003}]
[null,null,{"$f":"TODAY()-RANDBETWEEN(1,7)","v":"2010-03-02"},{"$f":"INDEX(INDIRECT(\"Table1[Team\"&[N]&\"]\"),RANDBETWEEN(1,9))","v":"Green"},{"$f":"\"Team\"&[N]","v":"Team4"},{"$f":"MOD(RANDBETWEEN(0,1)+Table2[[#This Row],[DDate]],4)+1","v":4},{"$f":"RANDBETWEEN(1000,9999)/100*[N]","v":69.8}]
[null,null,{"$f":"TODAY()-RANDBETWEEN(1,7)","v":"2010-02-28"},{"$f":"INDEX(INDIRECT(\"Table1[Team\"&[N]&\"]\"),RANDBETWEEN(1,9))","v":"Walker"},{"$f":"\"Team\"&[N]","v":"Team3"},{"$f":"MOD(RANDBETWEEN(0,1)+Table2[[#This Row],[DDate]],4)+1","v":3},{"$f":"RANDBETWEEN(1000,9999)/100*[N]","v":39.81}]
[null,null,{"$f":"TODAY()-RANDBETWEEN(1,7)","v":"2010-03-03"},{"$f":"INDEX(INDIRECT(\"Table1[Team\"&[N]&\"]\"),RANDBETWEEN(1,9))","v":"Martin"},{"$f":"\"Team\"&[N]","v":"Team2"},{"$f":"MOD(RANDBETWEEN(0,1)+Table2[[#This Row],[DDate]],4)+1","v":2},{"$f":"RANDBETWEEN(1000,9999)/100*[N]","v":199.36}]
[null,null,{"$f":"TODAY()-RANDBETWEEN(1,7)","v":"2010-03-04"},{"$f":"INDEX(INDIRECT(\"Table1[Team\"&[N]&\"]\"),RANDBETWEEN(1,9))","v":"Rodriguez"},{"$f":"\"Team\"&[N]","v":"Team3"},{"$f":"MOD(RANDBETWEEN(0,1)+Table2[[#This Row],[DDate]],4)+1","v":3},{"$f":"RANDBETWEEN(1000,9999)/100*[N]","v":250.14}]
[null,null,{"$f":"TODAY()-RANDBETWEEN(1,7)","v":"2010-03-05"},{"$f":"INDEX(INDIRECT(\"Table1[Team\"&[N]&\"]\"),RANDBETWEEN(1,9))","v":"Rodriguez"},{"$f":"\"Team\"&[N]","v":"Team3"},{"$f":"MOD(RANDBETWEEN(0,1)+Table2[[#This Row],[DDate]],4)+1","v":3},{"$f":"RANDBETWEEN(1000,9999)/100*[N]","v":54.42}]
[null,null,{"$f":"TODAY()-RANDBETWEEN(1,7)","v":"2010-03-02"},{"$f":"INDEX(INDIRECT(\"Table1[Team\"&[N]&\"]\"),RANDBETWEEN(1,9))","v":"Hill"},{"$f":"\"Team\"&[N]","v":"Team4"},{"$f":"MOD(RANDBETWEEN(0,1)+Table2[[#This Row],[DDate]],4)+1","v":4},{"$f":"RANDBETWEEN(1000,9999)/100*[N]","v":49.12}]
[null,null,{"$f":"TODAY()-RANDBETWEEN(1,7)","v":"2010-02-28"},{"$f":"INDEX(INDIRECT(\"Table1[Team\"&[N]&\"]\"),RANDBETWEEN(1,9))","v":"Garcia"},{"$f":"\"Team\"&[N]","v":"Team2"},{"$f":"MOD(RANDBETWEEN(0,1)+Table2[[#This Row],[DDate]],4)+1","v":2},{"$f":"RANDBETWEEN(1000,9999)/100*[N]","v":29.18}]
[null,null,{"$f":"TODAY()-RANDBETWEEN(1,7)","v":"2010-03-04"},{"$f":"INDEX(INDIRECT(\"Table1[Team\"&[N]&\"]\"),RANDBETWEEN(1,9))","v":"Taylor"},{"$f":"\"Team\"&[N]","v":"Team2"},{"$f":"MOD(RANDBETWEEN(0,1)+Table2[[#This Row],[DDate]],4)+1","v":2},{"$f":"RANDBETWEEN(1000,9999)/100*[N]","v":115.28}]
[null,null,{"$f":"TODAY()-RANDBETWEEN(1,7)","v":"2010-03-04"},{"$f":"INDEX(INDIRECT(\"Table1[Team\"&[N]&\"]\"),RANDBETWEEN(1,9))","v":"Thompson"},{"$f":"\"Team\"&[N]","v":"Team2"},{"$f":"MOD(RANDBETWEEN(0,1)+Table2[[#This Row],[DDate]],4)+1","v":2},{"$f":"RANDBETWEEN(1000,9999)/100*[N]","v":157.18}]
[null,null,{"$f":"TODAY()-RANDBETWEEN(1,7)","v":"2010-03-01"},{"$f":"INDEX(INDIRECT(\"Table1[Team\"&[N]&\"]\"),RANDBETWEEN(1,9))","v":"Baker"},{"$f":"\"Team\"&[N]","v":"Team4"},{"$f":"MOD(RANDBETWEEN(0,1)+Table2[[#This Row],[DDate]],4)+1","v":4},{"$f":"RANDBETWEEN(1000,9999)/100*[N]","v":236.24}]
[null,null,{"$f":"TODAY()-RANDBETWEEN(1,7)","v":"2010-03-03"},{"$f":"INDEX(INDIRECT(\"Table1[Team\"&[N]&\"]\"),RANDBETWEEN(1,9))","v":"Thomas"},{"$f":"\"Team\"&[N]","v":"Team2"},{"$f":"MOD(RANDBETWEEN(0,1)+Table2[[#This Row],[DDate]],4)+1","v":2},{"$f":"RANDBETWEEN(1000,9999)/100*[N]","v":135}]
[null,null,{"$f":"TODAY()-RANDBETWEEN(1,7)","v":"2010-03-02"},{"$f":"INDEX(INDIRECT(\"Table1[Team\"&[N]&\"]\"),RANDBETWEEN(1,9))","v":"Adams"},{"$f":"\"Team\"&[N]","v":"Team4"},{"$f":"MOD(RANDBETWEEN(0,1)+Table2[[#This Row],[DDate]],4)+1","v":4},{"$f":"RANDBETWEEN(1000,9999)/100*[N]","v":128.80000000000001}]
[null,null,{"$f":"TODAY()-RANDBETWEEN(1,7)","v":"2010-03-01"},{"$f":"INDEX(INDIRECT(\"Table1[Team\"&[N]&\"]\"),RANDBETWEEN(1,9))","v":"Gonzalez"},{"$f":"\"Team\"&[N]","v":"Team4"},{"$f":"MOD(RANDBETWEEN(0,1)+Table2[[#This Row],[DDate]],4)+1","v":4},{"$f":"RANDBETWEEN(1000,9999)/100*[N]","v":90.04}]
[null,null,{"$f":"TODAY()-RANDBETWEEN(1,7)","v":"2010-03-01"},{"$f":"INDEX(INDIRECT(\"Table1[Team\"&[N]&\"]\"),RANDBETWEEN(1,9))","v":"Lewis"},{"$f":"\"Team\"&[N]","v":"Team3"},{"$f":"MOD(RANDBETWEEN(0,1)+Table2[[#This Row],[DDate]],4)+1","v":3},{"$f":"RANDBETWEEN(1000,9999)/100*[N]","v":262.32}]
[null,null,{"$f":"TODAY()-RANDBETWEEN(1,7)","v":"2010-03-01"},{"$f":"INDEX(INDIRECT(\"Table1[Team\"&[N]&\"]\"),RANDBETWEEN(1,9))","v":"Gonzalez"},{"$f":"\"Team\"&[N]","v":"Team4"},{"$f":"MOD(RANDBETWEEN(0,1)+Table2[[#This Row],[DDate]],4)+1","v":4},{"$f":"RANDBETWEEN(1000,9999)/100*[N]","v":393.32}]
[null,null,{"$f":"TODAY()-RANDBETWEEN(1,7)","v":"2010-03-02"},{"$f":"INDEX(INDIRECT(\"Table1[Team\"&[N]&\"]\"),RANDBETWEEN(1,9))","v":"Gonzalez"},{"$f":"\"Team\"&[N]","v":"Team4"},{"$f":"MOD(RANDBETWEEN(0,1)+Table2[[#This Row],[DDate]],4)+1","v":4},{"$f":"RANDBETWEEN(1000,9999)/100*[N]","v":223.16}]
[null,null,{"$f":"TODAY()-RANDBETWEEN(1,7)","v":"2010-03-05"},{"$f":"INDEX(INDIRECT(\"Table1[Team\"&[N]&\"]\"),RANDBETWEEN(1,9))","v":"Young"},{"$f":"\"Team\"&[N]","v":"Team3"},{"$f":"MOD(RANDBETWEEN(0,1)+Table2[[#This Row],[DDate]],4)+1","v":3},{"$f":"RANDBETWEEN(1000,9999)/100*[N]","v":56.04}]
[null,null,{"$f":"TODAY()-RANDBETWEEN(1,7)","v":"2010-03-02"},{"$f":"INDEX(INDIRECT(\"Table1[Team\"&[N]&\"]\"),RANDBETWEEN(1,9))","v":"Hill"},{"$f":"\"Team\"&[N]","v":"Team4"},{"$f":"MOD(RANDBETWEEN(0,1)+Table2[[#This Row],[DDate]],4)+1","v":4},{"$f":"RANDBETWEEN(1000,9999)/100*[N]","v":258.52}]
[null,null,{"$f":"TODAY()-RANDBETWEEN(1,7)","v":"2010-02-28"},{"$f":"INDEX(INDIRECT(\"Table1[Team\"&[N]&\"]\"),RANDBETWEEN(1,9))","v":"Clark"},{"$f":"\"Team\"&[N]","v":"Team3"},{"$f":"MOD(RANDBETWEEN(0,1)+Table2[[#This Row],[DDate]],4)+1","v":3},{"$f":"RANDBETWEEN(1000,9999)/100*[N]","v":286.53000000000003}]
[null,null,{"$f":"TODAY()-RANDBETWEEN(1,7)","v":"2010-02-28"},{"$f":"INDEX(INDIRECT(\"Table1[Team\"&[N]&\"]\"),RANDBETWEEN(1,9))","v":"Hernandez"},{"$f":"\"Team\"&[N]","v":"Team3"},{"$f":"MOD(RANDBETWEEN(0,1)+Table2[[#This Row],[DDate]],4)+1","v":3},{"$f":"RANDBETWEEN(1000,9999)/100*[N]","v":131.16}]
[null,null,{"$f":"TODAY()-RANDBETWEEN(1,7)","v":"2010-03-01"},{"$f":"INDEX(INDIRECT(\"Table1[Team\"&[N]&\"]\"),RANDBETWEEN(1,9))","v":"Hernandez"},{"$f":"\"Team\"&[N]","v":"Team3"},{"$f":"MOD(RANDBETWEEN(0,1)+Table2[[#This Row],[DDate]],4)+1","v":3},{"$f":"RANDBETWEEN(1000,9999)/100*[N]","v":48.12}]
[null,null,{"$f":"TODAY()-RANDBETWEEN(1,7)","v":"2010-03-01"},{"$f":"INDEX(INDIRECT(\"Table1[Team\"&[N]&\"]\"),RANDBETWEEN(1,9))","v":"Adams"},{"$f":"\"Team\"&[N]","v":"Team4"},{"$f":"MOD(RANDBETWEEN(0,1)+Table2[[#This Row],[DDate]],4)+1","v":4},{"$f":"RANDBETWEEN(1000,9999)/100*[N]","v":130.88}]
[null,null,{"$f":"TODAY()-RANDBETWEEN(1,7)","v":"2010-03-03"},{"$f":"INDEX(INDIRECT(\"Table1[Team\"&[N]&\"]\"),RANDBETWEEN(1,9))","v":"Brown"},{"$f":"\"Team\"&[N]","v":"Team1"},{"$f":"MOD(RANDBETWEEN(0,1)+Table2[[#This Row],[DDate]],4)+1","v":1},{"$f":"RANDBETWEEN(1000,9999)/100*[N]","v":73.599999999999994}]
[null,null,{"$f":"TODAY()-RANDBETWEEN(1,7)","v":"2010-03-02"},{"$f":"INDEX(INDIRECT(\"Table1[Team\"&[N]&\"]\"),RANDBETWEEN(1,9))","v":"Green"},{"$f":"\"Team\"&[N]","v":"Team4"},{"$f":"MOD(RANDBETWEEN(0,1)+Table2[[#This Row],[DDate]],4)+1","v":4},{"$f":"RANDBETWEEN(1000,9999)/100*[N]","v":205.2}]
[null,null,{"$f":"TODAY()-RANDBETWEEN(1,7)","v":"2010-03-02"},{"$f":"INDEX(INDIRECT(\"Table1[Team\"&[N]&\"]\"),RANDBETWEEN(1,9))","v":"Adams"},{"$f":"\"Team\"&[N]","v":"Team4"},{"$f":"MOD(RANDBETWEEN(0,1)+Table2[[#This Row],[DDate]],4)+1","v":4},{"$f":"RANDBETWEEN(1000,9999)/100*[N]","v":73.400000000000006}]
[null,null,{"$f":"TODAY()-RANDBETWEEN(1,7)","v":"2010-03-02"},{"$f":"INDEX(INDIRECT(\"Table1[Team\"&[N]&\"]\"),RANDBETWEEN(1,9))","v":"Brown"},{"$f":"\"Team\"&[N]","v":"Team1"},{"$f":"MOD(RANDBETWEEN(0,1)+Table2[[#This Row],[DDate]],4)+1","v":1},{"$f":"RANDBETWEEN(1000,9999)/100*[N]","v":95.66}]
[null,null,{"$f":"TODAY()-RANDBETWEEN(1,7)","v":"2010-03-01"},{"$f":"INDEX(INDIRECT(\"Table1[Team\"&[N]&\"]\"),RANDBETWEEN(1,9))","v":"Young"},{"$f":"\"Team\"&[N]","v":"Team3"},{"$f":"MOD(RANDBETWEEN(0,1)+Table2[[#This Row],[DDate]],4)+1","v":3},{"$f":"RANDBETWEEN(1000,9999)/100*[N]","v":83.13}]
[null,null,{"$f":"TODAY()-RANDBETWEEN(1,7)","v":"2010-03-04"},{"$f":"INDEX(INDIRECT(\"Table1[Team\"&[N]&\"]\"),RANDBETWEEN(1,9))","v":"Harris"},{"$f":"\"Team\"&[N]","v":"Team2"},{"$f":"MOD(RANDBETWEEN(0,1)+Table2[[#This Row],[DDate]],4)+1","v":2},{"$f":"RANDBETWEEN(1000,9999)/100*[N]","v":47.92}]
[null,null,{"$f":"TODAY()-RANDBETWEEN(1,7)","v":"2010-03-02"},{"$f":"INDEX(INDIRECT(\"Table1[Team\"&[N]&\"]\"),RANDBETWEEN(1,9))","v":"Davis"},{"$f":"\"Team\"&[N]","v":"Team1"},{"$f":"MOD(RANDBETWEEN(0,1)+Table2[[#This Row],[DDate]],4)+1","v":1},{"$f":"RANDBETWEEN(1000,9999)/100*[N]","v":58.95}]
[null,null,{"$f":"TODAY()-RANDBETWEEN(1,7)","v":"2010-03-02"},{"$f":"INDEX(INDIRECT(\"Table1[Team\"&[N]&\"]\"),RANDBETWEEN(1,9))","v":"Hill"},{"$f":"\"Team\"&[N]","v":"Team4"},{"$f":"MOD(RANDBETWEEN(0,1)+Table2[[#This Row],[DDate]],4)+1","v":4},{"$f":"RANDBETWEEN(1000,9999)/100*[N]","v":358.28}]
[null,null,{"$f":"TODAY()-RANDBETWEEN(1,7)","v":"2010-03-02"},{"$f":"INDEX(INDIRECT(\"Table1[Team\"&[N]&\"]\"),RANDBETWEEN(1,9))","v":"Wilson"},{"$f":"\"Team\"&[N]","v":"Team1"},{"$f":"MOD(RANDBETWEEN(0,1)+Table2[[#This Row],[DDate]],4)+1","v":1},{"$f":"RANDBETWEEN(1000,9999)/100*[N]","v":20.66}]
[null,null,{"$f":"TODAY()-RANDBETWEEN(1,7)","v":"2010-03-04"},{"$f":"INDEX(INDIRECT(\"Table1[Team\"&[N]&\"]\"),RANDBETWEEN(1,9))","v":"Anderson"},{"$f":"\"Team\"&[N]","v":"Team2"},{"$f":"MOD(RANDBETWEEN(0,1)+Table2[[#This Row],[DDate]],4)+1","v":2},{"$f":"RANDBETWEEN(1000,9999)/100*[N]","v":84.38}]
[null,null,{"$f":"TODAY()-RANDBETWEEN(1,7)","v":"2010-03-01"},{"$f":"INDEX(INDIRECT(\"Table1[Team\"&[N]&\"]\"),RANDBETWEEN(1,9))","v":"Hernandez"},{"$f":"\"Team\"&[N]","v":"Team3"},{"$f":"MOD(RANDBETWEEN(0,1)+Table2[[#This Row],[DDate]],4)+1","v":3},{"$f":"RANDBETWEEN(1000,9999)/100*[N]","v":102.87}]
[null,null,{"$f":"TODAY()-RANDBETWEEN(1,7)","v":"2010-03-02"},{"$f":"INDEX(INDIRECT(\"Table1[Team\"&[N]&\"]\"),RANDBETWEEN(1,9))","v":"Wright"},{"$f":"\"Team\"&[N]","v":"Team4"},{"$f":"MOD(RANDBETWEEN(0,1)+Table2[[#This Row],[DDate]],4)+1","v":4},{"$f":"RANDBETWEEN(1000,9999)/100*[N]","v":217.6}]
[null,null,{"$f":"TODAY()-RANDBETWEEN(1,7)","v":"2010-03-01"},{"$f":"INDEX(INDIRECT(\"Table1[Team\"&[N]&\"]\"),RANDBETWEEN(1,9))","v":"Lewis"},{"$f":"\"Team\"&[N]","v":"Team3"},{"$f":"MOD(RANDBETWEEN(0,1)+Table2[[#This Row],[DDate]],4)+1","v":3},{"$f":"RANDBETWEEN(1000,9999)/100*[N]","v":31.349999999999998}]
[null,null,{"$f":"TODAY()-RANDBETWEEN(1,7)","v":"2010-02-28"},{"$f":"INDEX(INDIRECT(\"Table1[Team\"&[N]&\"]\"),RANDBETWEEN(1,9))","v":"Lee"},{"$f":"\"Team\"&[N]","v":"Team3"},{"$f":"MOD(RANDBETWEEN(0,1)+Table2[[#This Row],[DDate]],4)+1","v":3},{"$f":"RANDBETWEEN(1000,9999)/100*[N]","v":152.76}]
[null,null,{"$f":"TODAY()-RANDBETWEEN(1,7)","v":"2010-03-04"},{"$f":"INDEX(INDIRECT(\"Table1[Team\"&[N]&\"]\"),RANDBETWEEN(1,9))","v":"Jackson"},{"$f":"\"Team\"&[N]","v":"Team2"},{"$f":"MOD(RANDBETWEEN(0,1)+Table2[[#This Row],[DDate]],4)+1","v":2},{"$f":"RANDBETWEEN(1000,9999)/100*[N]","v":177.96}]
[null,null,{"$f":"TODAY()-RANDBETWEEN(1,7)","v":"2010-03-04"},{"$f":"INDEX(INDIRECT(\"Table1[Team\"&[N]&\"]\"),RANDBETWEEN(1,9))","v":"Rodriguez"},{"$f":"\"Team\"&[N]","v":"Team3"},{"$f":"MOD(RANDBETWEEN(0,1)+Table2[[#This Row],[DDate]],4)+1","v":3},{"$f":"RANDBETWEEN(1000,9999)/100*[N]","v":72.09}]
[null,null,{"$f":"TODAY()-RANDBETWEEN(1,7)","v":"2010-03-03"},{"$f":"INDEX(INDIRECT(\"Table1[Team\"&[N]&\"]\"),RANDBETWEEN(1,9))","v":"Martin"},{"$f":"\"Team\"&[N]","v":"Team2"},{"$f":"MOD(RANDBETWEEN(0,1)+Table2[[#This Row],[DDate]],4)+1","v":2},{"$f":"RANDBETWEEN(1000,9999)/100*[N]","v":169.46}]
[null,null,{"$f":"TODAY()-RANDBETWEEN(1,7)","v":"2010-03-05"},{"$f":"INDEX(INDIRECT(\"Table1[Team\"&[N]&\"]\"),RANDBETWEEN(1,9))","v":"Clark"},{"$f":"\"Team\"&[N]","v":"Team3"},{"$f":"MOD(RANDBETWEEN(0,1)+Table2[[#This Row],[DDate]],4)+1","v":3},{"$f":"RANDBETWEEN(1000,9999)/100*[N]","v":234.24}]
[null,null,{"$f":"TODAY()-RANDBETWEEN(1,7)","v":"2010-03-02"},{"$f":"INDEX(INDIRECT(\"Table1[Team\"&[N]&\"]\"),RANDBETWEEN(1,9))","v":"Davis"},{"$f":"\"Team\"&[N]","v":"Team1"},{"$f":"MOD(RANDBETWEEN(0,1)+Table2[[#This Row],[DDate]],4)+1","v":1},{"$f":"RANDBETWEEN(1000,9999)/100*[N]","v":78.06}]
[null,null,{"$f":"TODAY()-RANDBETWEEN(1,7)","v":"2010-03-05"},{"$f":"INDEX(INDIRECT(\"Table1[Team\"&[N]&\"]\"),RANDBETWEEN(1,9))","v":"Adams"},{"$f":"\"Team\"&[N]","v":"Team4"},{"$f":"MOD(RANDBETWEEN(0,1)+Table2[[#This Row],[DDate]],4)+1","v":4},{"$f":"RANDBETWEEN(1000,9999)/100*[N]","v":74.48}]
[null,null,{"$f":"TODAY()-RANDBETWEEN(1,7)","v":"2010-03-05"},{"$f":"INDEX(INDIRECT(\"Table1[Team\"&[N]&\"]\"),RANDBETWEEN(1,9))","v":"Adams"},{"$f":"\"Team\"&[N]","v":"Team4"},{"$f":"MOD(RANDBETWEEN(0,1)+Table2[[#This Row],[DDate]],4)+1","v":4},{"$f":"RANDBETWEEN(1000,9999)/100*[N]","v":59.36}]
[null,null,{"$f":"TODAY()-RANDBETWEEN(1,7)","v":"2010-03-02"},{"$f":"INDEX(INDIRECT(\"Table1[Team\"&[N]&\"]\"),RANDBETWEEN(1,9))","v":"Wilson"},{"$f":"\"Team\"&[N]","v":"Team1"},{"$f":"MOD(RANDBETWEEN(0,1)+Table2[[#This Row],[DDate]],4)+1","v":1},{"$f":"RANDBETWEEN(1000,9999)/100*[N]","v":37.01}]
[null,null,{"$f":"TODAY()-RANDBETWEEN(1,7)","v":"2010-03-01"},{"$f":"INDEX(INDIRECT(\"Table1[Team\"&[N]&\"]\"),RANDBETWEEN(1,9))","v":"Wright"},{"$f":"\"Team\"&[N]","v":"Team4"},{"$f":"MOD(RANDBETWEEN(0,1)+Table2[[#This Row],[DDate]],4)+1","v":4},{"$f":"RANDBETWEEN(1000,9999)/100*[N]","v":329.28}]
[null,null,{"$f":"TODAY()-RANDBETWEEN(1,7)","v":"2010-03-06"},{"$f":"INDEX(INDIRECT(\"Table1[Team\"&[N]&\"]\"),RANDBETWEEN(1,9))","v":"Adams"},{"$f":"\"Team\"&[N]","v":"Team4"},{"$f":"MOD(RANDBETWEEN(0,1)+Table2[[#This Row],[DDate]],4)+1","v":4},{"$f":"RANDBETWEEN(1000,9999)/100*[N]","v":383.04}]
[null,null,{"$f":"TODAY()-RANDBETWEEN(1,7)","v":"2010-03-01"},{"$f":"INDEX(INDIRECT(\"Table1[Team\"&[N]&\"]\"),RANDBETWEEN(1,9))","v":"Adams"},{"$f":"\"Team\"&[N]","v":"Team4"},{"$f":"MOD(RANDBETWEEN(0,1)+Table2[[#This Row],[DDate]],4)+1","v":4},{"$f":"RANDBETWEEN(1000,9999)/100*[N]","v":64.08}]
[null,null,{"$f":"TODAY()-RANDBETWEEN(1,7)","v":"2010-03-01"},{"$f":"INDEX(INDIRECT(\"Table1[Team\"&[N]&\"]\"),RANDBETWEEN(1,9))","v":"Wright"},{"$f":"\"Team\"&[N]","v":"Team4"},{"$f":"MOD(RANDBETWEEN(0,1)+Table2[[#This Row],[DDate]],4)+1","v":4},{"$f":"RANDBETWEEN(1000,9999)/100*[N]","v":148.24}]
[null,null,{"$f":"TODAY()-RANDBETWEEN(1,7)","v":"2010-02-28"},{"$f":"INDEX(INDIRECT(\"Table1[Team\"&[N]&\"]\"),RANDBETWEEN(1,9))","v":"Martin"},{"$f":"\"Team\"&[N]","v":"Team2"},{"$f":"MOD(RANDBETWEEN(0,1)+Table2[[#This Row],[DDate]],4)+1","v":2},{"$f":"RANDBETWEEN(1000,9999)/100*[N]","v":79.64}]
[null,null,{"$f":"TODAY()-RANDBETWEEN(1,7)","v":"2010-03-05"},{"$f":"INDEX(INDIRECT(\"Table1[Team\"&[N]&\"]\"),RANDBETWEEN(1,9))","v":"Nelson"},{"$f":"\"Team\"&[N]","v":"Team4"},{"$f":"MOD(RANDBETWEEN(0,1)+Table2[[#This Row],[DDate]],4)+1","v":4},{"$f":"RANDBETWEEN(1000,9999)/100*[N]","v":303.76}]
[null,null,{"$f":"TODAY()-RANDBETWEEN(1,7)","v":"2010-03-02"},{"$f":"INDEX(INDIRECT(\"Table1[Team\"&[N]&\"]\"),RANDBETWEEN(1,9))","v":"Lopez"},{"$f":"\"Team\"&[N]","v":"Team4"},{"$f":"MOD(RANDBETWEEN(0,1)+Table2[[#This Row],[DDate]],4)+1","v":4},{"$f":"RANDBETWEEN(1000,9999)/100*[N]","v":357.28}]
[null,null,{"$f":"TODAY()-RANDBETWEEN(1,7)","v":"2010-03-05"},{"$f":"INDEX(INDIRECT(\"Table1[Team\"&[N]&\"]\"),RANDBETWEEN(1,9))","v":"Hall"},{"$f":"\"Team\"&[N]","v":"Team3"},{"$f":"MOD(RANDBETWEEN(0,1)+Table2[[#This Row],[DDate]],4)+1","v":3},{"$f":"RANDBETWEEN(1000,9999)/100*[N]","v":289.46999999999997}]
[null,null,{"$f":"TODAY()-RANDBETWEEN(1,7)","v":"2010-02-28"},{"$f":"INDEX(INDIRECT(\"Table1[Team\"&[N]&\"]\"),RANDBETWEEN(1,9))","v":"Lee"},{"$f":"\"Team\"&[N]","v":"Team3"},{"$f":"MOD(RANDBETWEEN(0,1)+Table2[[#This Row],[DDate]],4)+1","v":3},{"$f":"RANDBETWEEN(1000,9999)/100*[N]","v":296.58}]
[null,null,{"$f":"TODAY()-RANDBETWEEN(1,7)","v":"2010-03-05"},{"$f":"INDEX(INDIRECT(\"Table1[Team\"&[N]&\"]\"),RANDBETWEEN(1,9))","v":"Lee"},{"$f":"\"Team\"&[N]","v":"Team3"},{"$f":"MOD(RANDBETWEEN(0,1)+Table2[[#This Row],[DDate]],4)+1","v":3},{"$f":"RANDBETWEEN(1000,9999)/100*[N]","v":211.98}]
[null,null,{"$f":"TODAY()-RANDBETWEEN(1,7)","v":"2010-03-02"},{"$f":"INDEX(INDIRECT(\"Table1[Team\"&[N]&\"]\"),RANDBETWEEN(1,9))","v":"Scott"},{"$f":"\"Team\"&[N]","v":"Team4"},{"$f":"MOD(RANDBETWEEN(0,1)+Table2[[#This Row],[DDate]],4)+1","v":4},{"$f":"RANDBETWEEN(1000,9999)/100*[N]","v":348}]
[null,null,{"$f":"TODAY()-RANDBETWEEN(1,7)","v":"2010-03-05"},{"$f":"INDEX(INDIRECT(\"Table1[Team\"&[N]&\"]\"),RANDBETWEEN(1,9))","v":"Lewis"},{"$f":"\"Team\"&[N]","v":"Team3"},{"$f":"MOD(RANDBETWEEN(0,1)+Table2[[#This Row],[DDate]],4)+1","v":3},{"$f":"RANDBETWEEN(1000,9999)/100*[N]","v":139.26}]
[null,null,{"$f":"TODAY()-RANDBETWEEN(1,7)","v":"2010-03-06"},{"$f":"INDEX(INDIRECT(\"Table1[Team\"&[N]&\"]\"),RANDBETWEEN(1,9))","v":"Lopez"},{"$f":"\"Team\"&[N]","v":"Team4"},{"$f":"MOD(RANDBETWEEN(0,1)+Table2[[#This Row],[DDate]],4)+1","v":4},{"$f":"RANDBETWEEN(1000,9999)/100*[N]","v":197.2}]
[null,null,{"$f":"TODAY()-RANDBETWEEN(1,7)","v":"2010-03-01"},{"$f":"INDEX(INDIRECT(\"Table1[Team\"&[N]&\"]\"),RANDBETWEEN(1,9))","v":"Wright"},{"$f":"\"Team\"&[N]","v":"Team4"},{"$f":"MOD(RANDBETWEEN(0,1)+Table2[[#This Row],[DDate]],4)+1","v":4},{"$f":"RANDBETWEEN(1000,9999)/100*[N]","v":181.48}]
[null,null,{"$f":"TODAY()-RANDBETWEEN(1,7)","v":"2010-02-28"},{"$f":"INDEX(INDIRECT(\"Table1[Team\"&[N]&\"]\"),RANDBETWEEN(1,9))","v":"Clark"},{"$f":"\"Team\"&[N]","v":"Team3"},{"$f":"MOD(RANDBETWEEN(0,1)+Table2[[#This Row],[DDate]],4)+1","v":3},{"$f":"RANDBETWEEN(1000,9999)/100*[N]","v":132.06}]
[null,null,{"$f":"TODAY()-RANDBETWEEN(1,7)","v":"2010-03-05"},{"$f":"INDEX(INDIRECT(\"Table1[Team\"&[N]&\"]\"),RANDBETWEEN(1,9))","v":"Allen"},{"$f":"\"Team\"&[N]","v":"Team3"},{"$f":"MOD(RANDBETWEEN(0,1)+Table2[[#This Row],[DDate]],4)+1","v":3},{"$f":"RANDBETWEEN(1000,9999)/100*[N]","v":247.98}]

{"sheet":"Colors","index":1,"n_rows":11,"n_cols":7,"rows_kept":11,"cut":false,"hidden":false,"merged":[]}
[]
[]
[null,null,1,2,3,4,5]
[]
[]
[]
[]
[null,"Team1"]
[null,"Team2"]
[null,"Team3"]
[null,"Team4"]

{"sheet":"Test","index":2,"n_rows":15,"n_cols":5,"rows_kept":15,"cut":false,"hidden":false,"merged":[]}
[]
[]
[null,"Team1","Team2","Team3","Team4"]
[null,"Smith","Taylor","Clark","Wright"]
[null,"Johnson","Anderson","Rodriguez","Lopez"]
[null,"Williams","Thomas","Lewis","Hill"]
[null,"Jones","Jackson","Lee","Scott"]
[null,"Brown","White","Walker","Green"]
[null,"Davis","Harris","Hall","Adams"]
[null,"Miller","Martin","Allen","Baker"]
[null,"Wilson","Thompson","Young","Gonzalez"]
[null,"Moore","Garcia","Hernandez","Nelson"]
[null,null,"Martinez","King","Carter"]
[null,null,"Robinson",null,"Mitchell"]
[null,null,null,null,"Perez"]