{"text_format":"1","workbook":"xlsx","n_sheets":4,"sheets":["Summary","2007","2008","2009"],"not_rendered":{"charts":0,"images":2,"macros":1,"external_links":0,"defined_names":1,"comments":0,"pivot_tables":1},"unopened":[],"bounds":{"document_bytes":16777216,"sheet_cells":100000,"rows_first":2000,"rows_last":500,"rows_between":2000,"halvings":0,"cell_chars":16384,"cell_head_chars":4096},"cells_cut":0,"cells_raw":0,"read":"whole","date_system":"1900"}

{"sheet":"Summary","index":0,"n_rows":274,"n_cols":11,"rows_kept":274,"cut":false,"hidden":false,"merged":[]}
[]
[null,"Table4",null,null,null,null,null,"PivotTable1"]
[null,"DDate","DoW","Sales",null,null,null,"Years","DDate","DoW","Sum of Sales"]
[null,"2007-01-01","Mon",13.09,null,null,null,"2007","Jan","Mon",13.09]
[null,"2007-01-02","Tue",47.44,null,null,null,null,null,"Tue",47.44]
[null,"2007-01-03","Wed",23.18,null,null,null,null,null,"Wed",23.18]
[null,"2007-01-04","Thu",67.709999999999994,null,null,null,null,"Feb","Mon",17.82]
[null,"2007-01-05","Fri",74.95,null,null,null,null,null,"Tue",38.58]
[null,"2007-01-06","Sat",0,null,null,null,null,null,"Wed",11.38]
[null,"2007-01-07","Sun",0,null,null,null,null,"Mar","Mon",14.85]
[null,"2007-01-08",null,86.05,null,null,null,null,null,"Tue",64.94]
[null,"2007-01-09",null,33.14,null,null,null,null,null,"Wed",13.52]
[null,"2007-01-10",null,22.31,null,null,null,"2007 Total",null,null,244.8]
[null,"2007-01-11",null,60.57,null,null,null,"2008","Jan","Mon",13.69]
[null,"2007-01-12",null,26.81,null,null,null,null,null,"Tue",89.71]
[null,"2007-01-13",null,0,null,null,null,null,null,"Wed",46.92]
[null,"2007-01-14",null,0,null,null,null,null,"Feb","Mon",59.02]
[null,"2007-01-15",null,53.2,null,null,null,null,null,"Tue",88.27]
[null,"2007-01-16",null,56.3,null,null,null,null,null,"Wed",49.76]
[null,"2007-01-17",null,86.7,null,null,null,null,"Mar","Mon",40.71]
[null,"2007-01-18",null,92.04,null,null,null,null,null,"Tue",44.12]
[null,"2007-01-19",null,90.86,null,null,null,null,null,"Wed",13.3]
[null,"2007-01-20",null,0,null,null,null,"2008 Total",null,null,445.5]
[null,"2007-01-21",null,0,null,null,null,"2009","Jan","Mon",60.18]
[null,"2007-01-22",null,69.66,null,null,null,null,null,"Tue",38.4]
[null,"2007-01-23",null,97.57,null,null,null,null,null,"Wed",54.9]
[null,"2007-01-24",null,37.299999999999997,null,null,null,null,"Feb","Mon",75.2]
[null,"2007-01-25",null,18.36,null,null,null,null,null,"Tue",12.87]
[null,"2007-01-26",null,41.88,null,null,null,null,null,"Wed",29.9]
[null,"2007-01-27",null,0,null,null,null,null,"Mar","Mon",99.2]
[null,"2007-01-28",null,0,null,null,null,null,null,"Tue",34.78]
[null,"2007-01-29",null,83.69,null,null,null,null,null,"Wed",51.27]
[null,"2007-01-30",null,19.39,null,null,null,"2009 Total",null,null,456.69999999999993]
[null,"2007-01-31",null,65.150000000000006]
[null,"2007-02-01","Thu",73.94]
[null,"2007-02-02","Fri",63.52]
[null,"2007-02-03","Sat",0]
[null,"2007-02-04","Sun",0]
[null,"2007-02-05","Mon",17.82]
[null,"2007-02-06","Tue",38.58]
[null,"2007-02-07","Wed",11.38]
[null,"2007-02-08",null,83.17]
[null,"2007-02-09",null,81.36]
[null,"2007-02-10",null,0]
[null,"2007-02-11",null,0]
[null,"2007-02-12",null,79.75]
[null,"2007-02-13",null,37.65]
[null,"2007-02-14",null,82.29]
[null,"2007-02-15",null,38.01]
[null,"2007-02-16",null,19.309999999999999]
[null,"2007-02-17",null,0]
[null,"2007-02-18",null,0]
[null,"2007-02-19",null,30.55]
[null,"2007-02-20",null,71.040000000000006]
[null,"2007-02-21",null,60.96]
[null,"2007-02-22",null,82.1]
[null,"2007-02-23",null,18.920000000000002]
[null,"2007-02-24",null,0]
[null,"2007-02-25",null,0]
[null,"2007-02-26",null,25.31]
[null,"2007-02-27",null,53.85]
[null,"2007-02-28",null,60.76]
[null,"2007-03-01","Thu",69.010000000000005]
[null,"2007-03-02","Fri",55.5]
[null,"2007-03-03","Sat",0]
[null,"2007-03-04","Sun",0]
[null,"2007-03-05","Mon",14.85]
[null,"2007-03-06","Tue",64.94]
[null,"2007-03-07","Wed",13.52]
[null,"2007-03-08",null,57.61]
[null,"2007-03-09",null,20.27]
[null,"2007-03-10",null,0]
[null,"2007-03-11",null,0]
[null,"2007-03-12",null,45.81]
[null,"2007-03-13",null,58.95]
[null,"2007-03-14",null,77.73]
[null,"2007-03-15",null,78.09]
[null,"2007-03-16",null,83.11]
[null,"2007-03-17",null,0]
[null,"2007-03-18",null,0]
[null,"2007-03-19",null,64.66]
[null,"2007-03-20",null,42.49]
[null,"2007-03-21",null,19.55]
[null,"2007-03-22",null,13.75]
[null,"2007-03-23",null,59.73]
[null,"2007-03-24",null,0]
[null,"2007-03-25",null,0]
[null,"2007-03-26",null,19.670000000000002]
[null,"2007-03-27",null,62.87]
[null,"2007-03-28",null,10.88]
[null,"2007-03-29",null,67.91]
[null,"2007-03-30",null,68.989999999999995]
[null,"2007-03-31",null,0]
[null,"2008-01-01","Tue",89.71]
[null,"2008-01-02","Wed",46.92]
[null,"2008-01-03","Thu",25.91]
[null,"2008-01-04","Fri",71.290000000000006]
[null,"2008-01-05","Sat",0]
[null,"2008-01-06","Sun",0]
[null,"2008-01-07","Mon",13.69]
[null,"2008-01-08",null,12.7]
[null,"2008-01-09",null,40.97]
[null,"2008-01-10",null,79.760000000000005]
[null,"2008-01-11",null,94.51]
[null,"2008-01-12",null,0]
[null,"2008-01-13",null,0]
[null,"2008-01-14",null,32.94]
[null,"2008-01-15",null,64.150000000000006]
[null,"2008-01-16",null,12.26]
[null,"2008-01-17",null,23.69]
[null,"2008-01-18",null,21.91]
[null,"2008-01-19",null,0]
[null,"2008-01-20",null,0]
[null,"2008-01-21",null,22.45]
[null,"2008-01-22",null,27.1]
[null,"2008-01-23",null,26.22]
[null,"2008-01-24",null,43.81]
[null,"2008-01-25",null,83.08]
[null,"2008-01-26",null,0]
[null,"2008-01-27",null,0]
[null,"2008-01-28",null,84.57]
[null,"2008-01-29",null,43.73]
[null,"2008-01-30",null,92.47]
[null,"2008-01-31",null,47.76]
[null,"2008-02-01","Fri",32.270000000000003]
[null,"2008-02-02","Sat",0]
[null,"2008-02-03","Sun",0]
[null,"2008-02-04","Mon",59.02]
[null,"2008-02-05","Tue",88.27]
[null,"2008-02-06","Wed",49.76]
[null,"2008-02-07","Thu",21.91]
[null,"2008-02-08",null,22.8]
[null,"2008-02-09",null,0]
[null,"2008-02-10",null,0]
[null,"2008-02-11",null,28.72]
[null,"2008-02-12",null,69.95]
[null,"2008-02-13",null,66.67]
[null,"2008-02-14",null,66.92]
[null,"2008-02-15",null,41]
[null,"2008-02-16",null,0]
[null,"2008-02-17",null,0]
[null,"2008-02-18",null,88.42]
[null,"2008-02-19",null,75.08]
[null,"2008-02-20",null,70.19]
[null,"2008-02-21",null,63.17]
[null,"2008-02-22",null,34.299999999999997]
[null,"2008-02-23",null,0]
[null,"2008-02-24",null,0]
[null,"2008-02-25",null,11]
[null,"2008-02-26",null,36.42]
[null,"2008-02-27",null,52.54]
[null,"2008-02-28",null,55.01]
[null,"2008-02-29",null,26.25]
[null,"2008-03-01","Sat",0]
[null,"2008-03-02","Sun",0]
[null,"2008-03-03","Mon",40.71]
[null,"2008-03-04","Tue",44.12]
[null,"2008-03-05","Wed",13.3]
[null,"2008-03-06","Thu",11.59]
[null,"2008-03-07","Fri",66.180000000000007]
[null,"2008-03-08",null,0]
[null,"2008-03-09",null,0]
[null,"2008-03-10",null,22.14]
[null,"2008-03-11",null,40.67]
[null,"2008-03-12",null,15.06]
[null,"2008-03-13",null,13.16]
[null,"2008-03-14",null,14.13]
[null,"2008-03-15",null,0]
[null,"2008-03-16",null,0]
[null,"2008-03-17",null,85.22]
[null,"2008-03-18",null,86.4]
[null,"2008-03-19",null,12.76]
[null,"2008-03-20",null,51.65]
[null,"2008-03-21",null,42.56]
[null,"2008-03-22",null,0]
[null,"2008-03-23",null,0]
[null,"2008-03-24",null,16.47]
[null,"2008-03-25",null,54.01]
[null,"2008-03-26",null,58.9]
[null,"2008-03-27",null,14.15]
[null,"2008-03-28",null,64.58]
[null,"2008-03-29",null,0]
[null,"2008-03-30",null,0]
[null,"2008-03-31",null,54.91]
[null,"2009-01-01","Thu",33.46]
[null,"2009-01-02","Fri",21.58]
[null,"2009-01-03","Sat",0]
[null,"2009-01-04","Sun",0]
[null,"2009-01-05","Mon",60.18]
[null,"2009-01-06","Tue",38.4]
[null,"2009-01-07","Wed",54.9]
[null,"2009-01-08",null,45.85]
[null,"2009-01-09",null,91.88]
[null,"2009-01-10",null,0]
[null,"2009-01-11",null,0]
[null,"2009-01-12",null,34.17]
[null,"2009-01-13",null,31.4]
[null,"2009-01-14",null,43.77]
[null,"2009-01-15",null,20.79]
[null,"2009-01-16",null,33.590000000000003]
[null,"2009-01-17",null,0]
[null,"2009-01-18",null,0]
[null,"2009-01-19",null,89.72]
[null,"2009-01-20",null,34.4]
[null,"2009-01-21",null,40.67]
[null,"2009-01-22",null,77.95]
[null,"2009-01-23",null,83.79]
[null,"2009-01-24",null,0]
[null,"2009-01-25",null,0]
[null,"2009-01-26",null,12.6]
[null,"2009-01-27",null,29.04]
[null,"2009-01-28",null,80.44]
[null,"2009-01-29",null,81.81]
[null,"2009-01-30",null,45.18]
[null,"2009-01-31",null,0]
[null,"2009-02-01","Sun",0]
[null,"2009-02-02","Mon",75.2]
[null,"2009-02-03","Tue",12.87]
[null,"2009-02-04","Wed",29.9]
[null,"2009-02-05","Thu",91.42]
[null,"2009-02-06","Fri",94.22]
[null,"2009-02-07","Sat",0]
[null,"2009-02-08",null,0]
[null,"2009-02-09",null,19.38]
[null,"2009-02-10",null,57.97]
[null,"2009-02-11",null,18.170000000000002]
[null,"2009-02-12",null,48.31]
[null,"2009-02-13",null,76.84]
[null,"2009-02-14",null,0]
[null,"2009-02-15",null,0]
[null,"2009-02-16",null,90.26]
[null,"2009-02-17",null,14.32]
[null,"2009-02-18",null,53.38]
[null,"2009-02-19",null,50.26]
[null,"2009-02-20",null,59.07]
[null,"2009-02-21",null,0]
[null,"2009-02-22",null,0]
[null,"2009-02-23",null,19.09]
[null,"2009-02-24",null,80.73]
[null,"2009-02-25",null,92.52]
[null,"2009-02-26",null,13.83]
[null,"2009-02-27",null,68.930000000000007]
[null,"2009-02-28",null,0]
[null,"2009-03-01","Sun",0]
[null,"2009-03-02","Mon",99.2]
[null,"2009-03-03","Tue",34.78]
[null,"2009-03-04","Wed",51.27]
[null,"2009-03-05","Thu",69.55]
[null,"2009-03-06","Fri",94.26]
[null,"2009-03-07","Sat",0]
[null,"2009-03-08",null,0]
[null,"2009-03-09",null,74.83]
[null,"2009-03-10",null,29.81]
[null,"2009-03-11",null,20.7]
[null,"2009-03-12",null,65.62]
[null,"2009-03-13",null,90.41]
[null,"2009-03-14",null,0]
[null,"2009-03-15",null,0]
[null,"2009-03-16",null,98.03]
[null,"2009-03-17",null,92.6]
[null,"2009-03-18",null,90.06]
[null,"2009-03-19",null,28.56]
[null,"2009-03-20",null,23.92]
[null,"2009-03-21",null,0]
[null,"2009-03-22",null,0]
[null,"2009-03-23",null,78.64]
[null,"2009-03-24",null,64.739999999999995]
[null,"2009-03-25",null,45.75]
[null,"2009-03-26",null,18.100000000000001]
[null,"2009-03-27",null,89.49]
[null,"2009-03-28",null,0]
[null,"2009-03-29",null,0]
[null,"2009-03-30",null,34.51]
[null,"2009-03-31",null,14.08]

{"sheet":"2007","index":1,"n_rows":93,"n_cols":4,"rows_kept":93,"cut":false,"hidden":false,"merged":[]}
[]
[null,"Table1"]
[null,"DDate","DoW","Sales"]
[null,"2007-01-01",{"$f":"TEXT(IF(DAY([DDate])<8,WEEKDAY([DDate]),\"\"),\"ddd\")","v":"Mon"},{"$f":"(WEEKDAY(Table1[[#This Row],[DDate]],2)<=5)*RANDBETWEEN(1000,9999)/100","v":61.76}]
[null,"2007-01-02",{"$f":"TEXT(IF(DAY([DDate])<8,WEEKDAY([DDate]),\"\"),\"ddd\")","v":"Tue"},{"$f":"(WEEKDAY(Table1[[#This Row],[DDate]],2)<=5)*RANDBETWEEN(1000,9999)/100","v":63.14}]
[null,"2007-01-03",{"$f":"TEXT(IF(DAY([DDate])<8,WEEKDAY([DDate]),\"\"),\"ddd\")","v":"Wed"},{"$f":"(WEEKDAY(Table1[[#This Row],[DDate]],2)<=5)*RANDBETWEEN(1000,9999)/100","v":78.27}]
[null,"2007-01-04",{"$f":"TEXT(IF(DAY([DDate])<8,WEEKDAY([DDate]),\"\"),\"ddd\")","v":"Thu"},{"$f":"(WEEKDAY(Table1[[#This Row],[DDate]],2)<=5)*RANDBETWEEN(1000,9999)/100","v":39.39}]
[null,"2007-01-05",{"$f":"TEXT(IF(DAY([DDate])<8,WEEKDAY([DDate]),\"\"),\"ddd\")","v":"Fri"},{"$f":"(WEEKDAY(Table1[[#This Row],[DDate]],2)<=5)*RANDBETWEEN(1000,9999)/100","v":16.809999999999999}]
[null,"2007-01-06",{"$f":"TEXT(IF(DAY([DDate])<8,WEEKDAY([DDate]),\"\"),\"ddd\")","v":"Sat"},{"$f":"(WEEKDAY(Table1[[#This Row],[DDate]],2)<=5)*RANDBETWEEN(1000,9999)/100","v":0}]
[null,"2007-01-07",{"$f":"TEXT(IF(DAY([DDate])<8,WEEKDAY([DDate]),\"\"),\"ddd\")","v":"Sun"},{"$f":"(WEEKDAY(Table1[[#This Row],[DDate]],2)<=5)*RANDBETWEEN(1000,9999)/100","v":0}]
[null,"2007-01-08",{"$f":"TEXT(IF(DAY([DDate])<8,WEEKDAY([DDate]),\"\"),\"ddd\")","v":""},{"$f":"(WEEKDAY(Table1[[#This Row],[DDate]],2)<=5)*RANDBETWEEN(1000,9999)/100","v":95.28}]
[null,"2007-01-09",{"$f":"TEXT(IF(DAY([DDate])<8,WEEKDAY([DDate]),\"\"),\"ddd\")","v":""},{"$f":"(WEEKDAY(Table1[[#This Row],[DDate]],2)<=5)*RANDBETWEEN(1000,9999)/100","v":81.06}]
[null,"2007-01-10",{"$f":"TEXT(IF(DAY([DDate])<8,WEEKDAY([DDate]),\"\"),\"ddd\")","v":""},{"$f":"(WEEKDAY(Table1[[#This Row],[DDate]],2)<=5)*RANDBETWEEN(1000,9999)/100","v":24.48}]
[null,"2007-01-11",{"$f":"TEXT(IF(DAY([DDate])<8,WEEKDAY([DDate]),\"\"),\"ddd\")","v":""},{"$f":"(WEEKDAY(Table1[[#This Row],[DDate]],2)<=5)*RANDBETWEEN(1000,9999)/100","v":45.95}]
[null,"2007-01-12",{"$f":"TEXT(IF(DAY([DDate])<8,WEEKDAY([DDate]),\"\"),\"ddd\")","v":""},{"$f":"(WEEKDAY(Table1[[#This Row],[DDate]],2)<=5)*RANDBETWEEN(1000,9999)/100","v":44.31}]
[null,"2007-01-13",{"$f":"TEXT(IF(DAY([DDate])<8,WEEKDAY([DDate]),\"\"),\"ddd\")","v":""},{"$f":"(WEEKDAY(Table1[[#This Row],[DDate]],2)<=5)*RANDBETWEEN(1000,9999)/100","v":0}]
[null,"2007-01-14",{"$f":"TEXT(IF(DAY([DDate])<8,WEEKDAY([DDate]),\"\"),\"ddd\")","v":""},{"$f":"(WEEKDAY(Table1[[#This Row],[DDate]],2)<=5)*RANDBETWEEN(1000,9999)/100","v":0}]
[null,"2007-01-15",{"$f":"TEXT(IF(DAY([DDate])<8,WEEKDAY([DDate]),\"\"),\"ddd\")","v":""},{"$f":"(WEEKDAY(Table1[[#This Row],[DDate]],2)<=5)*RANDBETWEEN(1000,9999)/100","v":74.19}]
[null,"2007-01-16",{"$f":"TEXT(IF(DAY([DDate])<8,WEEKDAY([DDate]),\"\"),\"ddd\")","v":""},{"$f":"(WEEKDAY(Table1[[#This Row],[DDate]],2)<=5)*RANDBETWEEN(1000,9999)/100","v":22.2}]
[null,"2007-01-17",{"$f":"TEXT(IF(DAY([DDate])<8,WEEKDAY([DDate]),\"\"),\"ddd\")","v":""},{"$f":"(WEEKDAY(Table1[[#This Row],[DDate]],2)<=5)*RANDBETWEEN(1000,9999)/100","v":18.059999999999999}]
[null,"2007-01-18",{"$f":"TEXT(IF(DAY([DDate])<8,WEEKDAY([DDate]),\"\"),\"ddd\")","v":""},{"$f":"(WEEKDAY(Table1[[#This Row],[DDate]],2)<=5)*RANDBETWEEN(1000,9999)/100","v":14.41}]
[null,"2007-01-19",{"$f":"TEXT(IF(DAY([DDate])<8,WEEKDAY([DDate]),\"\"),\"ddd\")","v":""},{"$f":"(WEEKDAY(Table1[[#This Row],[DDate]],2)<=5)*RANDBETWEEN(1000,9999)/100","v":67.760000000000005}]
[null,"2007-01-20",{"$f":"TEXT(IF(DAY([DDate])<8,WEEKDAY([DDate]),\"\"),\"ddd\")","v":""},{"$f":"(WEEKDAY(Table1[[#This Row],[DDate]],2)<=5)*RANDBETWEEN(1000,9999)/100","v":0}]
[null,"2007-01-21",{"$f":"TEXT(IF(DAY([DDate])<8,WEEKDAY([DDate]),\"\"),\"ddd\")","v":""},{"$f":"(WEEKDAY(Table1[[#This Row],[DDate]],2)<=5)*RANDBETWEEN(1000,9999)/100","v":0}]
[null,"2007-01-22",{"$f":"TEXT(IF(DAY([DDate])<8,WEEKDAY([DDate]),\"\"),\"ddd\")","v":""},{"$f":"(WEEKDAY(Table1[[#This Row],[DDate]],2)<=5)*RANDBETWEEN(1000,9999)/100","v":66.680000000000007}]
[null,"2007-01-23",{"$f":"TEXT(IF(DAY([DDate])<8,WEEKDAY([DDate]),\"\"),\"ddd\")","v":""},{"$f":"(WEEKDAY(Table1[[#This Row],[DDate]],2)<=5)*RANDBETWEEN(1000,9999)/100","v":80.25}]
[null,"2007-01-24",{"$f":"TEXT(IF(DAY([DDate])<8,WEEKDAY([DDate]),\"\"),\"ddd\")","v":""},{"$f":"(WEEKDAY(Table1[[#This Row],[DDate]],2)<=5)*RANDBETWEEN(1000,9999)/100","v":78.72}]
[null,"2007-01-25",{"$f":"TEXT(IF(DAY([DDate])<8,WEEKDAY([DDate]),\"\"),\"ddd\")","v":""},{"$f":"(WEEKDAY(Table1[[#This Row],[DDate]],2)<=5)*RANDBETWEEN(1000,9999)/100","v":34.15}]
[null,"2007-01-26",{"$f":"TEXT(IF(DAY([DDate])<8,WEEKDAY([DDate]),\"\"),\"ddd\")","v":""},{"$f":"(WEEKDAY(Table1[[#This Row],[DDate]],2)<=5)*RANDBETWEEN(1000,9999)/100","v":56.5}]
[null,"2007-01-27",{"$f":"TEXT(IF(DAY([DDate])<8,WEEKDAY([DDate]),\"\"),\"ddd\")","v":""},{"$f":"(WEEKDAY(Table1[[#This Row],[DDate]],2)<=5)*RANDBETWEEN(1000,9999)/100","v":0}]
[null,"2007-01-28",{"$f":"TEXT(IF(DAY([DDate])<8,WEEKDAY([DDate]),\"\"),\"ddd\")","v":""},{"$f":"(WEEKDAY(Table1[[#This Row],[DDate]],2)<=5)*RANDBETWEEN(1000,9999)/100","v":0}]
[null,"2007-01-29",{"$f":"TEXT(IF(DAY([DDate])<8,WEEKDAY([DDate]),\"\"),\"ddd\")","v":""},{"$f":"(WEEKDAY(Table1[[#This Row],[DDate]],2)<=5)*RANDBETWEEN(1000,9999)/100","v":49.85}]
[null,"2007-01-30",{"$f":"TEXT(IF(DAY([DDate])<8,WEEKDAY([DDate]),\"\"),\"ddd\")","v":""},{"$f":"(WEEKDAY(Table1[[#This Row],[DDate]],2)<=5)*RANDBETWEEN(1000,9999)/100","v":65.680000000000007}]
[null,"2007-01-31",{"$f":"TEXT(IF(DAY([DDate])<8,WEEKDAY([DDate]),\"\"),\"ddd\")","v":""},{"$f":"(WEEKDAY(Table1[[#This Row],[DDate]],2)<=5)*RANDBETWEEN(1000,9999)/100","v":59.1}]
[null,"2007-02-01",{"$f":"TEXT(IF(DAY([DDate])<8,WEEKDAY([DDate]),\"\"),\"ddd\")","v":"Thu"},{"$f":"(WEEKDAY(Table1[[#This Row],[DDate]],2)<=5)*RANDBETWEEN(1000,9999)/100","v":99.44}]
[null,"2007-02-02",{"$f":"TEXT(IF(DAY([DDate])<8,WEEKDAY([DDate]),\"\"),\"ddd\")","v":"Fri"},{"$f":"(WEEKDAY(Table1[[#This Row],[DDate]],2)<=5)*RANDBETWEEN(1000,9999)/100","v":34.299999999999997}]
[null,"2007-02-03",{"$f":"TEXT(IF(DAY([DDate])<8,WEEKDAY([DDate]),\"\"),\"ddd\")","v":"Sat"},{"$f":"(WEEKDAY(Table1[[#This Row],[DDate]],2)<=5)*RANDBETWEEN(1000,9999)/100","v":0}]
[null,"2007-02-04",{"$f":"TEXT(IF(DAY([DDate])<8,WEEKDAY([DDate]),\"\"),\"ddd\")","v":"Sun"},{"$f":"(WEEKDAY(Table1[[#This Row],[DDate]],2)<=5)*RANDBETWEEN(1000,9999)/100","v":0}]
[null,"2007-02-05",{"$f":"TEXT(IF(DAY([DDate])<8,WEEKDAY([DDate]),\"\"),\"ddd\")","v":"Mon"},{"$f":"(WEEKDAY(Table1[[#This Row],[DDate]],2)<=5)*RANDBETWEEN(1000,9999)/100","v":83.13}]
[null,"2007-02-06",{"$f":"TEXT(IF(DAY([DDate])<8,WEEKDAY([DDate]),\"\"),\"ddd\")","v":"Tue"},{"$f":"(WEEKDAY(Table1[[#This Row],[DDate]],2)<=5)*RANDBETWEEN(1000,9999)/100","v":94.48}]
[null,"2007-02-07",{"$f":"TEXT(IF(DAY([DDate])<8,WEEKDAY([DDate]),\"\"),\"ddd\")","v":"Wed"},{"$f":"(WEEKDAY(Table1[[#This Row],[DDate]],2)<=5)*RANDBETWEEN(1000,9999)/100","v":56.7}]
[null,"2007-02-08",{"$f":"TEXT(IF(DAY([DDate])<8,WEEKDAY([DDate]),\"\"),\"ddd\")","v":""},{"$f":"(WEEKDAY(Table1[[#This Row],[DDate]],2)<=5)*RANDBETWEEN(1000,9999)/100","v":10.17}]
[null,"2007-02-09",{"$f":"TEXT(IF(DAY([DDate])<8,WEEKDAY([DDate]),\"\"),\"ddd\")","v":""},{"$f":"(WEEKDAY(Table1[[#This Row],[DDate]],2)<=5)*RANDBETWEEN(1000,9999)/100","v":76.989999999999995}]
[null,"2007-02-10",{"$f":"TEXT(IF(DAY([DDate])<8,WEEKDAY([DDate]),\"\"),\"ddd\")","v":""},{"$f":"(WEEKDAY(Table1[[#This Row],[DDate]],2)<=5)*RANDBETWEEN(1000,9999)/100","v":0}]
[null,"2007-02-11",{"$f":"TEXT(IF(DAY([DDate])<8,WEEKDAY([DDate]),\"\"),\"ddd\")","v":""},{"$f":"(WEEKDAY(Table1[[#This Row],[DDate]],2)<=5)*RANDBETWEEN(1000,9999)/100","v":0}]
[null,"2007-02-12",{"$f":"TEXT(IF(DAY([DDate])<8,WEEKDAY([DDate]),\"\"),\"ddd\")","v":""},{"$f":"(WEEKDAY(Table1[[#This Row],[DDate]],2)<=5)*RANDBETWEEN(1000,9999)/100","v":75.59}]
[null,"2007-02-13",{"$f":"TEXT(IF(DAY([DDate])<8,WEEKDAY([DDate]),\"\"),\"ddd\")","v":""},{"$f":"(WEEKDAY(Table1[[#This Row],[DDate]],2)<=5)*RANDBETWEEN(1000,9999)/100","v":26.51}]
[null,"2007-02-14",{"$f":"TEXT(IF(DAY([DDate])<8,WEEKDAY([DDate]),\"\"),\"ddd\")","v":""},{"$f":"(WEEKDAY(Table1[[#This Row],[DDate]],2)<=5)*RANDBETWEEN(1000,9999)/100","v":74.28}]
[null,"2007-02-15",{"$f":"TEXT(IF(DAY([DDate])<8,WEEKDAY([DDate]),\"\"),\"ddd\")","v":""},{"$f":"(WEEKDAY(Table1[[#This Row],[DDate]],2)<=5)*RANDBETWEEN(1000,9999)/100","v":82.46}]
[null,"2007-02-16",{"$f":"TEXT(IF(DAY([DDate])<8,WEEKDAY([DDate]),\"\"),\"ddd\")","v":""},{"$f":"(WEEKDAY(Table1[[#This Row],[DDate]],2)<=5)*RANDBETWEEN(1000,9999)/100","v":84.51}]
[null,"2007-02-17",{"$f":"TEXT(IF(DAY([DDate])<8,WEEKDAY([DDate]),\"\"),\"ddd\")","v":""},{"$f":"(WEEKDAY(Table1[[#This Row],[DDate]],2)<=5)*RANDBETWEEN(1000,9999)/100","v":0}]
[null,"2007-02-18",{"$f":"TEXT(IF(DAY([DDate])<8,WEEKDAY([DDate]),\"\"),\"ddd\")","v":""},{"$f":"(WEEKDAY(Table1[[#This Row],[DDate]],2)<=5)*RANDBETWEEN(1000,9999)/100","v":0}]
[null,"2007-02-19",{"$f":"TEXT(IF(DAY([DDate])<8,WEEKDAY([DDate]),\"\"),\"ddd\")","v":""},{"$f":"(WEEKDAY(Table1[[#This Row],[DDate]],2)<=5)*RANDBETWEEN(1000,9999)/100","v":80.89}]
[null,"2007-02-20",{"$f":"TEXT(IF(DAY([DDate])<8,WEEKDAY([DDate]),\"\"),\"ddd\")","v":""},{"$f":"(WEEKDAY(Table1[[#This Row],[DDate]],2)<=5)*RANDBETWEEN(1000,9999)/100","v":96.2}]
[null,"2007-02-21",{"$f":"TEXT(IF(DAY([DDate])<8,WEEKDAY([DDate]),\"\"),\"ddd\")","v":""},{"$f":"(WEEKDAY(Table1[[#This Row],[DDate]],2)<=5)*RANDBETWEEN(1000,9999)/100","v":87.8}]
[null,"2007-02-22",{"$f":"TEXT(IF(DAY([DDate])<8,WEEKDAY([DDate]),\"\"),\"ddd\")","v":""},{"$f":"(WEEKDAY(Table1[[#This Row],[DDate]],2)<=5)*RANDBETWEEN(1000,9999)/100","v":28.3}]
[null,"2007-02-23",{"$f":"TEXT(IF(DAY([DDate])<8,WEEKDAY([DDate]),\"\"),\"ddd\")","v":""},{"$f":"(WEEKDAY(Table1[[#This Row],[DDate]],2)<=5)*RANDBETWEEN(1000,9999)/100","v":24.84}]
[null,"2007-02-24",{"$f":"TEXT(IF(DAY([DDate])<8,WEEKDAY([DDate]),\"\"),\"ddd\")","v":""},{"$f":"(WEEKDAY(Table1[[#This Row],[DDate]],2)<=5)*RANDBETWEEN(1000,9999)/100","v":0}]
[null,"2007-02-25",{"$f":"TEXT(IF(DAY([DDate])<8,WEEKDAY([DDate]),\"\"),\"ddd\")","v":""},{"$f":"(WEEKDAY(Table1[[#This Row],[DDate]],2)<=5)*RANDBETWEEN(1000,9999)/100","v":0}]
[null,"2007-02-26",{"$f":"TEXT(IF(DAY([DDate])<8,WEEKDAY([DDate]),\"\"),\"ddd\")","v":""},{"$f":"(WEEKDAY(Table1[[#This Row],[DDate]],2)<=5)*RANDBETWEEN(1000,9999)/100","v":97.6}]
[null,"2007-02-27",{"$f":"TEXT(IF(DAY([DDate])<8,WEEKDAY([DDate]),\"\"),\"ddd\")","v":""},{"$f":"(WEEKDAY(Table1[[#This Row],[DDate]],2)<=5)*RANDBETWEEN(1000,9999)/100","v":94.6}]
[null,"2007-02-28",{"$f":"TEXT(IF(DAY([DDate])<8,WEEKDAY([DDate]),\"\"),\"ddd\")","v":""},{"$f":"(WEEKDAY(Table1[[#This Row],[DDate]],2)<=5)*RANDBETWEEN(1000,9999)/100","v":68.69}]
[null,"2007-03-01",{"$f":"TEXT(IF(DAY([DDate])<8,WEEKDAY([DDate]),\"\"),\"ddd\")","v":"Thu"},{"$f":"(WEEKDAY(Table1[[#This Row],[DDate]],2)<=5)*RANDBETWEEN(1000,9999)/100","v":37.700000000000003}]
[null,"2007-03-02",{"$f":"TEXT(IF(DAY([DDate])<8,WEEKDAY([DDate]),\"\"),\"ddd\")","v":"Fri"},{"$f":"(WEEKDAY(Table1[[#This Row],[DDate]],2)<=5)*RANDBETWEEN(1000,9999)/100","v":64.319999999999993}]
[null,"2007-03-03",{"$f":"TEXT(IF(DAY([DDate])<8,WEEKDAY([DDate]),\"\"),\"ddd\")","v":"Sat"},{"$f":"(WEEKDAY(Table1[[#This Row],[DDate]],2)<=5)*RANDBETWEEN(1000,9999)/100","v":0}]
[null,"2007-03-04",{"$f":"TEXT(IF(DAY([DDate])<8,WEEKDAY([DDate]),\"\"),\"ddd\")","v":"Sun"},{"$f":"(WEEKDAY(Table1[[#This Row],[DDate]],2)<=5)*RANDBETWEEN(1000,9999)/100","v":0}]
[null,"2007-03-05",{"$f":"TEXT(IF(DAY([DDate])<8,WEEKDAY([DDate]),\"\"),\"ddd\")","v":"Mon"},{"$f":"(WEEKDAY(Table1[[#This Row],[DDate]],2)<=5)*RANDBETWEEN(1000,9999)/100","v":34.11}]
[null,"2007-03-06",{"$f":"TEXT(IF(DAY([DDate])<8,WEEKDAY([DDate]),\"\"),\"ddd\")","v":"Tue"},{"$f":"(WEEKDAY(Table1[[#This Row],[DDate]],2)<=5)*RANDBETWEEN(1000,9999)/100","v":47.42}]
[null,"2007-03-07",{"$f":"TEXT(IF(DAY([DDate])<8,WEEKDAY([DDate]),\"\"),\"ddd\")","v":"Wed"},{"$f":"(WEEKDAY(Table1[[#This Row],[DDate]],2)<=5)*RANDBETWEEN(1000,9999)/100","v":26.69}]
[null,"2007-03-08",{"$f":"TEXT(IF(DAY([DDate])<8,WEEKDAY([DDate]),\"\"),\"ddd\")","v":""},{"$f":"(WEEKDAY(Table1[[#This Row],[DDate]],2)<=5)*RANDBETWEEN(1000,9999)/100","v":95.06}]
[null,"2007-03-09",{"$f":"TEXT(IF(DAY([DDate])<8,WEEKDAY([DDate]),\"\"),\"ddd\")","v":""},{"$f":"(WEEKDAY(Table1[[#This Row],[DDate]],2)<=5)*RANDBETWEEN(1000,9999)/100","v":58.47}]
[null,"2007-03-10",{"$f":"TEXT(IF(DAY([DDate])<8,WEEKDAY([DDate]),\"\"),\"ddd\")","v":""},{"$f":"(WEEKDAY(Table1[[#This Row],[DDate]],2)<=5)*RANDBETWEEN(1000,9999)/100","v":0}]
[null,"2007-03-11",{"$f":"TEXT(IF(DAY([DDate])<8,WEEKDAY([DDate]),\"\"),\"ddd\")","v":""},{"$f":"(WEEKDAY(Table1[[#This Row],[DDate]],2)<=5)*RANDBETWEEN(1000,9999)/100","v":0}]
[null,"2007-03-12",{"$f":"TEXT(IF(DAY([DDate])<8,WEEKDAY([DDate]),\"\"),\"ddd\")","v":""},{"$f":"(WEEKDAY(Table1[[#This Row],[DDate]],2)<=5)*RANDBETWEEN(1000,9999)/100","v":93.24}]
[null,"2007-03-13",{"$f":"TEXT(IF(DAY([DDate])<8,WEEKDAY([DDate]),\"\"),\"ddd\")","v":""},{"$f":"(WEEKDAY(Table1[[#This Row],[DDate]],2)<=5)*RANDBETWEEN(1000,9999)/100","v":17.97}]
[null,"2007-03-14",{"$f":"TEXT(IF(DAY([DDate])<8,WEEKDAY([DDate]),\"\"),\"ddd\")","v":""},{"$f":"(WEEKDAY(Table1[[#This Row],[DDate]],2)<=5)*RANDBETWEEN(1000,9999)/100","v":74.75}]
[null,"2007-03-15",{"$f":"TEXT(IF(DAY([DDate])<8,WEEKDAY([DDate]),\"\"),\"ddd\")","v":""},{"$f":"(WEEKDAY(Table1[[#This Row],[DDate]],2)<=5)*RANDBETWEEN(1000,9999)/100","v":23.88}]
[null,"2007-03-16",{"$f":"TEXT(IF(DAY([DDate])<8,WEEKDAY([DDate]),\"\"),\"ddd\")","v":""},{"$f":"(WEEKDAY(Table1[[#This Row],[DDate]],2)<=5)*RANDBETWEEN(1000,9999)/100","v":93.26}]
[null,"2007-03-17",{"$f":"TEXT(IF(DAY([DDate])<8,WEEKDAY([DDate]),\"\"),\"ddd\")","v":""},{"$f":"(WEEKDAY(Table1[[#This Row],[DDate]],2)<=5)*RANDBETWEEN(1000,9999)/100","v":0}]
[null,"2007-03-18",{"$f":"TEXT(IF(DAY([DDate])<8,WEEKDAY([DDate]),\"\"),\"ddd\")","v":""},{"$f":"(WEEKDAY(Table1[[#This Row],[DDate]],2)<=5)*RANDBETWEEN(1000,9999)/100","v":0}]
[null,"2007-03-19",{"$f":"TEXT(IF(DAY([DDate])<8,WEEKDAY([DDate]),\"\"),\"ddd\")","v":""},{"$f":"(WEEKDAY(Table1[[#This Row],[DDate]],2)<=5)*RANDBETWEEN(1000,9999)/100","v":59.69}]
[null,"2007-03-20",{"$f":"TEXT(IF(DAY([DDate])<8,WEEKDAY([DDate]),\"\"),\"ddd\")","v":""},{"$f":"(WEEKDAY(Table1[[#This Row],[DDate]],2)<=5)*RANDBETWEEN(1000,9999)/100","v":10.84}]
[null,"2007-03-21",{"$f":"TEXT(IF(DAY([DDate])<8,WEEKDAY([DDate]),\"\"),\"ddd\")","v":""},{"$f":"(WEEKDAY(Table1[[#This Row],[DDate]],2)<=5)*RANDBETWEEN(1000,9999)/100","v":80.459999999999994}]
[null,"2007-03-22",{"$f":"TEXT(IF(DAY([DDate])<8,WEEKDAY([DDate]),\"\"),\"ddd\")","v":""},{"$f":"(WEEKDAY(Table1[[#This Row],[DDate]],2)<=5)*RANDBETWEEN(1000,9999)/100","v":13.3}]
[null,"2007-03-23",{"$f":"TEXT(IF(DAY([DDate])<8,WEEKDAY([DDate]),\"\"),\"ddd\")","v":""},{"$f":"(WEEKDAY(Table1[[#This Row],[DDate]],2)<=5)*RANDBETWEEN(1000,9999)/100","v":13.37}]
[null,"2007-03-24",{"$f":"TEXT(IF(DAY([DDate])<8,WEEKDAY([DDate]),\"\"),\"ddd\")","v":""},{"$f":"(WEEKDAY(Table1[[#This Row],[DDate]],2)<=5)*RANDBETWEEN(1000,9999)/100","v":0}]
[null,"2007-03-25",{"$f":"TEXT(IF(DAY([DDate])<8,WEEKDAY([DDate]),\"\"),\"ddd\")","v":""},{"$f":"(WEEKDAY(Table1[[#This Row],[DDate]],2)<=5)*RANDBETWEEN(1000,9999)/100","v":0}]
[null,"2007-03-26",{"$f":"TEXT(IF(DAY([DDate])<8,WEEKDAY([DDate]),\"\"),\"ddd\")","v":""},{"$f":"(WEEKDAY(Table1[[#This Row],[DDate]],2)<=5)*RANDBETWEEN(1000,9999)/100","v":71.56}]
[null,"2007-03-27",{"$f":"TEXT(IF(DAY([DDate])<8,WEEKDAY([DDate]),\"\"),\"ddd\")","v":""},{"$f":"(WEEKDAY(Table1[[#This Row],[DDate]],2)<=5)*RANDBETWEEN(1000,9999)/100","v":52.14}]
[null,"2007-03-28",{"$f":"TEXT(IF(DAY([DDate])<8,WEEKDAY([DDate]),\"\"),\"ddd\")","v":""},{"$f":"(WEEKDAY(Table1[[#This Row],[DDate]],2)<=5)*RANDBETWEEN(1000,9999)/100","v":18.18}]
[null,"2007-03-29",{"$f":"TEXT(IF(DAY([DDate])<8,WEEKDAY([DDate]),\"\"),\"ddd\")","v":""},{"$f":"(WEEKDAY(Table1[[#This Row],[DDate]],2)<=5)*RANDBETWEEN(1000,9999)/100","v":60.71}]
[null,"2007-03-30",{"$f":"TEXT(IF(DAY([DDate])<8,WEEKDAY([DDate]),\"\"),\"ddd\")","v":""},{"$f":"(WEEKDAY(Table1[[#This Row],[DDate]],2)<=5)*RANDBETWEEN(1000,9999)/100","v":60.62}]
[null,"2007-03-31",{"$f":"TEXT(IF(DAY([DDate])<8,WEEKDAY([DDate]),\"\"),\"ddd\")","v":""},{"$f":"(WEEKDAY(Table1[[#This Row],[DDate]],2)<=5)*RANDBETWEEN(1000,9999)/100","v":0}]

{"sheet":"2008","index":2,"n_rows":94,"n_cols":4,"rows_kept":94,"cut":false,"hidden":false,"merged":[]}
[]
[null,"Table2"]
[null,"DDate","DoW","Sales"]
[null,"2008-01-01",{"$f":"TEXT(IF(DAY([DDate])<8,WEEKDAY([DDate]),\"\"),\"ddd\")","v":"Tue"},{"$f":"(WEEKDAY(Table2[[#This Row],[DDate]],2)<=5)*RANDBETWEEN(1000,9999)/100","v":34.979999999999997}]
[null,"2008-01-02",{"$f":"TEXT(IF(DAY([DDate])<8,WEEKDAY([DDate]),\"\"),\"ddd\")","v":"Wed"},{"$f":"(WEEKDAY(Table2[[#This Row],[DDate]],2)<=5)*RANDBETWEEN(1000,9999)/100","v":49.82}]
[null,"2008-01-03",{"$f":"TEXT(IF(DAY([DDate])<8,WEEKDAY([DDate]),\"\"),\"ddd\")","v":"Thu"},{"$f":"(WEEKDAY(Table2[[#This Row],[DDate]],2)<=5)*RANDBETWEEN(1000,9999)/100","v":74.45}]
[null,"2008-01-04",{"$f":"TEXT(IF(DAY([DDate])<8,WEEKDAY([DDate]),\"\"),\"ddd\")","v":"Fri"},{"$f":"(WEEKDAY(Table2[[#This Row],[DDate]],2)<=5)*RANDBETWEEN(1000,9999)/100","v":48.1}]
[null,"2008-01-05",{"$f":"TEXT(IF(DAY([DDate])<8,WEEKDAY([DDate]),\"\"),\"ddd\")","v":"Sat"},{"$f":"(WEEKDAY(Table2[[#This Row],[DDate]],2)<=5)*RANDBETWEEN(1000,9999)/100","v":0}]
[null,"2008-01-06",{"$f":"TEXT(IF(DAY([DDate])<8,WEEKDAY([DDate]),\"\"),\"ddd\")","v":"Sun"},{"$f":"(WEEKDAY(Table2[[#This Row],[DDate]],2)<=5)*RANDBETWEEN(1000,9999)/100","v":0}]
[null,"2008-01-07",{"$f":"TEXT(IF(DAY([DDate])<8,WEEKDAY([DDate]),\"\"),\"ddd\")","v":"Mon"},{"$f":"(WEEKDAY(Table2[[#This Row],[DDate]],2)<=5)*RANDBETWEEN(1000,9999)/100","v":77.430000000000007}]
[null,"2008-01-08",{"$f":"TEXT(IF(DAY([DDate])<8,WEEKDAY([DDate]),\"\"),\"ddd\")","v":""},{"$f":"(WEEKDAY(Table2[[#This Row],[DDate]],2)<=5)*RANDBETWEEN(1000,9999)/100","v":36.31}]
[null,"2008-01-09",{"$f":"TEXT(IF(DAY([DDate])<8,WEEKDAY([DDate]),\"\"),\"ddd\")","v":""},{"$f":"(WEEKDAY(Table2[[#This Row],[DDate]],2)<=5)*RANDBETWEEN(1000,9999)/100","v":90.15}]
[null,"2008-01-10",{"$f":"TEXT(IF(DAY([DDate])<8,WEEKDAY([DDate]),\"\"),\"ddd\")","v":""},{"$f":"(WEEKDAY(Table2[[#This Row],[DDate]],2)<=5)*RANDBETWEEN(1000,9999)/100","v":73.67}]
[null,"2008-01-11",{"$f":"TEXT(IF(DAY([DDate])<8,WEEKDAY([DDate]),\"\"),\"ddd\")","v":""},{"$f":"(WEEKDAY(Table2[[#This Row],[DDate]],2)<=5)*RANDBETWEEN(1000,9999)/100","v":32.380000000000003}]
[null,"2008-01-12",{"$f":"TEXT(IF(DAY([DDate])<8,WEEKDAY([DDate]),\"\"),\"ddd\")","v":""},{"$f":"(WEEKDAY(Table2[[#This Row],[DDate]],2)<=5)*RANDBETWEEN(1000,9999)/100","v":0}]
[null,"2008-01-13",{"$f":"TEXT(IF(DAY([DDate])<8,WEEKDAY([DDate]),\"\"),\"ddd\")","v":""},{"$f":"(WEEKDAY(Table2[[#This Row],[DDate]],2)<=5)*RANDBETWEEN(1000,9999)/100","v":0}]
[null,"2008-01-14",{"$f":"TEXT(IF(DAY([DDate])<8,WEEKDAY([DDate]),\"\"),\"ddd\")","v":""},{"$f":"(WEEKDAY(Table2[[#This Row],[DDate]],2)<=5)*RANDBETWEEN(1000,9999)/100","v":62.42}]
[null,"2008-01-15",{"$f":"TEXT(IF(DAY([DDate])<8,WEEKDAY([DDate]),\"\"),\"ddd\")","v":""},{"$f":"(WEEKDAY(Table2[[#This Row],[DDate]],2)<=5)*RANDBETWEEN(1000,9999)/100","v":57.79}]
[null,"2008-01-16",{"$f":"TEXT(IF(DAY([DDate])<8,WEEKDAY([DDate]),\"\"),\"ddd\")","v":""},{"$f":"(WEEKDAY(Table2[[#This Row],[DDate]],2)<=5)*RANDBETWEEN(1000,9999)/100","v":70.760000000000005}]
[null,"2008-01-17",{"$f":"TEXT(IF(DAY([DDate])<8,WEEKDAY([DDate]),\"\"),\"ddd\")","v":""},{"$f":"(WEEKDAY(Table2[[#This Row],[DDate]],2)<=5)*RANDBETWEEN(1000,9999)/100","v":63.12}]
[null,"2008-01-18",{"$f":"TEXT(IF(DAY([DDate])<8,WEEKDAY([DDate]),\"\"),\"ddd\")","v":""},{"$f":"(WEEKDAY(Table2[[#This Row],[DDate]],2)<=5)*RANDBETWEEN(1000,9999)/100","v":28.78}]
[null,"2008-01-19",{"$f":"TEXT(IF(DAY([DDate])<8,WEEKDAY([DDate]),\"\"),\"ddd\")","v":""},{"$f":"(WEEKDAY(Table2[[#This Row],[DDate]],2)<=5)*RANDBETWEEN(1000,9999)/100","v":0}]
[null,"2008-01-20",{"$f":"TEXT(IF(DAY([DDate])<8,WEEKDAY([DDate]),\"\"),\"ddd\")","v":""},{"$f":"(WEEKDAY(Table2[[#This Row],[DDate]],2)<=5)*RANDBETWEEN(1000,9999)/100","v":0}]
[null,"2008-01-21",{"$f":"TEXT(IF(DAY([DDate])<8,WEEKDAY([DDate]),\"\"),\"ddd\")","v":""},{"$f":"(WEEKDAY(Table2[[#This Row],[DDate]],2)<=5)*RANDBETWEEN(1000,9999)/100","v":89.6}]
[null,"2008-01-22",{"$f":"TEXT(IF(DAY([DDate])<8,WEEKDAY([DDate]),\"\"),\"ddd\")","v":""},{"$f":"(WEEKDAY(Table2[[#This Row],[DDate]],2)<=5)*RANDBETWEEN(1000,9999)/100","v":13.58}]
[null,"2008-01-23",{"$f":"TEXT(IF(DAY([DDate])<8,WEEKDAY([DDate]),\"\"),\"ddd\")","v":""},{"$f":"(WEEKDAY(Table2[[#This Row],[DDate]],2)<=5)*RANDBETWEEN(1000,9999)/100","v":38.049999999999997}]
[null,"2008-01-24",{"$f":"TEXT(IF(DAY([DDate])<8,WEEKDAY([DDate]),\"\"),\"ddd\")","v":""},{"$f":"(WEEKDAY(Table2[[#This Row],[DDate]],2)<=5)*RANDBETWEEN(1000,9999)/100","v":48.26}]
[null,"2008-01-25",{"$f":"TEXT(IF(DAY([DDate])<8,WEEKDAY([DDate]),\"\"),\"ddd\")","v":""},{"$f":"(WEEKDAY(Table2[[#This Row],[DDate]],2)<=5)*RANDBETWEEN(1000,9999)/100","v":19.77}]
[null,"2008-01-26",{"$f":"TEXT(IF(DAY([DDate])<8,WEEKDAY([DDate]),\"\"),\"ddd\")","v":""},{"$f":"(WEEKDAY(Table2[[#This Row],[DDate]],2)<=5)*RANDBETWEEN(1000,9999)/100","v":0}]
[null,"2008-01-27",{"$f":"TEXT(IF(DAY([DDate])<8,WEEKDAY([DDate]),\"\"),\"ddd\")","v":""},{"$f":"(WEEKDAY(Table2[[#This Row],[DDate]],2)<=5)*RANDBETWEEN(1000,9999)/100","v":0}]
[null,"2008-01-28",{"$f":"TEXT(IF(DAY([DDate])<8,WEEKDAY([DDate]),\"\"),\"ddd\")","v":""},{"$f":"(WEEKDAY(Table2[[#This Row],[DDate]],2)<=5)*RANDBETWEEN(1000,9999)/100","v":99.8}]
[null,"2008-01-29",{"$f":"TEXT(IF(DAY([DDate])<8,WEEKDAY([DDate]),\"\"),\"ddd\")","v":""},{"$f":"(WEEKDAY(Table2[[#This Row],[DDate]],2)<=5)*RANDBETWEEN(1000,9999)/100","v":69.34}]
[null,"2008-01-30",{"$f":"TEXT(IF(DAY([DDate])<8,WEEKDAY([DDate]),\"\"),\"ddd\")","v":""},{"$f":"(WEEKDAY(Table2[[#This Row],[DDate]],2)<=5)*RANDBETWEEN(1000,9999)/100","v":93.88}]
[null,"2008-01-31",{"$f":"TEXT(IF(DAY([DDate])<8,WEEKDAY([DDate]),\"\"),\"ddd\")","v":""},{"$f":"(WEEKDAY(Table2[[#This Row],[DDate]],2)<=5)*RANDBETWEEN(1000,9999)/100","v":78.77}]
[null,"2008-02-01",{"$f":"TEXT(IF(DAY([DDate])<8,WEEKDAY([DDate]),\"\"),\"ddd\")","v":"Fri"},{"$f":"(WEEKDAY(Table2[[#This Row],[DDate]],2)<=5)*RANDBETWEEN(1000,9999)/100","v":86.42}]
[null,"2008-02-02",{"$f":"TEXT(IF(DAY([DDate])<8,WEEKDAY([DDate]),\"\"),\"ddd\")","v":"Sat"},{"$f":"(WEEKDAY(Table2[[#This Row],[DDate]],2)<=5)*RANDBETWEEN(1000,9999)/100","v":0}]
[null,"2008-02-03",{"$f":"TEXT(IF(DAY([DDate])<8,WEEKDAY([DDate]),\"\"),\"ddd\")","v":"Sun"},{"$f":"(WEEKDAY(Table2[[#This Row],[DDate]],2)<=5)*RANDBETWEEN(1000,9999)/100","v":0}]
[null,"2008-02-04",{"$f":"TEXT(IF(DAY([DDate])<8,WEEKDAY([DDate]),\"\"),\"ddd\")","v":"Mon"},{"$f":"(WEEKDAY(Table2[[#This Row],[DDate]],2)<=5)*RANDBETWEEN(1000,9999)/100","v":92.28}]
[null,"2008-02-05",{"$f":"TEXT(IF(DAY([DDate])<8,WEEKDAY([DDate]),\"\"),\"ddd\")","v":"Tue"},{"$f":"(WEEKDAY(Table2[[#This Row],[DDate]],2)<=5)*RANDBETWEEN(1000,9999)/100","v":87.46}]
[null,"2008-02-06",{"$f":"TEXT(IF(DAY([DDate])<8,WEEKDAY([DDate]),\"\"),\"ddd\")","v":"Wed"},{"$f":"(WEEKDAY(Table2[[#This Row],[DDate]],2)<=5)*RANDBETWEEN(1000,9999)/100","v":32.51}]
[null,"2008-02-07",{"$f":"TEXT(IF(DAY([DDate])<8,WEEKDAY([DDate]),\"\"),\"ddd\")","v":"Thu"},{"$f":"(WEEKDAY(Table2[[#This Row],[DDate]],2)<=5)*RANDBETWEEN(1000,9999)/100","v":64.05}]
[null,"2008-02-08",{"$f":"TEXT(IF(DAY([DDate])<8,WEEKDAY([DDate]),\"\"),\"ddd\")","v":""},{"$f":"(WEEKDAY(Table2[[#This Row],[DDate]],2)<=5)*RANDBETWEEN(1000,9999)/100","v":82.02}]
[null,"2008-02-09",{"$f":"TEXT(IF(DAY([DDate])<8,WEEKDAY([DDate]),\"\"),\"ddd\")","v":""},{"$f":"(WEEKDAY(Table2[[#This Row],[DDate]],2)<=5)*RANDBETWEEN(1000,9999)/100","v":0}]
[null,"2008-02-10",{"$f":"TEXT(IF(DAY([DDate])<8,WEEKDAY([DDate]),\"\"),\"ddd\")","v":""},{"$f":"(WEEKDAY(Table2[[#This Row],[DDate]],2)<=5)*RANDBETWEEN(1000,9999)/100","v":0}]
[null,"2008-02-11",{"$f":"TEXT(IF(DAY([DDate])<8,WEEKDAY([DDate]),\"\"),\"ddd\")","v":""},{"$f":"(WEEKDAY(Table2[[#This Row],[DDate]],2)<=5)*RANDBETWEEN(1000,9999)/100","v":33.409999999999997}]
[null,"2008-02-12",{"$f":"TEXT(IF(DAY([DDate])<8,WEEKDAY([DDate]),\"\"),\"ddd\")","v":""},{"$f":"(WEEKDAY(Table2[[#This Row],[DDate]],2)<=5)*RANDBETWEEN(1000,9999)/100","v":74.2}]
[null,"2008-02-13",{"$f":"TEXT(IF(DAY([DDate])<8,WEEKDAY([DDate]),\"\"),\"ddd\")","v":""},{"$f":"(WEEKDAY(Table2[[#This Row],[DDate]],2)<=5)*RANDBETWEEN(1000,9999)/100","v":39.880000000000003}]
[null,"2008-02-14",{"$f":"TEXT(IF(DAY([DDate])<8,WEEKDAY([DDate]),\"\"),\"ddd\")","v":""},{"$f":"(WEEKDAY(Table2[[#This Row],[DDate]],2)<=5)*RANDBETWEEN(1000,9999)/100","v":25.42}]
[null,"2008-02-15",{"$f":"TEXT(IF(DAY([DDate])<8,WEEKDAY([DDate]),\"\"),\"ddd\")","v":""},{"$f":"(WEEKDAY(Table2[[#This Row],[DDate]],2)<=5)*RANDBETWEEN(1000,9999)/100","v":25.7}]
[null,"2008-02-16",{"$f":"TEXT(IF(DAY([DDate])<8,WEEKDAY([DDate]),\"\"),\"ddd\")","v":""},{"$f":"(WEEKDAY(Table2[[#This Row],[DDate]],2)<=5)*RANDBETWEEN(1000,9999)/100","v":0}]
[null,"2008-02-17",{"$f":"TEXT(IF(DAY([DDate])<8,WEEKDAY([DDate]),\"\"),\"ddd\")","v":""},{"$f":"(WEEKDAY(Table2[[#This Row],[DDate]],2)<=5)*RANDBETWEEN(1000,9999)/100","v":0}]
[null,"2008-02-18",{"$f":"TEXT(IF(DAY([DDate])<8,WEEKDAY([DDate]),\"\"),\"ddd\")","v":""},{"$f":"(WEEKDAY(Table2[[#This Row],[DDate]],2)<=5)*RANDBETWEEN(1000,9999)/100","v":43.21}]
[null,"2008-02-19",{"$f":"TEXT(IF(DAY([DDate])<8,WEEKDAY([DDate]),\"\"),\"ddd\")","v":""},{"$f":"(WEEKDAY(Table2[[#This Row],[DDate]],2)<=5)*RANDBETWEEN(1000,9999)/100","v":87.26}]
[null,"2008-02-20",{"$f":"TEXT(IF(DAY([DDate])<8,WEEKDAY([DDate]),\"\"),\"ddd\")","v":""},{"$f":"(WEEKDAY(Table2[[#This Row],[DDate]],2)<=5)*RANDBETWEEN(1000,9999)/100","v":86.81}]
[null,"2008-02-21",{"$f":"TEXT(IF(DAY([DDate])<8,WEEKDAY([DDate]),\"\"),\"ddd\")","v":""},{"$f":"(WEEKDAY(Table2[[#This Row],[DDate]],2)<=5)*RANDBETWEEN(1000,9999)/100","v":25.07}]
[null,"2008-02-22",{"$f":"TEXT(IF(DAY([DDate])<8,WEEKDAY([DDate]),\"\"),\"ddd\")","v":""},{"$f":"(WEEKDAY(Table2[[#This Row],[DDate]],2)<=5)*RANDBETWEEN(1000,9999)/100","v":22.98}]
[null,"2008-02-23",{"$f":"TEXT(IF(DAY([DDate])<8,WEEKDAY([DDate]),\"\"),\"ddd\")","v":""},{"$f":"(WEEKDAY(Table2[[#This Row],[DDate]],2)<=5)*RANDBETWEEN(1000,9999)/100","v":0}]
[null,"2008-02-24",{"$f":"TEXT(IF(DAY([DDate])<8,WEEKDAY([DDate]),\"\"),\"ddd\")","v":""},{"$f":"(WEEKDAY(Table2[[#This Row],[DDate]],2)<=5)*RANDBETWEEN(1000,9999)/100","v":0}]
[null,"2008-02-25",{"$f":"TEXT(IF(DAY([DDate])<8,WEEKDAY([DDate]),\"\"),\"ddd\")","v":""},{"$f":"(WEEKDAY(Table2[[#This Row],[DDate]],2)<=5)*RANDBETWEEN(1000,9999)/100","v":96.09}]
[null,"2008-02-26",{"$f":"TEXT(IF(DAY([DDate])<8,WEEKDAY([DDate]),\"\"),\"ddd\")","v":""},{"$f":"(WEEKDAY(Table2[[#This Row],[DDate]],2)<=5)*RANDBETWEEN(1000,9999)/100","v":10.52}]
[null,"2008-02-27",{"$f":"TEXT(IF(DAY([DDate])<8,WEEKDAY([DDate]),\"\"),\"ddd\")","v":""},{"$f":"(WEEKDAY(Table2[[#This Row],[DDate]],2)<=5)*RANDBETWEEN(1000,9999)/100","v":54.48}]
[null,"2008-02-28",{"$f":"TEXT(IF(DAY([DDate])<8,WEEKDAY([DDate]),\"\"),\"ddd\")","v":""},{"$f":"(WEEKDAY(Table2[[#This Row],[DDate]],2)<=5)*RANDBETWEEN(1000,9999)/100","v":44.92}]
[null,"2008-02-29",{"$f":"TEXT(IF(DAY([DDate])<8,WEEKDAY([DDate]),\"\"),\"ddd\")","v":""},{"$f":"(WEEKDAY(Table2[[#This Row],[DDate]],2)<=5)*RANDBETWEEN(1000,9999)/100","v":61.41}]
[null,"2008-03-01",{"$f":"TEXT(IF(DAY([DDate])<8,WEEKDAY([DDate]),\"\"),\"ddd\")","v":"Sat"},{"$f":"(WEEKDAY(Table2[[#This Row],[DDate]],2)<=5)*RANDBETWEEN(1000,9999)/100","v":0}]
[null,"2008-03-02",{"$f":"TEXT(IF(DAY([DDate])<8,WEEKDAY([DDate]),\"\"),\"ddd\")","v":"Sun"},{"$f":"(WEEKDAY(Table2[[#This Row],[DDate]],2)<=5)*RANDBETWEEN(1000,9999)/100","v":0}]
[null,"2008-03-03",{"$f":"TEXT(IF(DAY([DDate])<8,WEEKDAY([DDate]),\"\"),\"ddd\")","v":"Mon"},{"$f":"(WEEKDAY(Table2[[#This Row],[DDate]],2)<=5)*RANDBETWEEN(1000,9999)/100","v":69.27}]
[null,"2008-03-04",{"$f":"TEXT(IF(DAY([DDate])<8,WEEKDAY([DDate]),\"\"),\"ddd\")","v":"Tue"},{"$f":"(WEEKDAY(Table2[[#This Row],[DDate]],2)<=5)*RANDBETWEEN(1000,9999)/100","v":83.71}]
[null,"2008-03-05",{"$f":"TEXT(IF(DAY([DDate])<8,WEEKDAY([DDate]),\"\"),\"ddd\")","v":"Wed"},{"$f":"(WEEKDAY(Table2[[#This Row],[DDate]],2)<=5)*RANDBETWEEN(1000,9999)/100","v":38.82}]
[null,"2008-03-06",{"$f":"TEXT(IF(DAY([DDate])<8,WEEKDAY([DDate]),\"\"),\"ddd\")","v":"Thu"},{"$f":"(WEEKDAY(Table2[[#This Row],[DDate]],2)<=5)*RANDBETWEEN(1000,9999)/100","v":14.15}]
[null,"2008-03-07",{"$f":"TEXT(IF(DAY([DDate])<8,WEEKDAY([DDate]),\"\"),\"ddd\")","v":"Fri"},{"$f":"(WEEKDAY(Table2[[#This Row],[DDate]],2)<=5)*RANDBETWEEN(1000,9999)/100","v":97.43}]
[null,"2008-03-08",{"$f":"TEXT(IF(DAY([DDate])<8,WEEKDAY([DDate]),\"\"),\"ddd\")","v":""},{"$f":"(WEEKDAY(Table2[[#This Row],[DDate]],2)<=5)*RANDBETWEEN(1000,9999)/100","v":0}]
[null,"2008-03-09",{"$f":"TEXT(IF(DAY([DDate])<8,WEEKDAY([DDate]),\"\"),\"ddd\")","v":""},{"$f":"(WEEKDAY(Table2[[#This Row],[DDate]],2)<=5)*RANDBETWEEN(1000,9999)/100","v":0}]
[null,"2008-03-10",{"$f":"TEXT(IF(DAY([DDate])<8,WEEKDAY([DDate]),\"\"),\"ddd\")","v":""},{"$f":"(WEEKDAY(Table2[[#This Row],[DDate]],2)<=5)*RANDBETWEEN(1000,9999)/100","v":78.64}]
[null,"2008-03-11",{"$f":"TEXT(IF(DAY([DDate])<8,WEEKDAY([DDate]),\"\"),\"ddd\")","v":""},{"$f":"(WEEKDAY(Table2[[#This Row],[DDate]],2)<=5)*RANDBETWEEN(1000,9999)/100","v":37.549999999999997}]
[null,"2008-03-12",{"$f":"TEXT(IF(DAY([DDate])<8,WEEKDAY([DDate]),\"\"),\"ddd\")","v":""},{"$f":"(WEEKDAY(Table2[[#This Row],[DDate]],2)<=5)*RANDBETWEEN(1000,9999)/100","v":65.53}]
[null,"2008-03-13",{"$f":"TEXT(IF(DAY([DDate])<8,WEEKDAY([DDate]),\"\"),\"ddd\")","v":""},{"$f":"(WEEKDAY(Table2[[#This Row],[DDate]],2)<=5)*RANDBETWEEN(1000,9999)/100","v":14.02}]
[null,"2008-03-14",{"$f":"TEXT(IF(DAY([DDate])<8,WEEKDAY([DDate]),\"\"),\"ddd\")","v":""},{"$f":"(WEEKDAY(Table2[[#This Row],[DDate]],2)<=5)*RANDBETWEEN(1000,9999)/100","v":99.58}]
[null,"2008-03-15",{"$f":"TEXT(IF(DAY([DDate])<8,WEEKDAY([DDate]),\"\"),\"ddd\")","v":""},{"$f":"(WEEKDAY(Table2[[#This Row],[DDate]],2)<=5)*RANDBETWEEN(1000,9999)/100","v":0}]
[null,"2008-03-16",{"$f":"TEXT(IF(DAY([DDate])<8,WEEKDAY([DDate]),\"\"),\"ddd\")","v":""},{"$f":"(WEEKDAY(Table2[[#This Row],[DDate]],2)<=5)*RANDBETWEEN(1000,9999)/100","v":0}]
[null,"2008-03-17",{"$f":"TEXT(IF(DAY([DDate])<8,WEEKDAY([DDate]),\"\"),\"ddd\")","v":""},{"$f":"(WEEKDAY(Table2[[#This Row],[DDate]],2)<=5)*RANDBETWEEN(1000,9999)/100","v":22.24}]
[null,"2008-03-18",{"$f":"TEXT(IF(DAY([DDate])<8,WEEKDAY([DDate]),\"\"),\"ddd\")","v":""},{"$f":"(WEEKDAY(Table2[[#This Row],[DDate]],2)<=5)*RANDBETWEEN(1000,9999)/100","v":56.67}]
[null,"2008-03-19",{"$f":"TEXT(IF(DAY([DDate])<8,WEEKDAY([DDate]),\"\"),\"ddd\")","v":""},{"$f":"(WEEKDAY(Table2[[#This Row],[DDate]],2)<=5)*RANDBETWEEN(1000,9999)/100","v":32.08}]
[null,"2008-03-20",{"$f":"TEXT(IF(DAY([DDate])<8,WEEKDAY([DDate]),\"\"),\"ddd\")","v":""},{"$f":"(WEEKDAY(Table2[[#This Row],[DDate]],2)<=5)*RANDBETWEEN(1000,9999)/100","v":75.709999999999994}]
[null,"2008-03-21",{"$f":"TEXT(IF(DAY([DDate])<8,WEEKDAY([DDate]),\"\"),\"ddd\")","v":""},{"$f":"(WEEKDAY(Table2[[#This Row],[DDate]],2)<=5)*RANDBETWEEN(1000,9999)/100","v":25.74}]
[null,"2008-03-22",{"$f":"TEXT(IF(DAY([DDate])<8,WEEKDAY([DDate]),\"\"),\"ddd\")","v":""},{"$f":"(WEEKDAY(Table2[[#This Row],[DDate]],2)<=5)*RANDBETWEEN(1000,9999)/100","v":0}]
[null,"2008-03-23",{"$f":"TEXT(IF(DAY([DDate])<8,WEEKDAY([DDate]),\"\"),\"ddd\")","v":""},{"$f":"(WEEKDAY(Table2[[#This Row],[DDate]],2)<=5)*RANDBETWEEN(1000,9999)/100","v":0}]
[null,"2008-03-24",{"$f":"TEXT(IF(DAY([DDate])<8,WEEKDAY([DDate]),\"\"),\"ddd\")","v":""},{"$f":"(WEEKDAY(Table2[[#This Row],[DDate]],2)<=5)*RANDBETWEEN(1000,9999)/100","v":89.69}]
[null,"2008-03-25",{"$f":"TEXT(IF(DAY([DDate])<8,WEEKDAY([DDate]),\"\"),\"ddd\")","v":""},{"$f":"(WEEKDAY(Table2[[#This Row],[DDate]],2)<=5)*RANDBETWEEN(1000,9999)/100","v":77.94}]
[null,"2008-03-26",{"$f":"TEXT(IF(DAY([DDate])<8,WEEKDAY([DDate]),\"\"),\"ddd\")","v":""},{"$f":"(WEEKDAY(Table2[[#This Row],[DDate]],2)<=5)*RANDBETWEEN(1000,9999)/100","v":85.91}]
[null,"2008-03-27",{"$f":"TEXT(IF(DAY([DDate])<8,WEEKDAY([DDate]),\"\"),\"ddd\")","v":""},{"$f":"(WEEKDAY(Table2[[#This Row],[DDate]],2)<=5)*RANDBETWEEN(1000,9999)/100","v":77.5}]
[null,"2008-03-28",{"$f":"TEXT(IF(DAY([DDate])<8,WEEKDAY([DDate]),\"\"),\"ddd\")","v":""},{"$f":"(WEEKDAY(Table2[[#This Row],[DDate]],2)<=5)*RANDBETWEEN(1000,9999)/100","v":85.42}]
[null,"2008-03-29",{"$f":"TEXT(IF(DAY([DDate])<8,WEEKDAY([DDate]),\"\"),\"ddd\")","v":""},{"$f":"(WEEKDAY(Table2[[#This Row],[DDate]],2)<=5)*RANDBETWEEN(1000,9999)/100","v":0}]
[null,"2008-03-30",{"$f":"TEXT(IF(DAY([DDate])<8,WEEKDAY([DDate]),\"\"),\"ddd\")","v":""},{"$f":"(WEEKDAY(Table2[[#This Row],[DDate]],2)<=5)*RANDBETWEEN(1000,9999)/100","v":0}]
[null,"2008-03-31",{"$f":"TEXT(IF(DAY([DDate])<8,WEEKDAY([DDate]),\"\"),\"ddd\")","v":""},{"$f":"(WEEKDAY(Table2[[#This Row],[DDate]],2)<=5)*RANDBETWEEN(1000,9999)/100","v":18.059999999999999}]

{"sheet":"2009","index":3,"n_rows":93,"n_cols":4,"rows_kept":93,"cut":false,"hidden":false,"merged":[]}
[]
[null,"Table3"]
[null,"DDate","DoW","Sales"]
[null,"2009-01-01",{"$f":"TEXT(IF(DAY([DDate])<8,WEEKDAY([DDate]),\"\"),\"ddd\")","v":"Thu"},{"$f":"(WEEKDAY(Table3[[#This Row],[DDate]],2)<=5)*RANDBETWEEN(1000,9999)/100","v":29.5}]
[null,"2009-01-02",{"$f":"TEXT(IF(DAY([DDate])<8,WEEKDAY([DDate]),\"\"),\"ddd\")","v":"Fri"},{"$f":"(WEEKDAY(Table3[[#This Row],[DDate]],2)<=5)*RANDBETWEEN(1000,9999)/100","v":55.25}]
[null,"2009-01-03",{"$f":"TEXT(IF(DAY([DDate])<8,WEEKDAY([DDate]),\"\"),\"ddd\")","v":"Sat"},{"$f":"(WEEKDAY(Table3[[#This Row],[DDate]],2)<=5)*RANDBETWEEN(1000,9999)/100","v":0}]
[null,"2009-01-04",{"$f":"TEXT(IF(DAY([DDate])<8,WEEKDAY([DDate]),\"\"),\"ddd\")","v":"Sun"},{"$f":"(WEEKDAY(Table3[[#This Row],[DDate]],2)<=5)*RANDBETWEEN(1000,9999)/100","v":0}]
[null,"2009-01-05",{"$f":"TEXT(IF(DAY([DDate])<8,WEEKDAY([DDate]),\"\"),\"ddd\")","v":"Mon"},{"$f":"(WEEKDAY(Table3[[#This Row],[DDate]],2)<=5)*RANDBETWEEN(1000,9999)/100","v":76.06}]
[null,"2009-01-06",{"$f":"TEXT(IF(DAY([DDate])<8,WEEKDAY([DDate]),\"\"),\"ddd\")","v":"Tue"},{"$f":"(WEEKDAY(Table3[[#This Row],[DDate]],2)<=5)*RANDBETWEEN(1000,9999)/100","v":83.04}]
[null,"2009-01-07",{"$f":"TEXT(IF(DAY([DDate])<8,WEEKDAY([DDate]),\"\"),\"ddd\")","v":"Wed"},{"$f":"(WEEKDAY(Table3[[#This Row],[DDate]],2)<=5)*RANDBETWEEN(1000,9999)/100","v":52.34}]
[null,"2009-01-08",{"$f":"TEXT(IF(DAY([DDate])<8,WEEKDAY([DDate]),\"\"),\"ddd\")","v":""},{"$f":"(WEEKDAY(Table3[[#This Row],[DDate]],2)<=5)*RANDBETWEEN(1000,9999)/100","v":44.12}]
[null,"2009-01-09",{"$f":"TEXT(IF(DAY([DDate])<8,WEEKDAY([DDate]),\"\"),\"ddd\")","v":""},{"$f":"(WEEKDAY(Table3[[#This Row],[DDate]],2)<=5)*RANDBETWEEN(1000,9999)/100","v":62.57}]
[null,"2009-01-10",{"$f":"TEXT(IF(DAY([DDate])<8,WEEKDAY([DDate]),\"\"),\"ddd\")","v":""},{"$f":"(WEEKDAY(Table3[[#This Row],[DDate]],2)<=5)*RANDBETWEEN(1000,9999)/100","v":0}]
[null,"2009-01-11",{"$f":"TEXT(IF(DAY([DDate])<8,WEEKDAY([DDate]),\"\"),\"ddd\")","v":""},{"$f":"(WEEKDAY(Table3[[#This Row],[DDate]],2)<=5)*RANDBETWEEN(1000,9999)/100","v":0}]
[null,"2009-01-12",{"$f":"TEXT(IF(DAY([DDate])<8,WEEKDAY([DDate]),\"\"),\"ddd\")","v":""},{"$f":"(WEEKDAY(Table3[[#This Row],[DDate]],2)<=5)*RANDBETWEEN(1000,9999)/100","v":59.23}]
[null,"2009-01-13",{"$f":"TEXT(IF(DAY([DDate])<8,WEEKDAY([DDate]),\"\"),\"ddd\")","v":""},{"$f":"(WEEKDAY(Table3[[#This Row],[DDate]],2)<=5)*RANDBETWEEN(1000,9999)/100","v":12.72}]
[null,"2009-01-14",{"$f":"TEXT(IF(DAY([DDate])<8,WEEKDAY([DDate]),\"\"),\"ddd\")","v":""},{"$f":"(WEEKDAY(Table3[[#This Row],[DDate]],2)<=5)*RANDBETWEEN(1000,9999)/100","v":47.82}]
[null,"2009-01-15",{"$f":"TEXT(IF(DAY([DDate])<8,WEEKDAY([DDate]),\"\"),\"ddd\")","v":""},{"$f":"(WEEKDAY(Table3[[#This Row],[DDate]],2)<=5)*RANDBETWEEN(1000,9999)/100","v":60.74}]
[null,"2009-01-16",{"$f":"TEXT(IF(DAY([DDate])<8,WEEKDAY([DDate]),\"\"),\"ddd\")","v":""},{"$f":"(WEEKDAY(Table3[[#This Row],[DDate]],2)<=5)*RANDBETWEEN(1000,9999)/100","v":68.86}]
[null,"2009-01-17",{"$f":"TEXT(IF(DAY([DDate])<8,WEEKDAY([DDate]),\"\"),\"ddd\")","v":""},{"$f":"(WEEKDAY(Table3[[#This Row],[DDate]],2)<=5)*RANDBETWEEN(1000,9999)/100","v":0}]
[null,"2009-01-18",{"$f":"TEXT(IF(DAY([DDate])<8,WEEKDAY([DDate]),\"\"),\"ddd\")","v":""},{"$f":"(WEEKDAY(Table3[[#This Row],[DDate]],2)<=5)*RANDBETWEEN(1000,9999)/100","v":0}]
[null,"2009-01-19",{"$f":"TEXT(IF(DAY([DDate])<8,WEEKDAY([DDate]),\"\"),\"ddd\")","v":""},{"$f":"(WEEKDAY(Table3[[#This Row],[DDate]],2)<=5)*RANDBETWEEN(1000,9999)/100","v":51.42}]
[null,"2009-01-20",{"$f":"TEXT(IF(DAY([DDate])<8,WEEKDAY([DDate]),\"\"),\"ddd\")","v":""},{"$f":"(WEEKDAY(Table3[[#This Row],[DDate]],2)<=5)*RANDBETWEEN(1000,9999)/100","v":56.13}]
[null,"2009-01-21",{"$f":"TEXT(IF(DAY([DDate])<8,WEEKDAY([DDate]),\"\"),\"ddd\")","v":""},{"$f":"(WEEKDAY(Table3[[#This Row],[DDate]],2)<=5)*RANDBETWEEN(1000,9999)/100","v":48.2}]
[null,"2009-01-22",{"$f":"TEXT(IF(DAY([DDate])<8,WEEKDAY([DDate]),\"\"),\"ddd\")","v":""},{"$f":"(WEEKDAY(Table3[[#This Row],[DDate]],2)<=5)*RANDBETWEEN(1000,9999)/100","v":44.93}]
[null,"2009-01-23",{"$f":"TEXT(IF(DAY([DDate])<8,WEEKDAY([DDate]),\"\"),\"ddd\")","v":""},{"$f":"(WEEKDAY(Table3[[#This Row],[DDate]],2)<=5)*RANDBETWEEN(1000,9999)/100","v":95.37}]
[null,"2009-01-24",{"$f":"TEXT(IF(DAY([DDate])<8,WEEKDAY([DDate]),\"\"),\"ddd\")","v":""},{"$f":"(WEEKDAY(Table3[[#This Row],[DDate]],2)<=5)*RANDBETWEEN(1000,9999)/100","v":0}]
[null,"2009-01-25",{"$f":"TEXT(IF(DAY([DDate])<8,WEEKDAY([DDate]),\"\"),\"ddd\")","v":""},{"$f":"(WEEKDAY(Table3[[#This Row],[DDate]],2)<=5)*RANDBETWEEN(1000,9999)/100","v":0}]
[null,"2009-01-26",{"$f":"TEXT(IF(DAY([DDate])<8,WEEKDAY([DDate]),\"\"),\"ddd\")","v":""},{"$f":"(WEEKDAY(Table3[[#This Row],[DDate]],2)<=5)*RANDBETWEEN(1000,9999)/100","v":96.38}]
[null,"2009-01-27",{"$f":"TEXT(IF(DAY([DDate])<8,WEEKDAY([DDate]),\"\"),\"ddd\")","v":""},{"$f":"(WEEKDAY(Table3[[#This Row],[DDate]],2)<=5)*RANDBETWEEN(1000,9999)/100","v":65.16}]
[null,"2009-01-28",{"$f":"TEXT(IF(DAY([DDate])<8,WEEKDAY([DDate]),\"\"),\"ddd\")","v":""},{"$f":"(WEEKDAY(Table3[[#This Row],[DDate]],2)<=5)*RANDBETWEEN(1000,9999)/100","v":37.39}]
[null,"2009-01-29",{"$f":"TEXT(IF(DAY([DDate])<8,WEEKDAY([DDate]),\"\"),\"ddd\")","v":""},{"$f":"(WEEKDAY(Table3[[#This Row],[DDate]],2)<=5)*RANDBETWEEN(1000,9999)/100","v":86.67}]
[null,"2009-01-30",{"$f":"TEXT(IF(DAY([DDate])<8,WEEKDAY([DDate]),\"\"),\"ddd\")","v":""},{"$f":"(WEEKDAY(Table3[[#This Row],[DDate]],2)<=5)*RANDBETWEEN(1000,9999)/100","v":91.77}]
[null,"2009-01-31",{"$f":"TEXT(IF(DAY([DDate])<8,WEEKDAY([DDate]),\"\"),\"ddd\")","v":""},{"$f":"(WEEKDAY(Table3[[#This Row],[DDate]],2)<=5)*RANDBETWEEN(1000,9999)/100","v":0}]
[null,"2009-02-01",{"$f":"TEXT(IF(DAY([DDate])<8,WEEKDAY([DDate]),\"\"),\"ddd\")","v":"Sun"},{"$f":"(WEEKDAY(Table3[[#This Row],[DDate]],2)<=5)*RANDBETWEEN(1000,9999)/100","v":0}]
[null,"2009-02-02",{"$f":"TEXT(IF(DAY([DDate])<8,WEEKDAY([DDate]),\"\"),\"ddd\")","v":"Mon"},{"$f":"(WEEKDAY(Table3[[#This Row],[DDate]],2)<=5)*RANDBETWEEN(1000,9999)/100","v":90.73}]
[null,"2009-02-03",{"$f":"TEXT(IF(DAY([DDate])<8,WEEKDAY([DDate]),\"\"),\"ddd\")","v":"Tue"},{"$f":"(WEEKDAY(Table3[[#This Row],[DDate]],2)<=5)*RANDBETWEEN(1000,9999)/100","v":16.54}]
[null,"2009-02-04",{"$f":"TEXT(IF(DAY([DDate])<8,WEEKDAY([DDate]),\"\"),\"ddd\")","v":"Wed"},{"$f":"(WEEKDAY(Table3[[#This Row],[DDate]],2)<=5)*RANDBETWEEN(1000,9999)/100","v":19.82}]
[null,"2009-02-05",{"$f":"TEXT(IF(DAY([DDate])<8,WEEKDAY([DDate]),\"\"),\"ddd\")","v":"Thu"},{"$f":"(WEEKDAY(Table3[[#This Row],[DDate]],2)<=5)*RANDBETWEEN(1000,9999)/100","v":42.53}]
[null,"2009-02-06",{"$f":"TEXT(IF(DAY([DDate])<8,WEEKDAY([DDate]),\"\"),\"ddd\")","v":"Fri"},{"$f":"(WEEKDAY(Table3[[#This Row],[DDate]],2)<=5)*RANDBETWEEN(1000,9999)/100","v":71.33}]
[null,"2009-02-07",{"$f":"TEXT(IF(DAY([DDate])<8,WEEKDAY([DDate]),\"\"),\"ddd\")","v":"Sat"},{"$f":"(WEEKDAY(Table3[[#This Row],[DDate]],2)<=5)*RANDBETWEEN(1000,9999)/100","v":0}]
[null,"2009-02-08",{"$f":"TEXT(IF(DAY([DDate])<8,WEEKDAY([DDate]),\"\"),\"ddd\")","v":""},{"$f":"(WEEKDAY(Table3[[#This Row],[DDate]],2)<=5)*RANDBETWEEN(1000,9999)/100","v":0}]
[null,"2009-02-09",{"$f":"TEXT(IF(DAY([DDate])<8,WEEKDAY([DDate]),\"\"),\"ddd\")","v":""},{"$f":"(WEEKDAY(Table3[[#This Row],[DDate]],2)<=5)*RANDBETWEEN(1000,9999)/100","v":43.64}]
[null,"2009-02-10",{"$f":"TEXT(IF(DAY([DDate])<8,WEEKDAY([DDate]),\"\"),\"ddd\")","v":""},{"$f":"(WEEKDAY(Table3[[#This Row],[DDate]],2)<=5)*RANDBETWEEN(1000,9999)/100","v":78.34}]
[null,"2009-02-11",{"$f":"TEXT(IF(DAY([DDate])<8,WEEKDAY([DDate]),\"\"),\"ddd\")","v":""},{"$f":"(WEEKDAY(Table3[[#This Row],[DDate]],2)<=5)*RANDBETWEEN(1000,9999)/100","v":68.98}]
[null,"2009-02-12",{"$f":"TEXT(IF(DAY([DDate])<8,WEEKDAY([DDate]),\"\"),\"ddd\")","v":""},{"$f":"(WEEKDAY(Table3[[#This Row],[DDate]],2)<=5)*RANDBETWEEN(1000,9999)/100","v":94.28}]
[null,"2009-02-13",{"$f":"TEXT(IF(DAY([DDate])<8,WEEKDAY([DDate]),\"\"),\"ddd\")","v":""},{"$f":"(WEEKDAY(Table3[[#This Row],[DDate]],2)<=5)*RANDBETWEEN(1000,9999)/100","v":59.36}]
[null,"2009-02-14",{"$f":"TEXT(IF(DAY([DDate])<8,WEEKDAY([DDate]),\"\"),\"ddd\")","v":""},{"$f":"(WEEKDAY(Table3[[#This Row],[DDate]],2)<=5)*RANDBETWEEN(1000,9999)/100","v":0}]
[null,"2009-02-15",{"$f":"TEXT(IF(DAY([DDate])<8,WEEKDAY([DDate]),\"\"),\"ddd\")","v":""},{"$f":"(WEEKDAY(Table3[[#This Row],[DDate]],2)<=5)*RANDBETWEEN(1000,9999)/100","v":0}]
[null,"2009-02-16",{"$f":"TEXT(IF(DAY([DDate])<8,WEEKDAY([DDate]),\"\"),\"ddd\")","v":""},{"$f":"(WEEKDAY(Table3[[#This Row],[DDate]],2)<=5)*RANDBETWEEN(1000,9999)/100","v":31}]
[null,"2009-02-17",{"$f":"TEXT(IF(DAY([DDate])<8,WEEKDAY([DDate]),\"\"),\"ddd\")","v":""},{"$f":"(WEEKDAY(Table3[[#This Row],[DDate]],2)<=5)*RANDBETWEEN(1000,9999)/100","v":39}]
[null,"2009-02-18",{"$f":"TEXT(IF(DAY([DDate])<8,WEEKDAY([DDate]),\"\"),\"ddd\")","v":""},{"$f":"(WEEKDAY(Table3[[#This Row],[DDate]],2)<=5)*RANDBETWEEN(1000,9999)/100","v":95.99}]
[null,"2009-02-19",{"$f":"TEXT(IF(DAY([DDate])<8,WEEKDAY([DDate]),\"\"),\"ddd\")","v":""},{"$f":"(WEEKDAY(Table3[[#This Row],[DDate]],2)<=5)*RANDBETWEEN(1000,9999)/100","v":58.56}]
[null,"2009-02-20",{"$f":"TEXT(IF(DAY([DDate])<8,WEEKDAY([DDate]),\"\"),\"ddd\")","v":""},{"$f":"(WEEKDAY(Table3[[#This Row],[DDate]],2)<=5)*RANDBETWEEN(1000,9999)/100","v":96.88}]
[null,"2009-02-21",{"$f":"TEXT(IF(DAY([DDate])<8,WEEKDAY([DDate]),\"\"),\"ddd\")","v":""},{"$f":"(WEEKDAY(Table3[[#This Row],[DDate]],2)<=5)*RANDBETWEEN(1000,9999)/100","v":0}]
[null,"2009-02-22",{"$f":"TEXT(IF(DAY([DDate])<8,WEEKDAY([DDate]),\"\"),\"ddd\")","v":""},{"$f":"(WEEKDAY(Table3[[#This Row],[DDate]],2)<=5)*RANDBETWEEN(1000,9999)/100","v":0}]
[null,"2009-02-23",{"$f":"TEXT(IF(DAY([DDate])<8,WEEKDAY([DDate]),\"\"),\"ddd\")","v":""},{"$f":"(WEEKDAY(Table3[[#This Row],[DDate]],2)<=5)*RANDBETWEEN(1000,9999)/100","v":97.02}]
[null,"2009-02-24",{"$f":"TEXT(IF(DAY([DDate])<8,WEEKDAY([DDate]),\"\"),\"ddd\")","v":""},{"$f":"(WEEKDAY(Table3[[#This Row],[DDate]],2)<=5)*RANDBETWEEN(1000,9999)/100","v":11.5}]
[null,"2009-02-25",{"$f":"TEXT(IF(DAY([DDate])<8,WEEKDAY([DDate]),\"\"),\"ddd\")","v":""},{"$f":"(WEEKDAY(Table3[[#This Row],[DDate]],2)<=5)*RANDBETWEEN(1000,9999)/100","v":24.51}]
[null,"2009-02-26",{"$f":"TEXT(IF(DAY([DDate])<8,WEEKDAY([DDate]),\"\"),\"ddd\")","v":""},{"$f":"(WEEKDAY(Table3[[#This Row],[DDate]],2)<=5)*RANDBETWEEN(1000,9999)/100","v":30.71}]
[null,"2009-02-27",{"$f":"TEXT(IF(DAY([DDate])<8,WEEKDAY([DDate]),\"\"),\"ddd\")","v":""},{"$f":"(WEEKDAY(Table3[[#This Row],[DDate]],2)<=5)*RANDBETWEEN(1000,9999)/100","v":17.46}]
[null,"2009-02-28",{"$f":"TEXT(IF(DAY([DDate])<8,WEEKDAY([DDate]),\"\"),\"ddd\")","v":""},{"$f":"(WEEKDAY(Table3[[#This Row],[DDate]],2)<=5)*RANDBETWEEN(1000,9999)/100","v":0}]
[null,"2009-03-01",{"$f":"TEXT(IF(DAY([DDate])<8,WEEKDAY([DDate]),\"\"),\"ddd\")","v":"Sun"},{"$f":"(WEEKDAY(Table3[[#This Row],[DDate]],2)<=5)*RANDBETWEEN(1000,9999)/100","v":0}]
[null,"2009-03-02",{"$f":"TEXT(IF(DAY([DDate])<8,WEEKDAY([DDate]),\"\"),\"ddd\")","v":"Mon"},{"$f":"(WEEKDAY(Table3[[#This Row],[DDate]],2)<=5)*RANDBETWEEN(1000,9999)/100","v":75.48}]
[null,"2009-03-03",{"$f":"TEXT(IF(DAY([DDate])<8,WEEKDAY([DDate]),\"\"),\"ddd\")","v":"Tue"},{"$f":"(WEEKDAY(Table3[[#This Row],[DDate]],2)<=5)*RANDBETWEEN(1000,9999)/100","v":32.94}]
[null,"2009-03-04",{"$f":"TEXT(IF(DAY([DDate])<8,WEEKDAY([DDate]),\"\"),\"ddd\")","v":"Wed"},{"$f":"(WEEKDAY(Table3[[#This Row],[DDate]],2)<=5)*RANDBETWEEN(1000,9999)/100","v":35.92}]
[null,"2009-03-05",{"$f":"TEXT(IF(DAY([DDate])<8,WEEKDAY([DDate]),\"\"),\"ddd\")","v":"Thu"},{"$f":"(WEEKDAY(Table3[[#This Row],[DDate]],2)<=5)*RANDBETWEEN(1000,9999)/100","v":74.25}]
[null,"2009-03-06",{"$f":"TEXT(IF(DAY([DDate])<8,WEEKDAY([DDate]),\"\"),\"ddd\")","v":"Fri"},{"$f":"(WEEKDAY(Table3[[#This Row],[DDate]],2)<=5)*RANDBETWEEN(1000,9999)/100","v":25.64}]
[null,"2009-03-07",{"$f":"TEXT(IF(DAY([DDate])<8,WEEKDAY([DDate]),\"\"),\"ddd\")","v":"Sat"},{"$f":"(WEEKDAY(Table3[[#This Row],[DDate]],2)<=5)*RANDBETWEEN(1000,9999)/100","v":0}]
[null,"2009-03-08",{"$f":"TEXT(IF(DAY([DDate])<8,WEEKDAY([DDate]),\"\"),\"ddd\")","v":""},{"$f":"(WEEKDAY(Table3[[#This Row],[DDate]],2)<=5)*RANDBETWEEN(1000,9999)/100","v":0}]
[null,"2009-03-09",{"$f":"TEXT(IF(DAY([DDate])<8,WEEKDAY([DDate]),\"\"),\"ddd\")","v":""},{"$f":"(WEEKDAY(Table3[[#This Row],[DDate]],2)<=5)*RANDBETWEEN(1000,9999)/100","v":55.2}]
[null,"2009-03-10",{"$f":"TEXT(IF(DAY([DDate])<8,WEEKDAY([DDate]),\"\"),\"ddd\")","v":""},{"$f":"(WEEKDAY(Table3[[#This Row],[DDate]],2)<=5)*RANDBETWEEN(1000,9999)/100","v":57.57}]
[null,"2009-03-11",{"$f":"TEXT(IF(DAY([DDate])<8,WEEKDAY([DDate]),\"\"),\"ddd\")","v":""},{"$f":"(WEEKDAY(Table3[[#This Row],[DDate]],2)<=5)*RANDBETWEEN(1000,9999)/100","v":54.03}]
[null,"2009-03-12",{"$f":"TEXT(IF(DAY([DDate])<8,WEEKDAY([DDate]),\"\"),\"ddd\")","v":""},{"$f":"(WEEKDAY(Table3[[#This Row],[DDate]],2)<=5)*RANDBETWEEN(1000,9999)/100","v":50.66}]
[null,"2009-03-13",{"$f":"TEXT(IF(DAY([DDate])<8,WEEKDAY([DDate]),\"\"),\"ddd\")","v":""},{"$f":"(WEEKDAY(Table3[[#This Row],[DDate]],2)<=5)*RANDBETWEEN(1000,9999)/100","v":81.260000000000005}]
[null,"2009-03-14",{"$f":"TEXT(IF(DAY([DDate])<8,WEEKDAY([DDate]),\"\"),\"ddd\")","v":""},{"$f":"(WEEKDAY(Table3[[#This Row],[DDate]],2)<=5)*RANDBETWEEN(1000,9999)/100","v":0}]
[null,"2009-03-15",{"$f":"TEXT(IF(DAY([DDate])<8,WEEKDAY([DDate]),\"\"),\"ddd\")","v":""},{"$f":"(WEEKDAY(Table3[[#This Row],[DDate]],2)<=5)*RANDBETWEEN(1000,9999)/100","v":0}]
[null,"2009-03-16",{"$f":"TEXT(IF(DAY([DDate])<8,WEEKDAY([DDate]),\"\"),\"ddd\")","v":""},{"$f":"(WEEKDAY(Table3[[#This Row],[DDate]],2)<=5)*RANDBETWEEN(1000,9999)/100","v":13.87}]
[null,"2009-03-17",{"$f":"TEXT(IF(DAY([DDate])<8,WEEKDAY([DDate]),\"\"),\"ddd\")","v":""},{"$f":"(WEEKDAY(Table3[[#This Row],[DDate]],2)<=5)*RANDBETWEEN(1000,9999)/100","v":41.05}]
[null,"2009-03-18",{"$f":"TEXT(IF(DAY([DDate])<8,WEEKDAY([DDate]),\"\"),\"ddd\")","v":""},{"$f":"(WEEKDAY(Table3[[#This Row],[DDate]],2)<=5)*RANDBETWEEN(1000,9999)/100","v":69.67}]
[null,"2009-03-19",{"$f":"TEXT(IF(DAY([DDate])<8,WEEKDAY([DDate]),\"\"),\"ddd\")","v":""},{"$f":"(WEEKDAY(Table3[[#This Row],[DDate]],2)<=5)*RANDBETWEEN(1000,9999)/100","v":36.9}]
[null,"2009-03-20",{"$f":"TEXT(IF(DAY([DDate])<8,WEEKDAY([DDate]),\"\"),\"ddd\")","v":""},{"$f":"(WEEKDAY(Table3[[#This Row],[DDate]],2)<=5)*RANDBETWEEN(1000,9999)/100","v":39.450000000000003}]
[null,"2009-03-21",{"$f":"TEXT(IF(DAY([DDate])<8,WEEKDAY([DDate]),\"\"),\"ddd\")","v":""},{"$f":"(WEEKDAY(Table3[[#This Row],[DDate]],2)<=5)*RANDBETWEEN(1000,9999)/100","v":0}]
[null,"2009-03-22",{"$f":"TEXT(IF(DAY([DDate])<8,WEEKDAY([DDate]),\"\"),\"ddd\")","v":""},{"$f":"(WEEKDAY(Table3[[#This Row],[DDate]],2)<=5)*RANDBETWEEN(1000,9999)/100","v":0}]
[null,"2009-03-23",{"$f":"TEXT(IF(DAY([DDate])<8,WEEKDAY([DDate]),\"\"),\"ddd\")","v":""},{"$f":"(WEEKDAY(Table3[[#This Row],[DDate]],2)<=5)*RANDBETWEEN(1000,9999)/100","v":16.16}]
[null,"2009-03-24",{"$f":"TEXT(IF(DAY([DDate])<8,WEEKDAY([DDate]),\"\"),\"ddd\")","v":""},{"$f":"(WEEKDAY(Table3[[#This Row],[DDate]],2)<=5)*RANDBETWEEN(1000,9999)/100","v":52.14}]
[null,"2009-03-25",{"$f":"TEXT(IF(DAY([DDate])<8,WEEKDAY([DDate]),\"\"),\"ddd\")","v":""},{"$f":"(WEEKDAY(Table3[[#This Row],[DDate]],2)<=5)*RANDBETWEEN(1000,9999)/100","v":25.55}]
[null,"2009-03-26",{"$f":"TEXT(IF(DAY([DDate])<8,WEEKDAY([DDate]),\"\"),\"ddd\")","v":""},{"$f":"(WEEKDAY(Table3[[#This Row],[DDate]],2)<=5)*RANDBETWEEN(1000,9999)/100","v":55.06}]
[null,"2009-03-27",{"$f":"TEXT(IF(DAY([DDate])<8,WEEKDAY([DDate]),\"\"),\"ddd\")","v":""},{"$f":"(WEEKDAY(Table3[[#This Row],[DDate]],2)<=5)*RANDBETWEEN(1000,9999)/100","v":72.8}]
[null,"2009-03-28",{"$f":"TEXT(IF(DAY([DDate])<8,WEEKDAY([DDate]),\"\"),\"ddd\")","v":""},{"$f":"(WEEKDAY(Table3[[#This Row],[DDate]],2)<=5)*RANDBETWEEN(1000,9999)/100","v":0}]
[null,"2009-03-29",{"$f":"TEXT(IF(DAY([DDate])<8,WEEKDAY([DDate]),\"\"),\"ddd\")","v":""},{"$f":"(WEEKDAY(Table3[[#This Row],[DDate]],2)<=5)*RANDBETWEEN(1000,9999)/100","v":0}]
[null,"2009-03-30",{"$f":"TEXT(IF(DAY([DDate])<8,WEEKDAY([DDate]),\"\"),\"ddd\")","v":""},{"$f":"(WEEKDAY(Table3[[#This Row],[DDate]],2)<=5)*RANDBETWEEN(1000,9999)/100","v":53.64}]
[null,"2009-03-31",{"$f":"TEXT(IF(DAY([DDate])<8,WEEKDAY([DDate]),\"\"),\"ddd\")","v":""},{"$f":"(WEEKDAY(Table3[[#This Row],[DDate]],2)<=5)*RANDBETWEEN(1000,9999)/100","v":20.79}]