{"text_format":"1","workbook":"xlsx","n_sheets":5,"sheets":["March","April","Compare1","Compare2","Compare3"],"not_rendered":{"charts":0,"images":7,"macros":1,"external_links":0,"defined_names":9,"comments":3,"pivot_tables":5},"unopened":[],"bounds":{"document_bytes":16777216,"sheet_cells":100000,"rows_first":2000,"rows_last":500,"rows_between":2000,"halvings":0,"cell_chars":16384,"cell_head_chars":4096},"cells_cut":0,"cells_raw":0,"read":"whole","date_system":"1900"}

{"sheet":"March","index":0,"n_rows":52,"n_cols":13,"rows_kept":52,"cut":false,"hidden":false,"merged":[]}
[]
[]
[null,"Table1",null,null,null,null,"PivotTable1"]
[null,"DDate","ChargeN","Resource","Amt",null,"Sum of Amt","Resource"]
[null,{"$f":"RANDBETWEEN(DATEVALUE(\"Mar 1, 2010\"),DATEVALUE(\"Mar 31, 2010\"))","v":"2010-03-02"},{"$f":"INDEX(Table3[ChgN],RANDBETWEEN(1,5))","v":"D6128"},{"$f":"INDEX(Table3[RSrc],RANDBETWEEN(1,5))","v":"L57"},{"$f":"RANDBETWEEN(1000,9999)/100","v":26.43},null,"ChargeN","L57","J64","J78","G30","B59","Grand Total"]
[null,"2010-03-30",{"$f":"INDEX(Table3[ChgN],RANDBETWEEN(1,5))","v":"D6128"},{"$f":"INDEX(Table3[RSrc],RANDBETWEEN(1,5))","v":"J78"},64.650000000000006,null,"V4541",0,186.36,53.44,204.64999999999998,222.68,667.13]
[null,"2010-03-29",{"$f":"INDEX(Table3[ChgN],RANDBETWEEN(1,5))","v":"W7329"},{"$f":"INDEX(Table3[RSrc],RANDBETWEEN(1,5))","v":"G30"},86.23,null,"W7329",134.56,76,75.790000000000006,0,94.63,380.98]
[null,"2010-03-30",{"$f":"INDEX(Table3[ChgN],RANDBETWEEN(1,5))","v":"V9973"},{"$f":"INDEX(Table3[RSrc],RANDBETWEEN(1,5))","v":"L57"},74.42,null,"D6128",176.48,35.020000000000003,0,83.68,0,295.18]
[null,"2010-03-28",{"$f":"INDEX(Table3[ChgN],RANDBETWEEN(1,5))","v":"V9973"},{"$f":"INDEX(Table3[RSrc],RANDBETWEEN(1,5))","v":"J64"},72.97,null,"P6159",0,143.56,164.71,212.62,131.69,652.57999999999993]
[null,"2010-03-17",{"$f":"INDEX(Table3[ChgN],RANDBETWEEN(1,5))","v":"P6159"},{"$f":"INDEX(Table3[RSrc],RANDBETWEEN(1,5))","v":"G30"},24.94,null,"V9973",13.27,271.43,186.17000000000002,95.61,63.51,629.99]
[null,"2010-03-11",{"$f":"INDEX(Table3[ChgN],RANDBETWEEN(1,5))","v":"V9973"},{"$f":"INDEX(Table3[RSrc],RANDBETWEEN(1,5))","v":"J78"},85.46,null,"Grand Total",324.30999999999995,712.37,480.11000000000007,596.55999999999995,512.51,2625.86]
[null,"2010-03-07",{"$f":"INDEX(Table3[ChgN],RANDBETWEEN(1,5))","v":"W7329"},{"$f":"INDEX(Table3[RSrc],RANDBETWEEN(1,5))","v":"L57"},38.14]
[null,"2010-03-30",{"$f":"INDEX(Table3[ChgN],RANDBETWEEN(1,5))","v":"V9973"},{"$f":"INDEX(Table3[RSrc],RANDBETWEEN(1,5))","v":"J64"},31.76]
[null,"2010-03-22",{"$f":"INDEX(Table3[ChgN],RANDBETWEEN(1,5))","v":"W7329"},{"$f":"INDEX(Table3[RSrc],RANDBETWEEN(1,5))","v":"B59"},99.97]
[null,"2010-03-30",{"$f":"INDEX(Table3[ChgN],RANDBETWEEN(1,5))","v":"V9973"},{"$f":"INDEX(Table3[RSrc],RANDBETWEEN(1,5))","v":"J64"},72.73]
[null,"2010-03-26",{"$f":"INDEX(Table3[ChgN],RANDBETWEEN(1,5))","v":"D6128"},{"$f":"INDEX(Table3[RSrc],RANDBETWEEN(1,5))","v":"B59"},63.58]
[null,"2010-03-07",{"$f":"INDEX(Table3[ChgN],RANDBETWEEN(1,5))","v":"W7329"},{"$f":"INDEX(Table3[RSrc],RANDBETWEEN(1,5))","v":"B59"},17.93]
[null,"2010-03-15",{"$f":"INDEX(Table3[ChgN],RANDBETWEEN(1,5))","v":"V4541"},{"$f":"INDEX(Table3[RSrc],RANDBETWEEN(1,5))","v":"G30"},95.31]
[null,"2010-03-02",{"$f":"INDEX(Table3[ChgN],RANDBETWEEN(1,5))","v":"P6159"},{"$f":"INDEX(Table3[RSrc],RANDBETWEEN(1,5))","v":"J64"},12.92]
[null,"2010-03-27",{"$f":"INDEX(Table3[ChgN],RANDBETWEEN(1,5))","v":"V9973"},{"$f":"INDEX(Table3[RSrc],RANDBETWEEN(1,5))","v":"L57"},34.61]
[null,"2010-03-22",{"$f":"INDEX(Table3[ChgN],RANDBETWEEN(1,5))","v":"V9973"},{"$f":"INDEX(Table3[RSrc],RANDBETWEEN(1,5))","v":"J64"},31.92]
[null,"2010-03-24",{"$f":"INDEX(Table3[ChgN],RANDBETWEEN(1,5))","v":"W7329"},{"$f":"INDEX(Table3[RSrc],RANDBETWEEN(1,5))","v":"J64"},72.84]
[null,"2010-03-28",{"$f":"INDEX(Table3[ChgN],RANDBETWEEN(1,5))","v":"P6159"},{"$f":"INDEX(Table3[RSrc],RANDBETWEEN(1,5))","v":"B59"},98.77]
[null,"2010-03-28",{"$f":"INDEX(Table3[ChgN],RANDBETWEEN(1,5))","v":"V4541"},{"$f":"INDEX(Table3[RSrc],RANDBETWEEN(1,5))","v":"J78"},80.3]
[null,"2010-03-31",{"$f":"INDEX(Table3[ChgN],RANDBETWEEN(1,5))","v":"P6159"},{"$f":"INDEX(Table3[RSrc],RANDBETWEEN(1,5))","v":"G30"},81.11]
[null,"2010-03-24",{"$f":"INDEX(Table3[ChgN],RANDBETWEEN(1,5))","v":"P6159"},{"$f":"INDEX(Table3[RSrc],RANDBETWEEN(1,5))","v":"J78"},84.01]
[null,"2010-03-07",{"$f":"INDEX(Table3[ChgN],RANDBETWEEN(1,5))","v":"W7329"},{"$f":"INDEX(Table3[RSrc],RANDBETWEEN(1,5))","v":"J78"},19.309999999999999]
[null,"2010-03-08",{"$f":"INDEX(Table3[ChgN],RANDBETWEEN(1,5))","v":"P6159"},{"$f":"INDEX(Table3[RSrc],RANDBETWEEN(1,5))","v":"B59"},49.47]
[null,"2010-03-08",{"$f":"INDEX(Table3[ChgN],RANDBETWEEN(1,5))","v":"V4541"},{"$f":"INDEX(Table3[RSrc],RANDBETWEEN(1,5))","v":"J64"},63.18]
[null,"2010-03-16",{"$f":"INDEX(Table3[ChgN],RANDBETWEEN(1,5))","v":"W7329"},{"$f":"INDEX(Table3[RSrc],RANDBETWEEN(1,5))","v":"J78"},87.2]
[null,"2010-03-29",{"$f":"INDEX(Table3[ChgN],RANDBETWEEN(1,5))","v":"D6128"},{"$f":"INDEX(Table3[RSrc],RANDBETWEEN(1,5))","v":"J78"},60.63]
[null,"2010-03-18",{"$f":"INDEX(Table3[ChgN],RANDBETWEEN(1,5))","v":"P6159"},{"$f":"INDEX(Table3[RSrc],RANDBETWEEN(1,5))","v":"J64"},36.159999999999997]
[null,"2010-03-05",{"$f":"INDEX(Table3[ChgN],RANDBETWEEN(1,5))","v":"P6159"},{"$f":"INDEX(Table3[RSrc],RANDBETWEEN(1,5))","v":"B59"},30.8]
[null,"2010-03-29",{"$f":"INDEX(Table3[ChgN],RANDBETWEEN(1,5))","v":"W7329"},{"$f":"INDEX(Table3[RSrc],RANDBETWEEN(1,5))","v":"G30"},22.5]
[null,"2010-03-27",{"$f":"INDEX(Table3[ChgN],RANDBETWEEN(1,5))","v":"W7329"},{"$f":"INDEX(Table3[RSrc],RANDBETWEEN(1,5))","v":"B59"},22.83]
[null,"2010-03-20",{"$f":"INDEX(Table3[ChgN],RANDBETWEEN(1,5))","v":"P6159"},{"$f":"INDEX(Table3[RSrc],RANDBETWEEN(1,5))","v":"J64"},52.83]
[null,"2010-03-03",{"$f":"INDEX(Table3[ChgN],RANDBETWEEN(1,5))","v":"W7329"},{"$f":"INDEX(Table3[RSrc],RANDBETWEEN(1,5))","v":"G30"},27.68]
[null,"2010-03-30",{"$f":"INDEX(Table3[ChgN],RANDBETWEEN(1,5))","v":"V4541"},{"$f":"INDEX(Table3[RSrc],RANDBETWEEN(1,5))","v":"J78"},99.42]
[null,"2010-03-05",{"$f":"INDEX(Table3[ChgN],RANDBETWEEN(1,5))","v":"V9973"},{"$f":"INDEX(Table3[RSrc],RANDBETWEEN(1,5))","v":"B59"},86.82]
[null,"2010-03-17",{"$f":"INDEX(Table3[ChgN],RANDBETWEEN(1,5))","v":"V4541"},{"$f":"INDEX(Table3[RSrc],RANDBETWEEN(1,5))","v":"J64"},31.68]
[null,"2010-03-19",{"$f":"INDEX(Table3[ChgN],RANDBETWEEN(1,5))","v":"V9973"},{"$f":"INDEX(Table3[RSrc],RANDBETWEEN(1,5))","v":"J78"},68.19]
[null,"2010-03-23",{"$f":"INDEX(Table3[ChgN],RANDBETWEEN(1,5))","v":"P6159"},{"$f":"INDEX(Table3[RSrc],RANDBETWEEN(1,5))","v":"L57"},43.9]
[null,"2010-03-19",{"$f":"INDEX(Table3[ChgN],RANDBETWEEN(1,5))","v":"D6128"},{"$f":"INDEX(Table3[RSrc],RANDBETWEEN(1,5))","v":"G30"},81.94]
[null,"2010-03-07",{"$f":"INDEX(Table3[ChgN],RANDBETWEEN(1,5))","v":"P6159"},{"$f":"INDEX(Table3[RSrc],RANDBETWEEN(1,5))","v":"B59"},25.47]
[null,"2010-03-10",{"$f":"INDEX(Table3[ChgN],RANDBETWEEN(1,5))","v":"V4541"},{"$f":"INDEX(Table3[RSrc],RANDBETWEEN(1,5))","v":"L57"},23.06]
[null,"2010-03-20",{"$f":"INDEX(Table3[ChgN],RANDBETWEEN(1,5))","v":"V9973"},{"$f":"INDEX(Table3[RSrc],RANDBETWEEN(1,5))","v":"J64"},80.849999999999994]
[null,"2010-03-08",{"$f":"INDEX(Table3[ChgN],RANDBETWEEN(1,5))","v":"V9973"},{"$f":"INDEX(Table3[RSrc],RANDBETWEEN(1,5))","v":"J64"},23.3]
[null,"2010-03-16",{"$f":"INDEX(Table3[ChgN],RANDBETWEEN(1,5))","v":"W7329"},{"$f":"INDEX(Table3[RSrc],RANDBETWEEN(1,5))","v":"B59"},40.46]
[null,"2010-03-14",{"$f":"INDEX(Table3[ChgN],RANDBETWEEN(1,5))","v":"P6159"},{"$f":"INDEX(Table3[RSrc],RANDBETWEEN(1,5))","v":"G30"},55.08]
[null,"2010-03-09",{"$f":"INDEX(Table3[ChgN],RANDBETWEEN(1,5))","v":"W7329"},{"$f":"INDEX(Table3[RSrc],RANDBETWEEN(1,5))","v":"J78"},42.02]
[null,"2010-03-10",{"$f":"INDEX(Table3[ChgN],RANDBETWEEN(1,5))","v":"D6128"},{"$f":"INDEX(Table3[RSrc],RANDBETWEEN(1,5))","v":"J78"},25.65]
[null,"2010-03-19",{"$f":"INDEX(Table3[ChgN],RANDBETWEEN(1,5))","v":"D6128"},{"$f":"INDEX(Table3[RSrc],RANDBETWEEN(1,5))","v":"J64"},49.51]

{"sheet":"April","index":1,"n_rows":52,"n_cols":17,"rows_kept":52,"cut":false,"hidden":false,"merged":[]}
[]
[]
[null,"Table2",null,null,null,null,"PivotTable2",null,null,null,null,null,null,null,null,"Table3"]
[null,"DDate","ChargeN","Resource","Amt",null,"Sum of Amt","Resource",null,null,null,null,null,null,null,"ChgN","RSrc"]
[null,{"$f":"RANDBETWEEN(DATEVALUE(\"Apr 1, 2010\"),DATEVALUE(\"Apr 30, 2010\"))","v":"2010-04-25"},{"$f":"INDEX(Table3[ChgN],RANDBETWEEN(1,5))","v":"V4541"},{"$f":"INDEX(Table3[RSrc],RANDBETWEEN(1,5))","v":"B59"},{"$f":"RANDBETWEEN(1000,9999)/100","v":98.67},null,"ChargeN","L57","J64","J78","G30","B59","Grand Total",null,null,"V9973","B59"]
[null,"2010-04-11",{"$f":"INDEX(Table3[ChgN],RANDBETWEEN(1,5))","v":"V4541"},{"$f":"INDEX(Table3[RSrc],RANDBETWEEN(1,5))","v":"L57"},54.65,null,"V4541",108.38,88.66,194.02,92.48,119.94,603.48,null,null,"W7329","J64"]
[null,"2010-04-17",{"$f":"INDEX(Table3[ChgN],RANDBETWEEN(1,5))","v":"W7329"},{"$f":"INDEX(Table3[RSrc],RANDBETWEEN(1,5))","v":"G30"},11.41,null,"W7329",116.73,84.67,91.61,49.09,48.81,390.91,null,null,"V4541","G30"]
[null,"2010-04-11",{"$f":"INDEX(Table3[ChgN],RANDBETWEEN(1,5))","v":"V9973"},{"$f":"INDEX(Table3[RSrc],RANDBETWEEN(1,5))","v":"L57"},58.63,null,"D6128",287.89999999999998,0,144.57,19.190000000000001,12.33,463.98999999999995,null,null,"P6159","J78"]
[null,"2010-04-03",{"$f":"INDEX(Table3[ChgN],RANDBETWEEN(1,5))","v":"P6159"},{"$f":"INDEX(Table3[RSrc],RANDBETWEEN(1,5))","v":"L57"},93.55,null,"P6159",43.379999999999995,220.65,0,211.61,147.33000000000001,622.97,null,null,"D6128","L57"]
[null,"2010-04-02",{"$f":"INDEX(Table3[ChgN],RANDBETWEEN(1,5))","v":"V9973"},{"$f":"INDEX(Table3[RSrc],RANDBETWEEN(1,5))","v":"B59"},38.79,null,"V9973",92.300000000000011,306.48,38.4,0,109.37,546.54999999999995]
[null,"2010-04-06",{"$f":"INDEX(Table3[ChgN],RANDBETWEEN(1,5))","v":"P6159"},{"$f":"INDEX(Table3[RSrc],RANDBETWEEN(1,5))","v":"J64"},99.2,null,"Grand Total",648.69000000000005,700.46,468.59999999999997,372.37,437.78000000000003,2627.9000000000005]
[null,"2010-04-24",{"$f":"INDEX(Table3[ChgN],RANDBETWEEN(1,5))","v":"P6159"},{"$f":"INDEX(Table3[RSrc],RANDBETWEEN(1,5))","v":"B59"},40.94]
[null,"2010-04-26",{"$f":"INDEX(Table3[ChgN],RANDBETWEEN(1,5))","v":"V9973"},{"$f":"INDEX(Table3[RSrc],RANDBETWEEN(1,5))","v":"B59"},97.04]
[null,"2010-04-10",{"$f":"INDEX(Table3[ChgN],RANDBETWEEN(1,5))","v":"V9973"},{"$f":"INDEX(Table3[RSrc],RANDBETWEEN(1,5))","v":"G30"},26.5]
[null,"2010-04-23",{"$f":"INDEX(Table3[ChgN],RANDBETWEEN(1,5))","v":"V4541"},{"$f":"INDEX(Table3[RSrc],RANDBETWEEN(1,5))","v":"L57"},47.85]
[null,"2010-04-17",{"$f":"INDEX(Table3[ChgN],RANDBETWEEN(1,5))","v":"V4541"},{"$f":"INDEX(Table3[RSrc],RANDBETWEEN(1,5))","v":"L57"},21.24]
[null,"2010-04-11",{"$f":"INDEX(Table3[ChgN],RANDBETWEEN(1,5))","v":"W7329"},{"$f":"INDEX(Table3[RSrc],RANDBETWEEN(1,5))","v":"L57"},50.28]
[null,"2010-04-23",{"$f":"INDEX(Table3[ChgN],RANDBETWEEN(1,5))","v":"V9973"},{"$f":"INDEX(Table3[RSrc],RANDBETWEEN(1,5))","v":"B59"},87.86]
[null,"2010-04-30",{"$f":"INDEX(Table3[ChgN],RANDBETWEEN(1,5))","v":"D6128"},{"$f":"INDEX(Table3[RSrc],RANDBETWEEN(1,5))","v":"B59"},76.709999999999994]
[null,"2010-04-02",{"$f":"INDEX(Table3[ChgN],RANDBETWEEN(1,5))","v":"P6159"},{"$f":"INDEX(Table3[RSrc],RANDBETWEEN(1,5))","v":"G30"},45.68]
[null,"2010-04-07",{"$f":"INDEX(Table3[ChgN],RANDBETWEEN(1,5))","v":"W7329"},{"$f":"INDEX(Table3[RSrc],RANDBETWEEN(1,5))","v":"J64"},46.68]
[null,"2010-04-04",{"$f":"INDEX(Table3[ChgN],RANDBETWEEN(1,5))","v":"V9973"},{"$f":"INDEX(Table3[RSrc],RANDBETWEEN(1,5))","v":"G30"},63.09]
[null,"2010-04-05",{"$f":"INDEX(Table3[ChgN],RANDBETWEEN(1,5))","v":"V9973"},{"$f":"INDEX(Table3[RSrc],RANDBETWEEN(1,5))","v":"J64"},93.39]
[null,"2010-04-12",{"$f":"INDEX(Table3[ChgN],RANDBETWEEN(1,5))","v":"V9973"},{"$f":"INDEX(Table3[RSrc],RANDBETWEEN(1,5))","v":"J78"},17.059999999999999]
[null,"2010-04-07",{"$f":"INDEX(Table3[ChgN],RANDBETWEEN(1,5))","v":"D6128"},{"$f":"INDEX(Table3[RSrc],RANDBETWEEN(1,5))","v":"J64"},93.78]
[null,"2010-04-07",{"$f":"INDEX(Table3[ChgN],RANDBETWEEN(1,5))","v":"V4541"},{"$f":"INDEX(Table3[RSrc],RANDBETWEEN(1,5))","v":"G30"},47.2]
[null,"2010-04-30",{"$f":"INDEX(Table3[ChgN],RANDBETWEEN(1,5))","v":"P6159"},{"$f":"INDEX(Table3[RSrc],RANDBETWEEN(1,5))","v":"J64"},31.54]
[null,"2010-04-28",{"$f":"INDEX(Table3[ChgN],RANDBETWEEN(1,5))","v":"W7329"},{"$f":"INDEX(Table3[RSrc],RANDBETWEEN(1,5))","v":"J78"},42.5]
[null,"2010-04-27",{"$f":"INDEX(Table3[ChgN],RANDBETWEEN(1,5))","v":"V4541"},{"$f":"INDEX(Table3[RSrc],RANDBETWEEN(1,5))","v":"J64"},44.8]
[null,"2010-04-16",{"$f":"INDEX(Table3[ChgN],RANDBETWEEN(1,5))","v":"D6128"},{"$f":"INDEX(Table3[RSrc],RANDBETWEEN(1,5))","v":"G30"},36.58]
[null,"2010-04-03",{"$f":"INDEX(Table3[ChgN],RANDBETWEEN(1,5))","v":"V9973"},{"$f":"INDEX(Table3[RSrc],RANDBETWEEN(1,5))","v":"G30"},95.59]
[null,"2010-04-03",{"$f":"INDEX(Table3[ChgN],RANDBETWEEN(1,5))","v":"W7329"},{"$f":"INDEX(Table3[RSrc],RANDBETWEEN(1,5))","v":"L57"},21.15]
[null,"2010-04-02",{"$f":"INDEX(Table3[ChgN],RANDBETWEEN(1,5))","v":"V9973"},{"$f":"INDEX(Table3[RSrc],RANDBETWEEN(1,5))","v":"G30"},84.7]
[null,"2010-04-18",{"$f":"INDEX(Table3[ChgN],RANDBETWEEN(1,5))","v":"V4541"},{"$f":"INDEX(Table3[RSrc],RANDBETWEEN(1,5))","v":"B59"},46.87]
[null,"2010-04-27",{"$f":"INDEX(Table3[ChgN],RANDBETWEEN(1,5))","v":"D6128"},{"$f":"INDEX(Table3[RSrc],RANDBETWEEN(1,5))","v":"B59"},73.38]
[null,"2010-04-15",{"$f":"INDEX(Table3[ChgN],RANDBETWEEN(1,5))","v":"W7329"},{"$f":"INDEX(Table3[RSrc],RANDBETWEEN(1,5))","v":"J64"},61.58]
[null,"2010-04-24",{"$f":"INDEX(Table3[ChgN],RANDBETWEEN(1,5))","v":"W7329"},{"$f":"INDEX(Table3[RSrc],RANDBETWEEN(1,5))","v":"L57"},55.82]
[null,"2010-04-04",{"$f":"INDEX(Table3[ChgN],RANDBETWEEN(1,5))","v":"V9973"},{"$f":"INDEX(Table3[RSrc],RANDBETWEEN(1,5))","v":"L57"},87.54]
[null,"2010-04-25",{"$f":"INDEX(Table3[ChgN],RANDBETWEEN(1,5))","v":"W7329"},{"$f":"INDEX(Table3[RSrc],RANDBETWEEN(1,5))","v":"B59"},86.04]
[null,"2010-04-30",{"$f":"INDEX(Table3[ChgN],RANDBETWEEN(1,5))","v":"P6159"},{"$f":"INDEX(Table3[RSrc],RANDBETWEEN(1,5))","v":"J78"},76.680000000000007]
[null,"2010-04-09",{"$f":"INDEX(Table3[ChgN],RANDBETWEEN(1,5))","v":"P6159"},{"$f":"INDEX(Table3[RSrc],RANDBETWEEN(1,5))","v":"G30"},91.88]
[null,"2010-04-02",{"$f":"INDEX(Table3[ChgN],RANDBETWEEN(1,5))","v":"W7329"},{"$f":"INDEX(Table3[RSrc],RANDBETWEEN(1,5))","v":"J78"},89.59]
[null,"2010-04-11",{"$f":"INDEX(Table3[ChgN],RANDBETWEEN(1,5))","v":"P6159"},{"$f":"INDEX(Table3[RSrc],RANDBETWEEN(1,5))","v":"L57"},22.15]
[null,"2010-04-07",{"$f":"INDEX(Table3[ChgN],RANDBETWEEN(1,5))","v":"V9973"},{"$f":"INDEX(Table3[RSrc],RANDBETWEEN(1,5))","v":"B59"},98.67]
[null,"2010-04-23",{"$f":"INDEX(Table3[ChgN],RANDBETWEEN(1,5))","v":"V9973"},{"$f":"INDEX(Table3[RSrc],RANDBETWEEN(1,5))","v":"G30"},92.01]
[null,"2010-04-05",{"$f":"INDEX(Table3[ChgN],RANDBETWEEN(1,5))","v":"D6128"},{"$f":"INDEX(Table3[RSrc],RANDBETWEEN(1,5))","v":"B59"},20.309999999999999]
[null,"2010-04-02",{"$f":"INDEX(Table3[ChgN],RANDBETWEEN(1,5))","v":"W7329"},{"$f":"INDEX(Table3[RSrc],RANDBETWEEN(1,5))","v":"B59"},77.72]
[null,"2010-04-09",{"$f":"INDEX(Table3[ChgN],RANDBETWEEN(1,5))","v":"V9973"},{"$f":"INDEX(Table3[RSrc],RANDBETWEEN(1,5))","v":"B59"},42.3]
[null,"2010-04-17",{"$f":"INDEX(Table3[ChgN],RANDBETWEEN(1,5))","v":"W7329"},{"$f":"INDEX(Table3[RSrc],RANDBETWEEN(1,5))","v":"G30"},70.39]
[null,"2010-04-01",{"$f":"INDEX(Table3[ChgN],RANDBETWEEN(1,5))","v":"D6128"},{"$f":"INDEX(Table3[RSrc],RANDBETWEEN(1,5))","v":"G30"},76.099999999999994]
[null,"2010-04-15",{"$f":"INDEX(Table3[ChgN],RANDBETWEEN(1,5))","v":"W7329"},{"$f":"INDEX(Table3[RSrc],RANDBETWEEN(1,5))","v":"B59"},46.35]
[null,"2010-04-25",{"$f":"INDEX(Table3[ChgN],RANDBETWEEN(1,5))","v":"V9973"},{"$f":"INDEX(Table3[RSrc],RANDBETWEEN(1,5))","v":"G30"},40.159999999999997]

{"sheet":"Compare1","index":2,"n_rows":11,"n_cols":17,"rows_kept":11,"cut":false,"hidden":false,"merged":[]}
[]
[]
[]
[]
[null,"Table4"]
[null,"ChargeN","L57_1","J64_1","J78_1","G30_1","B59_1","L57_2","J64_2","J78_2","G30_2","B59_2","L57_∆","J64_∆","J78_∆","G30_∆","B59_∆"]
[null,"V4541",{"$f":"GETPIVOTDATA(\"Amt\",INDIRECT(RIGHT(Table4[#Headers],2)),\"ChargeN\",[ChargeN],\"Resource\",LEFT(Table4[#Headers],3))","v":0},{"$f":"GETPIVOTDATA(\"Amt\",INDIRECT(RIGHT(Table4[#Headers],2)),\"ChargeN\",[ChargeN],\"Resource\",LEFT(Table4[#Headers],3))","v":186.36},{"$f":"GETPIVOTDATA(\"Amt\",INDIRECT(RIGHT(Table4[#Headers],2)),\"ChargeN\",[ChargeN],\"Resource\",LEFT(Table4[#Headers],3))","v":53.44},{"$f":"GETPIVOTDATA(\"Amt\",INDIRECT(RIGHT(Table4[#Headers],2)),\"ChargeN\",[ChargeN],\"Resource\",LEFT(Table4[#Headers],3))","v":204.64999999999998},{"$f":"GETPIVOTDATA(\"Amt\",INDIRECT(RIGHT(Table4[#Headers],2)),\"ChargeN\",[ChargeN],\"Resource\",LEFT(Table4[#Headers],3))","v":222.68},{"$f":"GETPIVOTDATA(\"Amt\",INDIRECT(RIGHT(Table4[#Headers],2)),\"ChargeN\",[ChargeN],\"Resource\",LEFT(Table4[#Headers],3))","v":108.38},{"$f":"GETPIVOTDATA(\"Amt\",INDIRECT(RIGHT(Table4[#Headers],2)),\"ChargeN\",[ChargeN],\"Resource\",LEFT(Table4[#Headers],3))","v":88.66},{"$f":"GETPIVOTDATA(\"Amt\",INDIRECT(RIGHT(Table4[#Headers],2)),\"ChargeN\",[ChargeN],\"Resource\",LEFT(Table4[#Headers],3))","v":194.02},{"$f":"GETPIVOTDATA(\"Amt\",INDIRECT(RIGHT(Table4[#Headers],2)),\"ChargeN\",[ChargeN],\"Resource\",LEFT(Table4[#Headers],3))","v":92.48},{"$f":"GETPIVOTDATA(\"Amt\",INDIRECT(RIGHT(Table4[#Headers],2)),\"ChargeN\",[ChargeN],\"Resource\",LEFT(Table4[#Headers],3))","v":119.94},{"$f":"INDIRECT(\"Table4[\"&LEFT(Table4[#Headers],3)&\"_2]\")-INDIRECT(\"Table4[\"&LEFT(Table4[#Headers],3)&\"_1]\")","v":108.38},{"$f":"INDIRECT(\"Table4[\"&LEFT(Table4[#Headers],3)&\"_2]\")-INDIRECT(\"Table4[\"&LEFT(Table4[#Headers],3)&\"_1]\")","v":-97.700000000000017},{"$f":"INDIRECT(\"Table4[\"&LEFT(Table4[#Headers],3)&\"_2]\")-INDIRECT(\"Table4[\"&LEFT(Table4[#Headers],3)&\"_1]\")","v":140.58000000000001},{"$f":"INDIRECT(\"Table4[\"&LEFT(Table4[#Headers],3)&\"_2]\")-INDIRECT(\"Table4[\"&LEFT(Table4[#Headers],3)&\"_1]\")","v":-112.16999999999997},{"$f":"INDIRECT(\"Table4[\"&LEFT(Table4[#Headers],3)&\"_2]\")-INDIRECT(\"Table4[\"&LEFT(Table4[#Headers],3)&\"_1]\")","v":-102.74000000000001}]
[null,"W7329",{"$f":"GETPIVOTDATA(\"Amt\",INDIRECT(RIGHT(Table4[#Headers],2)),\"ChargeN\",[ChargeN],\"Resource\",LEFT(Table4[#Headers],3))","v":134.56},{"$f":"GETPIVOTDATA(\"Amt\",INDIRECT(RIGHT(Table4[#Headers],2)),\"ChargeN\",[ChargeN],\"Resource\",LEFT(Table4[#Headers],3))","v":76},{"$f":"GETPIVOTDATA(\"Amt\",INDIRECT(RIGHT(Table4[#Headers],2)),\"ChargeN\",[ChargeN],\"Resource\",LEFT(Table4[#Headers],3))","v":75.790000000000006},{"$f":"GETPIVOTDATA(\"Amt\",INDIRECT(RIGHT(Table4[#Headers],2)),\"ChargeN\",[ChargeN],\"Resource\",LEFT(Table4[#Headers],3))","v":0},{"$f":"GETPIVOTDATA(\"Amt\",INDIRECT(RIGHT(Table4[#Headers],2)),\"ChargeN\",[ChargeN],\"Resource\",LEFT(Table4[#Headers],3))","v":94.63},{"$f":"GETPIVOTDATA(\"Amt\",INDIRECT(RIGHT(Table4[#Headers],2)),\"ChargeN\",[ChargeN],\"Resource\",LEFT(Table4[#Headers],3))","v":116.73},{"$f":"GETPIVOTDATA(\"Amt\",INDIRECT(RIGHT(Table4[#Headers],2)),\"ChargeN\",[ChargeN],\"Resource\",LEFT(Table4[#Headers],3))","v":84.67},{"$f":"GETPIVOTDATA(\"Amt\",INDIRECT(RIGHT(Table4[#Headers],2)),\"ChargeN\",[ChargeN],\"Resource\",LEFT(Table4[#Headers],3))","v":91.61},{"$f":"GETPIVOTDATA(\"Amt\",INDIRECT(RIGHT(Table4[#Headers],2)),\"ChargeN\",[ChargeN],\"Resource\",LEFT(Table4[#Headers],3))","v":49.09},{"$f":"GETPIVOTDATA(\"Amt\",INDIRECT(RIGHT(Table4[#Headers],2)),\"ChargeN\",[ChargeN],\"Resource\",LEFT(Table4[#Headers],3))","v":48.81},{"$f":"INDIRECT(\"Table4[\"&LEFT(Table4[#Headers],3)&\"_2]\")-INDIRECT(\"Table4[\"&LEFT(Table4[#Headers],3)&\"_1]\")","v":-17.829999999999998},{"$f":"INDIRECT(\"Table4[\"&LEFT(Table4[#Headers],3)&\"_2]\")-INDIRECT(\"Table4[\"&LEFT(Table4[#Headers],3)&\"_1]\")","v":8.6700000000000017},{"$f":"INDIRECT(\"Table4[\"&LEFT(Table4[#Headers],3)&\"_2]\")-INDIRECT(\"Table4[\"&LEFT(Table4[#Headers],3)&\"_1]\")","v":15.819999999999993},{"$f":"INDIRECT(\"Table4[\"&LEFT(Table4[#Headers],3)&\"_2]\")-INDIRECT(\"Table4[\"&LEFT(Table4[#Headers],3)&\"_1]\")","v":49.09},{"$f":"INDIRECT(\"Table4[\"&LEFT(Table4[#Headers],3)&\"_2]\")-INDIRECT(\"Table4[\"&LEFT(Table4[#Headers],3)&\"_1]\")","v":-45.819999999999993}]
[null,"D6128",{"$f":"GETPIVOTDATA(\"Amt\",INDIRECT(RIGHT(Table4[#Headers],2)),\"ChargeN\",[ChargeN],\"Resource\",LEFT(Table4[#Headers],3))","v":176.48},{"$f":"GETPIVOTDATA(\"Amt\",INDIRECT(RIGHT(Table4[#Headers],2)),\"ChargeN\",[ChargeN],\"Resource\",LEFT(Table4[#Headers],3))","v":35.020000000000003},{"$f":"GETPIVOTDATA(\"Amt\",INDIRECT(RIGHT(Table4[#Headers],2)),\"ChargeN\",[ChargeN],\"Resource\",LEFT(Table4[#Headers],3))","v":0},{"$f":"GETPIVOTDATA(\"Amt\",INDIRECT(RIGHT(Table4[#Headers],2)),\"ChargeN\",[ChargeN],\"Resource\",LEFT(Table4[#Headers],3))","v":83.68},{"$f":"GETPIVOTDATA(\"Amt\",INDIRECT(RIGHT(Table4[#Headers],2)),\"ChargeN\",[ChargeN],\"Resource\",LEFT(Table4[#Headers],3))","v":0},{"$f":"GETPIVOTDATA(\"Amt\",INDIRECT(RIGHT(Table4[#Headers],2)),\"ChargeN\",[ChargeN],\"Resource\",LEFT(Table4[#Headers],3))","v":287.89999999999998},{"$f":"GETPIVOTDATA(\"Amt\",INDIRECT(RIGHT(Table4[#Headers],2)),\"ChargeN\",[ChargeN],\"Resource\",LEFT(Table4[#Headers],3))","v":0},{"$f":"GETPIVOTDATA(\"Amt\",INDIRECT(RIGHT(Table4[#Headers],2)),\"ChargeN\",[ChargeN],\"Resource\",LEFT(Table4[#Headers],3))","v":144.57},{"$f":"GETPIVOTDATA(\"Amt\",INDIRECT(RIGHT(Table4[#Headers],2)),\"ChargeN\",[ChargeN],\"Resource\",LEFT(Table4[#Headers],3))","v":19.190000000000001},{"$f":"GETPIVOTDATA(\"Amt\",INDIRECT(RIGHT(Table4[#Headers],2)),\"ChargeN\",[ChargeN],\"Resource\",LEFT(Table4[#Headers],3))","v":12.33},{"$f":"INDIRECT(\"Table4[\"&LEFT(Table4[#Headers],3)&\"_2]\")-INDIRECT(\"Table4[\"&LEFT(Table4[#Headers],3)&\"_1]\")","v":111.41999999999999},{"$f":"INDIRECT(\"Table4[\"&LEFT(Table4[#Headers],3)&\"_2]\")-INDIRECT(\"Table4[\"&LEFT(Table4[#Headers],3)&\"_1]\")","v":-35.020000000000003},{"$f":"INDIRECT(\"Table4[\"&LEFT(Table4[#Headers],3)&\"_2]\")-INDIRECT(\"Table4[\"&LEFT(Table4[#Headers],3)&\"_1]\")","v":144.57},{"$f":"INDIRECT(\"Table4[\"&LEFT(Table4[#Headers],3)&\"_2]\")-INDIRECT(\"Table4[\"&LEFT(Table4[#Headers],3)&\"_1]\")","v":-64.490000000000009},{"$f":"INDIRECT(\"Table4[\"&LEFT(Table4[#Headers],3)&\"_2]\")-INDIRECT(\"Table4[\"&LEFT(Table4[#Headers],3)&\"_1]\")","v":12.33}]
[null,"P6159",{"$f":"GETPIVOTDATA(\"Amt\",INDIRECT(RIGHT(Table4[#Headers],2)),\"ChargeN\",[ChargeN],\"Resource\",LEFT(Table4[#Headers],3))","v":0},{"$f":"GETPIVOTDATA(\"Amt\",INDIRECT(RIGHT(Table4[#Headers],2)),\"ChargeN\",[ChargeN],\"Resource\",LEFT(Table4[#Headers],3))","v":143.56},{"$f":"GETPIVOTDATA(\"Amt\",INDIRECT(RIGHT(Table4[#Headers],2)),\"ChargeN\",[ChargeN],\"Resource\",LEFT(Table4[#Headers],3))","v":164.71},{"$f":"GETPIVOTDATA(\"Amt\",INDIRECT(RIGHT(Table4[#Headers],2)),\"ChargeN\",[ChargeN],\"Resource\",LEFT(Table4[#Headers],3))","v":212.62},{"$f":"GETPIVOTDATA(\"Amt\",INDIRECT(RIGHT(Table4[#Headers],2)),\"ChargeN\",[ChargeN],\"Resource\",LEFT(Table4[#Headers],3))","v":131.69},{"$f":"GETPIVOTDATA(\"Amt\",INDIRECT(RIGHT(Table4[#Headers],2)),\"ChargeN\",[ChargeN],\"Resource\",LEFT(Table4[#Headers],3))","v":43.379999999999995},{"$f":"GETPIVOTDATA(\"Amt\",INDIRECT(RIGHT(Table4[#Headers],2)),\"ChargeN\",[ChargeN],\"Resource\",LEFT(Table4[#Headers],3))","v":220.65},{"$f":"GETPIVOTDATA(\"Amt\",INDIRECT(RIGHT(Table4[#Headers],2)),\"ChargeN\",[ChargeN],\"Resource\",LEFT(Table4[#Headers],3))","v":0},{"$f":"GETPIVOTDATA(\"Amt\",INDIRECT(RIGHT(Table4[#Headers],2)),\"ChargeN\",[ChargeN],\"Resource\",LEFT(Table4[#Headers],3))","v":211.61},{"$f":"GETPIVOTDATA(\"Amt\",INDIRECT(RIGHT(Table4[#Headers],2)),\"ChargeN\",[ChargeN],\"Resource\",LEFT(Table4[#Headers],3))","v":147.33000000000001},{"$f":"INDIRECT(\"Table4[\"&LEFT(Table4[#Headers],3)&\"_2]\")-INDIRECT(\"Table4[\"&LEFT(Table4[#Headers],3)&\"_1]\")","v":43.379999999999995},{"$f":"INDIRECT(\"Table4[\"&LEFT(Table4[#Headers],3)&\"_2]\")-INDIRECT(\"Table4[\"&LEFT(Table4[#Headers],3)&\"_1]\")","v":77.09},{"$f":"INDIRECT(\"Table4[\"&LEFT(Table4[#Headers],3)&\"_2]\")-INDIRECT(\"Table4[\"&LEFT(Table4[#Headers],3)&\"_1]\")","v":-164.71},{"$f":"INDIRECT(\"Table4[\"&LEFT(Table4[#Headers],3)&\"_2]\")-INDIRECT(\"Table4[\"&LEFT(Table4[#Headers],3)&\"_1]\")","v":-1.0099999999999909},{"$f":"INDIRECT(\"Table4[\"&LEFT(Table4[#Headers],3)&\"_2]\")-INDIRECT(\"Table4[\"&LEFT(Table4[#Headers],3)&\"_1]\")","v":15.640000000000015}]
[null,"V9973",{"$f":"GETPIVOTDATA(\"Amt\",INDIRECT(RIGHT(Table4[#Headers],2)),\"ChargeN\",[ChargeN],\"Resource\",LEFT(Table4[#Headers],3))","v":13.27},{"$f":"GETPIVOTDATA(\"Amt\",INDIRECT(RIGHT(Table4[#Headers],2)),\"ChargeN\",[ChargeN],\"Resource\",LEFT(Table4[#Headers],3))","v":271.43},{"$f":"GETPIVOTDATA(\"Amt\",INDIRECT(RIGHT(Table4[#Headers],2)),\"ChargeN\",[ChargeN],\"Resource\",LEFT(Table4[#Headers],3))","v":186.17000000000002},{"$f":"GETPIVOTDATA(\"Amt\",INDIRECT(RIGHT(Table4[#Headers],2)),\"ChargeN\",[ChargeN],\"Resource\",LEFT(Table4[#Headers],3))","v":95.61},{"$f":"GETPIVOTDATA(\"Amt\",INDIRECT(RIGHT(Table4[#Headers],2)),\"ChargeN\",[ChargeN],\"Resource\",LEFT(Table4[#Headers],3))","v":63.51},{"$f":"GETPIVOTDATA(\"Amt\",INDIRECT(RIGHT(Table4[#Headers],2)),\"ChargeN\",[ChargeN],\"Resource\",LEFT(Table4[#Headers],3))","v":92.300000000000011},{"$f":"GETPIVOTDATA(\"Amt\",INDIRECT(RIGHT(Table4[#Headers],2)),\"ChargeN\",[ChargeN],\"Resource\",LEFT(Table4[#Headers],3))","v":306.48},{"$f":"GETPIVOTDATA(\"Amt\",INDIRECT(RIGHT(Table4[#Headers],2)),\"ChargeN\",[ChargeN],\"Resource\",LEFT(Table4[#Headers],3))","v":38.4},{"$f":"GETPIVOTDATA(\"Amt\",INDIRECT(RIGHT(Table4[#Headers],2)),\"ChargeN\",[ChargeN],\"Resource\",LEFT(Table4[#Headers],3))","v":0},{"$f":"GETPIVOTDATA(\"Amt\",INDIRECT(RIGHT(Table4[#Headers],2)),\"ChargeN\",[ChargeN],\"Resource\",LEFT(Table4[#Headers],3))","v":109.37},{"$f":"INDIRECT(\"Table4[\"&LEFT(Table4[#Headers],3)&\"_2]\")-INDIRECT(\"Table4[\"&LEFT(Table4[#Headers],3)&\"_1]\")","v":79.030000000000015},{"$f":"INDIRECT(\"Table4[\"&LEFT(Table4[#Headers],3)&\"_2]\")-INDIRECT(\"Table4[\"&LEFT(Table4[#Headers],3)&\"_1]\")","v":35.050000000000011},{"$f":"INDIRECT(\"Table4[\"&LEFT(Table4[#Headers],3)&\"_2]\")-INDIRECT(\"Table4[\"&LEFT(Table4[#Headers],3)&\"_1]\")","v":-147.77000000000001},{"$f":"INDIRECT(\"Table4[\"&LEFT(Table4[#Headers],3)&\"_2]\")-INDIRECT(\"Table4[\"&LEFT(Table4[#Headers],3)&\"_1]\")","v":-95.61},{"$f":"INDIRECT(\"Table4[\"&LEFT(Table4[#Headers],3)&\"_2]\")-INDIRECT(\"Table4[\"&LEFT(Table4[#Headers],3)&\"_1]\")","v":45.860000000000007}]

{"sheet":"Compare2","index":3,"n_rows":100,"n_cols":14,"rows_kept":100,"cut":false,"hidden":false,"merged":[]}
[]
[]
[null,"Table5",null,null,null,null,"PivotTable3"]
[null,"DDate","ChargeN","Resource","Amt",null,null,null,"Values","DDate"]
[null,"2010-03-19","V4541","L57",71.67,null,null,null,"_Amt",null,"Amt_∆",null,"Pct_∆"]
[null,"2010-03-20","V4541","G30",36.39,null,"ChargeN","Resource","Mar","Apr","Mar","Apr","Mar","Apr"]
[null,"2010-03-10","W7329","B59",41.46,null,"D6128",null,781.19999999999993,443.52,null,-337.67999999999995,null,-0.43225806451612903]
[null,"2010-03-09","D6128","G30",65.11,null,null,"B59",112.06,63.66,null,-48.400000000000006,null,-0.43191147599500274]
[null,"2010-03-15","V4541","G30",98.84,null,null,"G30",254.76000000000002,165.17000000000002,null,-89.59,null,-0.35166431150887106]
[null,"2010-03-07","V9973","G30",66.260000000000005,null,null,"J64",188.41000000000003,34.61,null,-153.80000000000001,null,-0.81630486704527361]
[null,"2010-03-24","V4541","B59",26.9,null,null,"J78",132.31,114.59,null,-17.72,null,-0.13392789660645452]
[null,"2010-03-13","W7329","J64",75.849999999999994,null,null,"L57",93.66,65.490000000000009,null,-28.169999999999987,null,-0.30076873798846882]
[null,"2010-03-17","V4541","J64",22.19,null,"P6159",null,377.66,534.52,null,156.85999999999996,null,0.41534713763702785]
[null,"2010-03-27","D6128","B59",33.909999999999997,null,null,"B59",0,157.80000000000001,null,157.80000000000001]
[null,"2010-03-12","D6128","J78",41.2,null,null,"G30",377.66,154.88,null,-222.78000000000003,null,-0.58989567335698778]
[null,"2010-03-12","V9973","B59",99.88,null,null,"J64",0,72.239999999999995,null,72.239999999999995]
[null,"2010-03-08","V9973","J78",57.26,null,null,"J78",0,82.62,null,82.62]
[null,"2010-03-19","W7329","J64",23.77,null,null,"L57",0,66.98,null,66.98]
[null,"2010-03-25","D6128","J64",92.23,null,"V4541",null,612.29999999999995,665.7700000000001,null,53.470000000000141,null,8.732647395067801E-2]
[null,"2010-03-21","D6128","B59",37.44,null,null,"B59",26.9,81.72,null,54.82,null,2.037918215613383]
[null,"2010-03-20","V4541","J64",23.26,null,null,"G30",276.44,290.11,null,13.670000000000016,null,4.9450151931703143E-2]
[null,"2010-03-26","P6159","G30",23.2,null,null,"J64",192.97000000000003,159.84,null,-33.130000000000024,null,-0.17168471783178743]
[null,"2010-03-23","D6128","B59",40.71,null,null,"J78",44.32,40.200000000000003,null,-4.1199999999999974,null,-9.2960288808664207E-2]
[null,"2010-03-04","W7329","B59",55.51,null,null,"L57",71.67,93.9,null,22.230000000000004,null,0.3101716199246547]
[null,"2010-03-12","V4541","G30",12.67,null,"V9973",null,437.54999999999995,369.21,null,-68.339999999999975,null,-0.15618786424408634]
[null,"2010-03-31","V4541","J78",18.149999999999999,null,null,"B59",99.88,103.1,null,3.2199999999999989,null,3.2238686423708439E-2]
[null,"2010-03-26","W7329","B59",65.56,null,null,"G30",153.94999999999999,18.739999999999998,null,-135.20999999999998,null,-0.87827216628775573]
[null,"2010-03-16","P6159","G30",38.42,null,null,"J64",36.65,75.37,null,38.720000000000006,null,1.0564802182810371]
[null,"2010-03-22","V9973","G30",87.69,null,null,"J78",147.07,83.75,null,-63.319999999999993,null,-0.43054327871081793]
[null,"2010-03-27","D6128","J78",91.11,null,null,"L57",0,88.25,null,88.25]
[null,"2010-03-18","W7329","G30",90.53,null,"W7329",null,592.01,694.3900000000001,null,102.38000000000011,null,0.17293626796844666]
[null,"2010-03-04","D6128","G30",41.07,null,null,"B59",202.57999999999998,179.96,null,-22.619999999999976,null,-0.11165959127258356]
[null,"2010-03-13","P6159","G30",83.87,null,null,"G30",190.43,143.09,null,-47.34,null,-0.24859528435645645]
[null,"2010-03-02","W7329","J64",30.13,null,null,"J64",129.75,98.43,null,-31.319999999999993,null,-0.24138728323699415]
[null,"2010-03-15","V9973","J78",89.81,null,null,"J78",69.25,0,null,-69.25,null,-1]
[null,"2010-03-08","P6159","G30",21.02,null,null,"L57",0,272.91000000000003,null,272.91000000000003]
[null,"2010-03-10","D6128","J64",96.18,null,"Grand Total",null,2800.72,2707.41,null,-93.309999999999945,null,-3.3316432917249832E-2]
[null,"2010-03-03","W7329","B59",40.049999999999997]
[null,"2010-03-17","D6128","G30",64.8]
[null,"2010-03-17","P6159","G30",72.94]
[null,"2010-03-20","V4541","G30",75.849999999999994]
[null,"2010-03-14","P6159","G30",40.340000000000003]
[null,"2010-03-22","D6128","G30",83.78]
[null,"2010-03-30","W7329","J78",69.25]
[null,"2010-03-14","V4541","G30",52.69]
[null,"2010-03-20","V4541","J64",71.900000000000006]
[null,"2010-03-12","V4541","J64",75.62]
[null,"2010-03-13","P6159","G30",97.87]
[null,"2010-03-18","V9973","J64",36.65]
[null,"2010-03-15","V4541","J78",26.17]
[null,"2010-03-22","D6128","L57",93.66]
[null,"2010-03-04","W7329","G30",99.9]
[null,"2010-04-02","W7329","L57",95.59]
[null,"2010-04-30","V4541","J64",74.12]
[null,"2010-04-08","D6128","J78",35.729999999999997]
[null,"2010-04-09","V9973","J78",37.24]
[null,"2010-04-14","P6159","B59",31.4]
[null,"2010-04-20","W7329","J64",30.86]
[null,"2010-04-16","W7329","B59",90.79]
[null,"2010-04-12","P6159","B59",56.09]
[null,"2010-04-04","D6128","G30",66.010000000000005]
[null,"2010-04-10","D6128","B59",63.66]
[null,"2010-04-02","W7329","B59",89.17]
[null,"2010-04-13","V4541","G30",22.37]
[null,"2010-04-16","D6128","L57",53.2]
[null,"2010-04-17","W7329","J64",44.13]
[null,"2010-04-25","W7329","L57",20.03]
[null,"2010-04-02","V4541","G30",89.52]
[null,"2010-04-17","V4541","G30",13.85]
[null,"2010-04-14","P6159","B59",70.31]
[null,"2010-04-14","V9973","J64",75.37]
[null,"2010-04-18","P6159","L57",11.84]
[null,"2010-04-22","W7329","G30",92.8]
[null,"2010-04-24","V4541","J64",42.46]
[null,"2010-04-10","V9973","J78",46.51]
[null,"2010-04-27","W7329","J64",23.44]
[null,"2010-04-08","D6128","G30",99.16]
[null,"2010-04-07","V9973","G30",18.739999999999998]
[null,"2010-04-15","P6159","G30",90.83]
[null,"2010-04-17","V4541","G30",97.76]
[null,"2010-04-18","V9973","B59",50.51]
[null,"2010-04-11","D6128","J78",45.55]
[null,"2010-04-10","V4541","B59",81.72]
[null,"2010-04-12","P6159","G30",13.44]
[null,"2010-04-15","V4541","J64",43.26]
[null,"2010-04-15","V9973","L57",88.25]
[null,"2010-04-03","P6159","G30",50.61]
[null,"2010-04-14","V9973","B59",52.59]
[null,"2010-04-18","W7329","L57",78.78]
[null,"2010-04-26","D6128","L57",12.29]
[null,"2010-04-04","W7329","L57",78.510000000000005]
[null,"2010-04-08","V4541","L57",93.9]
[null,"2010-04-30","D6128","J64",34.61]
[null,"2010-04-15","P6159","J64",72.239999999999995]
[null,"2010-04-26","D6128","J78",33.31]
[null,"2010-04-14","V4541","G30",66.61]
[null,"2010-04-06","P6159","L57",55.14]
[null,"2010-04-09","P6159","J78",82.62]
[null,"2010-04-30","W7329","G30",50.29]
[null,"2010-04-25","V4541","J78",40.200000000000003]

{"sheet":"Compare3","index":4,"n_rows":34,"n_cols":12,"rows_kept":34,"cut":false,"hidden":false,"merged":[]}
[]
[null,"DDate","Mar",null,null,"DDate","Apr"]
[null,"PivotTable4",null,null,null,"PivotTable5",null,null,null,"Table7"]
[null,"ChargeN","Resource","_ Amt",null,"ChargeN","Resource","_ Amt",null,"Amt_∆"]
[null,"D6128","B59",0,null,"D6128","B59",12.33,null,{"$f":"H5-D5","v":12.33}]
[null,null,"G30",83.68,null,null,"G30",19.190000000000001,null,-64.490000000000009]
[null,null,"J64",35.020000000000003,null,null,"J64",0,null,-35.020000000000003]
[null,null,"J78",0,null,null,"J78",144.57,null,144.57,null,"Not_a_Table"]
[null,null,"L57",176.48,null,null,"L57",287.89999999999998,null,111.41999999999999,null,"Amt_∆"]
[null,"P6159","B59",131.69,null,"P6159","B59",147.33000000000001,null,15.640000000000015,null,{"$f":"GETPIVOTDATA(\"Amt\",_5T,\"ChargeN\",INDEX(_5T,rown,1),\"Resource\",INDEX(_5T,rowd+1,2))-GETPIVOTDATA(\"Amt\",_4T,\"ChargeN\",INDEX(_4T,rown,1),\"Resource\",INDEX(_4T,rowd+1,2))","v":12.33}]
[null,null,"G30",212.62,null,null,"G30",211.61,null,-1.0099999999999909,null,-64.490000000000009]
[null,null,"J64",143.56,null,null,"J64",220.65,null,77.09,null,-35.020000000000003]
[null,null,"J78",164.71,null,null,"J78",0,null,-164.71,null,144.57]
[null,null,"L57",0,null,null,"L57",43.379999999999995,null,43.379999999999995,null,111.41999999999999]
[null,"V4541","B59",222.68,null,"V4541","B59",119.94,null,-102.74000000000001,null,15.640000000000015]
[null,null,"G30",204.64999999999998,null,null,"G30",92.48,null,-112.16999999999997,null,-1.0099999999999909]
[null,null,"J64",186.36,null,null,"J64",88.66,null,-97.700000000000017,null,77.09]
[null,null,"J78",53.44,null,null,"J78",194.02,null,140.58000000000001,null,-164.71]
[null,null,"L57",0,null,null,"L57",108.38,null,108.38,null,43.379999999999995]
[null,"V9973","B59",63.51,null,"V9973","B59",109.37,null,45.860000000000007,null,-102.74000000000001]
[null,null,"G30",95.61,null,null,"G30",0,null,-95.61,null,-112.16999999999997]
[null,null,"J64",271.43,null,null,"J64",306.48,null,35.050000000000011,null,-97.700000000000017]
[null,null,"J78",186.17000000000002,null,null,"J78",38.4,null,-147.77000000000001,null,140.58000000000001]
[null,null,"L57",13.27,null,null,"L57",92.300000000000011,null,79.030000000000015,null,108.38]
[null,"W7329","B59",94.63,null,"W7329","B59",48.81,null,-45.819999999999993,null,45.860000000000007]
[null,null,"G30",0,null,null,"G30",49.09,null,49.09,null,-95.61]
[null,null,"J64",76,null,null,"J64",84.67,null,8.6700000000000017,null,35.050000000000011]
[null,null,"J78",75.790000000000006,null,null,"J78",91.61,null,15.819999999999993,null,-147.77000000000001]
[null,null,"L57",134.56,null,null,"L57",116.73,null,-17.829999999999998,null,79.030000000000015]
[null,null,null,null,null,null,null,null,null,null,null,-45.819999999999993]
[null,null,null,null,null,null,null,null,null,null,null,49.09]
[null,null,null,null,null,null,null,null,null,null,null,8.6700000000000017]
[null,null,null,null,null,null,null,null,null,null,null,15.819999999999993]
[null,null,null,null,null,null,null,null,null,null,null,-17.829999999999998]